commons-dev mailing list archives

Site index · List index
Message view « Date » · « Thread »
Top « Date » · « Thread »
From Continuum VMBuild Server <contin...@apache.org>
Subject [continuum] BUILD FAILURE: Commons Codec
Date Mon, 03 Mar 2008 01:20:50 GMT
Online report : http://vmbuild.apache.org/continuum/buildResult.action?buildId=58652&projectId=159

Build statistics:
  State: Failed
  Previous State: Failed
  Started at: Sun 2 Mar 2008 17:18:07 -0800
  Finished at: Sun 2 Mar 2008 17:20:23 -0800
  Total time: 2m 16s
  Build Trigger: Schedule
  Build Number: 6
  Exit code: 1
  Building machine hostname: vmbuild.apache.org
  Operating system : Linux(unknown)
  Java Home version : 
          java version "1.5.0_12"
          Java(TM) 2 Runtime Environment, Standard Edition (build 1.5.0_12-b04)
          Java HotSpot(TM) Client VM (build 1.5.0_12-b04, mixed mode, sharing)
        
  Builder version :
          Maven version: 2.0.7
          Java version: 1.5.0_12
          OS name: "linux" version: "2.6.20-16-server" arch: "i386"
    
****************************************************************************
SCM Changes:
****************************************************************************
Changed: niallp @ Sun 2 Mar 2008 17:01:28 -0800
Comment: Remove redundant <resource> configuration for NOTICE/LICENSE - these are configured
in commons-parent (NOTE: seems that components which define other <resource> elements
need to include these - so only removing from components where NOTICE/LICENSE are the only
resources configured)
Files changed:
  /commons/proper/codec/trunk/pom.xml ( 632894 )
  /commons/proper/collections/trunk/pom.xml ( 632894 )
  /commons/proper/daemon/trunk/pom.xml ( 632894 )
  /commons/proper/dbutils/trunk/pom.xml ( 632894 )
  /commons/proper/discovery/trunk/pom.xml ( 632894 )
  /commons/proper/el/trunk/pom.xml ( 632894 )
  /commons/proper/jexl/trunk/pom.xml ( 632894 )
  /commons/proper/jxpath/trunk/pom.xml ( 632894 )
  /commons/proper/launcher/trunk/pom.xml ( 632894 )
  /commons/proper/net/trunk/pom.xml ( 632894 )
  /commons/proper/pool/trunk/pom.xml ( 632894 )
  /commons/proper/primitives/trunk/pom.xml ( 632894 )
  /commons/proper/proxy/trunk/pom.xml ( 632894 )
  /commons/proper/scxml/trunk/pom.xml ( 632894 )
  /commons/proper/transaction/trunk/pom.xml ( 632894 )

****************************************************************************
Dependencies Changes:
****************************************************************************
No dependencies changed


****************************************************************************
Build Defintion:
****************************************************************************
POM filename: pom.xml
Goals: clean deploy   
Arguments: --batch-mode -DaltDeploymentRepository=vmbuild.repo::default::file://localhost/home/continuum/data/commons
-Pci
Build Fresh: false
Always Build: false
Default Build Definition: true
Schedule: COMMONS_SCHEDULE
Profile Name: Java 5
Description: 


****************************************************************************
Test Summary:
****************************************************************************
Tests: 192
Failures: 1
Total time: 1575

****************************************************************************
Output:
****************************************************************************
[INFO] Scanning for projects...
[INFO] ----------------------------------------------------------------------------
[INFO] Building Commons Codec
[INFO]    task-segment: [clean, deploy]
[INFO] ----------------------------------------------------------------------------
[INFO] [clean:clean]
[INFO] Deleting directory /home/continuum/data/working-directory/159/target
[INFO] Deleting directory /home/continuum/data/working-directory/159/target/classes
[INFO] Deleting directory /home/continuum/data/working-directory/159/target/test-classes
[INFO] Deleting directory /home/continuum/data/working-directory/159/target/site
[INFO] [antrun:run {execution: javadoc.resources}]
[INFO] Executing tasks
     [copy] Copying 2 files to /home/continuum/data/working-directory/159/target/apidocs/META-INF
[INFO] Executed tasks
[INFO] [resources:resources]
[INFO] Using default encoding to copy filtered resources.
[INFO] [compiler:compile]
[INFO] Compiling 24 source files to /home/continuum/data/working-directory/159/target/classes
[INFO] [resources:testResources]
[INFO] Using default encoding to copy filtered resources.
[INFO] [compiler:testCompile]
[INFO] Compiling 17 source files to /home/continuum/data/working-directory/159/target/test-classes
[INFO] [surefire:test]
[INFO] Surefire report directory: /home/continuum/data/working-directory/159/target/surefire-reports

-------------------------------------------------------
 T E S T S
-------------------------------------------------------
Running org.apache.commons.codec.net.URLCodecTest
Tests run: 16, Failures: 0, Errors: 0, Skipped: 0, Time elapsed: 0.24 sec
Running org.apache.commons.codec.language.MetaphoneTest
Tests run: 33, Failures: 1, Errors: 0, Skipped: 0, Time elapsed: 0.161 sec <<< FAILURE!
Running org.apache.commons.codec.net.QuotedPrintableCodecTest
Tests run: 15, Failures: 0, Errors: 0, Skipped: 0, Time elapsed: 0.03 sec
Running org.apache.commons.codec.net.RFC1522CodecTest
Tests run: 2, Failures: 0, Errors: 0, Skipped: 0, Time elapsed: 0.007 sec
Running org.apache.commons.codec.net.QCodecTest
Tests run: 12, Failures: 0, Errors: 0, Skipped: 0, Time elapsed: 0.03 sec
Running org.apache.commons.codec.binary.HexTest
Tests run: 12, Failures: 0, Errors: 0, Skipped: 0, Time elapsed: 0.092 sec
Running org.apache.commons.codec.language.RefinedSoundexTest
Tests run: 6, Failures: 0, Errors: 0, Skipped: 0, Time elapsed: 0.014 sec
Running org.apache.commons.codec.binary.Base64Test
Tests run: 24, Failures: 0, Errors: 0, Skipped: 0, Time elapsed: 0.054 sec
Running org.apache.commons.codec.digest.DigestUtilsTest
Tests run: 8, Failures: 0, Errors: 0, Skipped: 0, Time elapsed: 0.688 sec
Running org.apache.commons.codec.StringEncoderComparatorTest
Tests run: 4, Failures: 0, Errors: 0, Skipped: 0, Time elapsed: 0.029 sec
Running org.apache.commons.codec.language.SoundexTest
Tests run: 25, Failures: 0, Errors: 0, Skipped: 0, Time elapsed: 0.028 sec
Running org.apache.commons.codec.language.DoubleMetaphoneTest
Tests run: 13, Failures: 0, Errors: 0, Skipped: 0, Time elapsed: 0.239 sec
Running org.apache.commons.codec.net.BCodecTest
Tests run: 9, Failures: 0, Errors: 0, Skipped: 0, Time elapsed: 0.019 sec
Running org.apache.commons.codec.binary.BinaryCodecTest
Tests run: 13, Failures: 0, Errors: 0, Skipped: 0, Time elapsed: 0.03 sec

Results :

Failed tests: 
  testWhy(org.apache.commons.codec.language.MetaphoneTest)

Tests run: 192, Failures: 1, Errors: 0, Skipped: 0

[INFO] ------------------------------------------------------------------------
[ERROR] BUILD FAILURE
[INFO] ------------------------------------------------------------------------
[INFO] There are test failures.

Please refer to /home/continuum/data/working-directory/159/target/surefire-reports for the
individual test results.
[INFO] ------------------------------------------------------------------------
[INFO] For more information, run Maven with the -e switch
[INFO] ------------------------------------------------------------------------
[INFO] Total time: 1 minute 34 seconds
[INFO] Finished at: Sun Mar 02 17:20:23 PST 2008
[INFO] Final Memory: 9M/20M
[INFO] ------------------------------------------------------------------------

****************************************************************************



---------------------------------------------------------------------
To unsubscribe, e-mail: dev-unsubscribe@commons.apache.org
For additional commands, e-mail: dev-help@commons.apache.org


Mime
View raw message