commons-dev mailing list archives

Site index · List index
Message view « Date » · « Thread »
Top « Date » · « Thread »
From Continuum VMBuild Server <contin...@apache.org>
Subject [continuum] BUILD FAILURE: Commons Logging
Date Sun, 02 Mar 2008 20:18:48 GMT
Online report : http://vmbuild.apache.org/continuum/buildResult.action?buildId=58549&projectId=168

Build statistics:
  State: Failed
  Previous State: Ok
  Started at: Sun 2 Mar 2008 12:18:05 -0800
  Finished at: Sun 2 Mar 2008 12:18:38 -0800
  Total time: 33s
  Build Trigger: Schedule
  Build Number: 33
  Exit code: 1
  Building machine hostname: vmbuild.apache.org
  Operating system : Linux(unknown)
  Java Home version : 
          java version "1.4.2_15"
          Java(TM) 2 Runtime Environment, Standard Edition (build 1.4.2_15-b02)
          Java HotSpot(TM) Client VM (build 1.4.2_15-b02, mixed mode)
        
  Builder version :
          Maven version: 2.0.7
          Java version: 1.4.2_15
          OS name: "linux" version: "2.6.20-16-server" arch: "i386"
    
****************************************************************************
SCM Changes:
****************************************************************************
Changed: niallp @ Sun 2 Mar 2008 11:37:56 -0800
Comment: Upgrade to commons-parent-8 and add configuration properties for OSGi (maven-bundle-plugin) and commons-build-plugin
Files changed:
  /commons/proper/beanutils/trunk/pom.xml ( 632815 )
  /commons/proper/betwixt/trunk/pom.xml ( 632815 )
  /commons/proper/chain/trunk/pom.xml ( 632815 )
  /commons/proper/cli/trunk/pom.xml ( 632815 )
  /commons/proper/codec/trunk/pom.xml ( 632815 )
  /commons/proper/collections/trunk/pom.xml ( 632815 )
  /commons/proper/configuration/trunk/pom.xml ( 632815 )
  /commons/proper/daemon/trunk/pom.xml ( 632815 )
  /commons/proper/dbcp/trunk/pom.xml ( 632815 )
  /commons/proper/dbutils/trunk/pom.xml ( 632815 )
  /commons/proper/digester/trunk/pom.xml ( 632815 )
  /commons/proper/discovery/trunk/pom.xml ( 632815 )
  /commons/proper/el/trunk/pom.xml ( 632815 )
  /commons/proper/email/trunk/pom.xml ( 632815 )
  /commons/proper/fileupload/trunk/pom.xml ( 632815 )
  /commons/proper/io/trunk/pom.xml ( 632815 )
  /commons/proper/jci/trunk/compilers/eclipse/pom.xml ( 632815 )
  /commons/proper/jci/trunk/compilers/groovy/pom.xml ( 632815 )
  /commons/proper/jci/trunk/compilers/janino/pom.xml ( 632815 )
  /commons/proper/jci/trunk/compilers/javac/pom.xml ( 632815 )
  /commons/proper/jci/trunk/compilers/jsr199/pom.xml ( 632815 )
  /commons/proper/jci/trunk/compilers/rhino/pom.xml ( 632815 )
  /commons/proper/jci/trunk/core/pom.xml ( 632815 )
  /commons/proper/jci/trunk/examples/pom.xml ( 632815 )
  /commons/proper/jci/trunk/fam/pom.xml ( 632815 )
  /commons/proper/jci/trunk/pom.xml ( 632815 )
  /commons/proper/jexl/trunk/pom.xml ( 632815 )
  /commons/proper/jxpath/trunk/pom.xml ( 632815 )
  /commons/proper/lang/trunk/pom.xml ( 632815 )
  /commons/proper/launcher/trunk/pom.xml ( 632815 )
  /commons/proper/logging/trunk/pom.xml ( 632815 )
  /commons/proper/math/trunk/pom.xml ( 632815 )
  /commons/proper/modeler/trunk/pom.xml ( 632815 )
  /commons/proper/net/trunk/pom.xml ( 632815 )
  /commons/proper/pool/trunk/pom.xml ( 632815 )
  /commons/proper/primitives/trunk/pom.xml ( 632815 )
  /commons/proper/proxy/trunk/pom.xml ( 632815 )
  /commons/proper/scxml/trunk/pom.xml ( 632815 )
  /commons/proper/transaction/trunk/pom.xml ( 632815 )
  /commons/proper/validator/trunk/pom.xml ( 632815 )
  /commons/proper/vfs/trunk/core/pom.xml ( 632815 )
  /commons/proper/vfs/trunk/examples/pom.xml ( 632815 )
  /commons/proper/vfs/trunk/pom.xml ( 632815 )
  /commons/proper/vfs/trunk/sandbox/pom.xml ( 632815 )

Changed: niallp @ Sun 2 Mar 2008 11:46:00 -0800
Comment: Add Issue Tracking and Download pages generated by commons-build-plugin
Files changed:
  /commons/proper/beanutils/trunk/xdocs/download_beanutils.xml ( 632817 )
  /commons/proper/beanutils/trunk/xdocs/issue-tracking.xml ( 632817 )
  /commons/proper/betwixt/trunk/xdocs/download_betwixt.xml ( 632817 )
  /commons/proper/betwixt/trunk/xdocs/issue-tracking.xml ( 632817 )
  /commons/proper/chain/trunk/xdocs/download_chain.xml ( 632817 )
  /commons/proper/chain/trunk/xdocs/issue-tracking.xml ( 632817 )
  /commons/proper/cli/trunk/xdocs/download_cli.xml ( 632817 )
  /commons/proper/cli/trunk/xdocs/issue-tracking.xml ( 632817 )
  /commons/proper/codec/trunk/xdocs/download_codec.xml ( 632817 )
  /commons/proper/codec/trunk/xdocs/issue-tracking.xml ( 632817 )
  /commons/proper/collections/trunk/xdocs/download_collections.xml ( 632817 )
  /commons/proper/collections/trunk/xdocs/issue-tracking.xml ( 632817 )
  /commons/proper/commons-parent/trunk/pom.xml ( 632817 )
  /commons/proper/configuration/trunk/xdocs/download_configuration.xml ( 632817 )
  /commons/proper/configuration/trunk/xdocs/issue-tracking.xml ( 632817 )
  /commons/proper/daemon/trunk/xdocs/download_daemon.xml ( 632817 )
  /commons/proper/daemon/trunk/xdocs/issue-tracking.xml ( 632817 )
  /commons/proper/dbcp/trunk/xdocs/download_dbcp.xml ( 632817 )
  /commons/proper/dbcp/trunk/xdocs/issue-tracking.xml ( 632817 )
  /commons/proper/dbutils/trunk/xdocs/download_dbutils.xml ( 632817 )
  /commons/proper/dbutils/trunk/xdocs/issue-tracking.xml ( 632817 )
  /commons/proper/digester/trunk/xdocs/download_digester.xml ( 632817 )
  /commons/proper/digester/trunk/xdocs/issue-tracking.xml ( 632817 )
  /commons/proper/discovery/trunk/xdocs/download_discovery.xml ( 632817 )
  /commons/proper/discovery/trunk/xdocs/issue-tracking.xml ( 632817 )
  /commons/proper/el/trunk/xdocs/download_el.xml ( 632817 )
  /commons/proper/el/trunk/xdocs/issue-tracking.xml ( 632817 )
  /commons/proper/email/trunk/xdocs/download_email.xml ( 632817 )
  /commons/proper/email/trunk/xdocs/issue-tracking.xml ( 632817 )
  /commons/proper/fileupload/trunk/xdocs/download_fileupload.xml ( 632817 )
  /commons/proper/fileupload/trunk/xdocs/issue-tracking.xml ( 632817 )
  /commons/proper/io/trunk/xdocs/download_io.xml ( 632817 )
  /commons/proper/io/trunk/xdocs/issue-tracking.xml ( 632817 )
  /commons/proper/jci/trunk/src/site/site.xml ( 632817 )
  /commons/proper/jci/trunk/src/site/xdoc/download_jci.xml ( 632817 )
  /commons/proper/jci/trunk/src/site/xdoc/issue-tracking.xml ( 632817 )
  /commons/proper/jexl/trunk/xdocs/download_jexl.xml ( 632817 )
  /commons/proper/jexl/trunk/xdocs/issue-tracking.xml ( 632817 )
  /commons/proper/jxpath/trunk/xdocs/download_jxpath.xml ( 632817 )
  /commons/proper/jxpath/trunk/xdocs/issue-tracking.xml ( 632817 )
  /commons/proper/lang/trunk/xdocs/download_lang.xml ( 632817 )
  /commons/proper/lang/trunk/xdocs/issue-tracking.xml ( 632817 )
  /commons/proper/launcher/trunk/xdocs/download_launcher.xml ( 632817 )
  /commons/proper/launcher/trunk/xdocs/issue-tracking.xml ( 632817 )
  /commons/proper/logging/trunk/src/site/site.xml ( 632817 )
  /commons/proper/logging/trunk/xdocs/download_logging.xml ( 632817 )
  /commons/proper/logging/trunk/xdocs/issue-tracking.xml ( 632817 )
  /commons/proper/math/trunk/src/site/xdoc/download_math.xml ( 632817 )
  /commons/proper/math/trunk/src/site/xdoc/issue-tracking.xml ( 632817 )
  /commons/proper/modeler/trunk/xdocs/download_modeler.xml ( 632817 )
  /commons/proper/modeler/trunk/xdocs/issue-tracking.xml ( 632817 )
  /commons/proper/net/trunk/xdocs/download_net.xml ( 632817 )
  /commons/proper/net/trunk/xdocs/issue-tracking.xml ( 632817 )
  /commons/proper/pool/trunk/xdocs/download_pool.xml ( 632817 )
  /commons/proper/pool/trunk/xdocs/issue-tracking.xml ( 632817 )
  /commons/proper/primitives/trunk/xdocs/download_primitives.xml ( 632817 )
  /commons/proper/primitives/trunk/xdocs/issue-tracking.xml ( 632817 )
  /commons/proper/proxy/trunk/src/site/site.xml ( 632817 )
  /commons/proper/proxy/trunk/src/site/xdoc/download_proxy.xml ( 632817 )
  /commons/proper/proxy/trunk/src/site/xdoc/issue-tracking.xml ( 632817 )
  /commons/proper/scxml/trunk/xdocs/download_scxml.xml ( 632817 )
  /commons/proper/scxml/trunk/xdocs/issue-tracking.xml ( 632817 )
  /commons/proper/transaction/trunk/xdocs/download_transaction.xml ( 632817 )
  /commons/proper/transaction/trunk/xdocs/issue-tracking.xml ( 632817 )
  /commons/proper/validator/trunk/xdocs/download_validator.xml ( 632817 )
  /commons/proper/validator/trunk/xdocs/issue-tracking.xml ( 632817 )
  /commons/proper/vfs/trunk/xdocs/download_vfs.xml ( 632817 )
  /commons/proper/vfs/trunk/xdocs/issue-tracking.xml ( 632817 )

****************************************************************************
Dependencies Changes:
****************************************************************************
No dependencies changed


****************************************************************************
Build Defintion:
****************************************************************************
POM filename: pom.xml
Goals: clean deploy   
Arguments: --batch-mode -DaltDeploymentRepository=vmbuild.repo::default::file://localhost/home/continuum/data/commons -Pci
Build Fresh: false
Always Build: false
Default Build Definition: true
Schedule: COMMONS_SCHEDULE
Profile Name: Java 1.4
Description: 


****************************************************************************
Test Summary:
****************************************************************************
Tests: 14
Failures: 0
Total time: 385

****************************************************************************
Output:
****************************************************************************
[INFO] Scanning for projects...
[INFO] ----------------------------------------------------------------------------
[INFO] Building Commons Logging
[INFO]    task-segment: [clean, deploy]
[INFO] ----------------------------------------------------------------------------
[INFO] [clean:clean]
[INFO] Deleting directory /home/continuum/data/working-directory/168/target
[INFO] Deleting directory /home/continuum/data/working-directory/168/target/classes
[INFO] Deleting directory /home/continuum/data/working-directory/168/target/test-classes
[INFO] Deleting directory /home/continuum/data/working-directory/168/target/site
[INFO] [antrun:run {execution: javadoc.resources}]
[INFO] Executing tasks
     [copy] Copying 2 files to /home/continuum/data/working-directory/168/target/apidocs/META-INF
[INFO] Executed tasks
[INFO] [resources:resources]
[INFO] Using default encoding to copy filtered resources.
[INFO] [compiler:compile]
[INFO] Compiling 14 source files to /home/continuum/data/working-directory/168/target/classes
[INFO] [resources:testResources]
[INFO] Using default encoding to copy filtered resources.
[INFO] [compiler:testCompile]
[INFO] Compiling 51 source files to /home/continuum/data/working-directory/168/target/test-classes
[INFO] [surefire:test]
[INFO] Surefire report directory: /home/continuum/data/working-directory/168/target/surefire-reports

-------------------------------------------------------
 T E S T S
-------------------------------------------------------
Running org.apache.commons.logging.avalon.AvalonLoggerTestCase
[DEBUG] null
[DEBUG] null
[DEBUG] org.apache.commons.logging.impl.AvalonLogger: debug statement
[DEBUG] org.apache.commons.logging.impl.AvalonLogger: debug statement w/ null exception
java.lang.RuntimeException
	at org.apache.commons.logging.AbstractLogTest.testLoggingWithNullParameters(AbstractLogTest.java:49)
	at sun.reflect.NativeMethodAccessorImpl.invoke0(Native Method)
	at sun.reflect.NativeMethodAccessorImpl.invoke(NativeMethodAccessorImpl.java:39)
	at sun.reflect.DelegatingMethodAccessorImpl.invoke(DelegatingMethodAccessorImpl.java:25)
	at java.lang.reflect.Method.invoke(Method.java:324)
	at junit.framework.TestCase.runTest(TestCase.java:154)
	at junit.framework.TestCase.runBare(TestCase.java:127)
	at junit.framework.TestResult$1.protect(TestResult.java:106)
	at junit.framework.TestResult.runProtected(TestResult.java:124)
	at junit.framework.TestResult.run(TestResult.java:109)
	at junit.framework.TestCase.run(TestCase.java:118)
	at junit.framework.TestSuite.runTest(TestSuite.java:208)
	at junit.framework.TestSuite.run(TestSuite.java:203)
	at junit.framework.TestSuite.runTest(TestSuite.java:208)
	at junit.framework.TestSuite.run(TestSuite.java:203)
	at sun.reflect.NativeMethodAccessorImpl.invoke0(Native Method)
	at sun.reflect.NativeMethodAccessorImpl.invoke(NativeMethodAccessorImpl.java:39)
	at sun.reflect.DelegatingMethodAccessorImpl.invoke(DelegatingMethodAccessorImpl.java:25)
	at java.lang.reflect.Method.invoke(Method.java:324)
	at org.apache.maven.surefire.junit.JUnitTestSet.execute(JUnitTestSet.java:213)
	at org.apache.maven.surefire.suite.AbstractDirectoryTestSuite.executeTestSet(AbstractDirectoryTestSuite.java:140)
	at org.apache.maven.surefire.suite.AbstractDirectoryTestSuite.execute(AbstractDirectoryTestSuite.java:127)
	at org.apache.maven.surefire.Surefire.run(Surefire.java:177)
	at sun.reflect.NativeMethodAccessorImpl.invoke0(Native Method)
	at sun.reflect.NativeMethodAccessorImpl.invoke(NativeMethodAccessorImpl.java:39)
	at sun.reflect.DelegatingMethodAccessorImpl.invoke(DelegatingMethodAccessorImpl.java:25)
	at java.lang.reflect.Method.invoke(Method.java:324)
	at org.apache.maven.surefire.booter.SurefireBooter.runSuitesInProcess(SurefireBooter.java:338)
	at org.apache.maven.surefire.booter.SurefireBooter.main(SurefireBooter.java:997)
[ERROR] null
[ERROR] null
[ERROR] org.apache.commons.logging.impl.AvalonLogger: error statement
[ERROR] org.apache.commons.logging.impl.AvalonLogger: error statement w/ null exception
java.lang.RuntimeException
	at org.apache.commons.logging.AbstractLogTest.testLoggingWithNullParameters(AbstractLogTest.java:58)
	at sun.reflect.NativeMethodAccessorImpl.invoke0(Native Method)
	at sun.reflect.NativeMethodAccessorImpl.invoke(NativeMethodAccessorImpl.java:39)
	at sun.reflect.DelegatingMethodAccessorImpl.invoke(DelegatingMethodAccessorImpl.java:25)
	at java.lang.reflect.Method.invoke(Method.java:324)
	at junit.framework.TestCase.runTest(TestCase.java:154)
	at junit.framework.TestCase.runBare(TestCase.java:127)
	at junit.framework.TestResult$1.protect(TestResult.java:106)
	at junit.framework.TestResult.runProtected(TestResult.java:124)
	at junit.framework.TestResult.run(TestResult.java:109)
	at junit.framework.TestCase.run(TestCase.java:118)
	at junit.framework.TestSuite.runTest(TestSuite.java:208)
	at junit.framework.TestSuite.run(TestSuite.java:203)
	at junit.framework.TestSuite.runTest(TestSuite.java:208)
	at junit.framework.TestSuite.run(TestSuite.java:203)
	at sun.reflect.NativeMethodAccessorImpl.invoke0(Native Method)
	at sun.reflect.NativeMethodAccessorImpl.invoke(NativeMethodAccessorImpl.java:39)
	at sun.reflect.DelegatingMethodAccessorImpl.invoke(DelegatingMethodAccessorImpl.java:25)
	at java.lang.reflect.Method.invoke(Method.java:324)
	at org.apache.maven.surefire.junit.JUnitTestSet.execute(JUnitTestSet.java:213)
	at org.apache.maven.surefire.suite.AbstractDirectoryTestSuite.executeTestSet(AbstractDirectoryTestSuite.java:140)
	at org.apache.maven.surefire.suite.AbstractDirectoryTestSuite.execute(AbstractDirectoryTestSuite.java:127)
	at org.apache.maven.surefire.Surefire.run(Surefire.java:177)
	at sun.reflect.NativeMethodAccessorImpl.invoke0(Native Method)
	at sun.reflect.NativeMethodAccessorImpl.invoke(NativeMethodAccessorImpl.java:39)
	at sun.reflect.DelegatingMethodAccessorImpl.invoke(DelegatingMethodAccessorImpl.java:25)
	at java.lang.reflect.Method.invoke(Method.java:324)
	at org.apache.maven.surefire.booter.SurefireBooter.runSuitesInProcess(SurefireBooter.java:338)
	at org.apache.maven.surefire.booter.SurefireBooter.main(SurefireBooter.java:997)
[FATAL ERROR] null
[FATAL ERROR] null
[FATAL ERROR] org.apache.commons.logging.impl.AvalonLogger: fatal statement
[FATAL ERROR] org.apache.commons.logging.impl.AvalonLogger: fatal statement w/ null exception
java.lang.RuntimeException
	at org.apache.commons.logging.AbstractLogTest.testLoggingWithNullParameters(AbstractLogTest.java:67)
	at sun.reflect.NativeMethodAccessorImpl.invoke0(Native Method)
	at sun.reflect.NativeMethodAccessorImpl.invoke(NativeMethodAccessorImpl.java:39)
	at sun.reflect.DelegatingMethodAccessorImpl.invoke(DelegatingMethodAccessorImpl.java:25)
	at java.lang.reflect.Method.invoke(Method.java:324)
	at junit.framework.TestCase.runTest(TestCase.java:154)
	at junit.framework.TestCase.runBare(TestCase.java:127)
	at junit.framework.TestResult$1.protect(TestResult.java:106)
	at junit.framework.TestResult.runProtected(TestResult.java:124)
	at junit.framework.TestResult.run(TestResult.java:109)
	at junit.framework.TestCase.run(TestCase.java:118)
	at junit.framework.TestSuite.runTest(TestSuite.java:208)
	at junit.framework.TestSuite.run(TestSuite.java:203)
	at junit.framework.TestSuite.runTest(TestSuite.java:208)
	at junit.framework.TestSuite.run(TestSuite.java:203)
	at sun.reflect.NativeMethodAccessorImpl.invoke0(Native Method)
	at sun.reflect.NativeMethodAccessorImpl.invoke(NativeMethodAccessorImpl.java:39)
	at sun.reflect.DelegatingMethodAccessorImpl.invoke(DelegatingMethodAccessorImpl.java:25)
	at java.lang.reflect.Method.invoke(Method.java:324)
	at org.apache.maven.surefire.junit.JUnitTestSet.execute(JUnitTestSet.java:213)
	at org.apache.maven.surefire.suite.AbstractDirectoryTestSuite.executeTestSet(AbstractDirectoryTestSuite.java:140)
	at org.apache.maven.surefire.suite.AbstractDirectoryTestSuite.execute(AbstractDirectoryTestSuite.java:127)
	at org.apache.maven.surefire.Surefire.run(Surefire.java:177)
	at sun.reflect.NativeMethodAccessorImpl.invoke0(Native Method)
	at sun.reflect.NativeMethodAccessorImpl.invoke(NativeMethodAccessorImpl.java:39)
	at sun.reflect.DelegatingMethodAccessorImpl.invoke(DelegatingMethodAccessorImpl.java:25)
	at java.lang.reflect.Method.invoke(Method.java:324)
	at org.apache.maven.surefire.booter.SurefireBooter.runSuitesInProcess(SurefireBooter.java:338)
	at org.apache.maven.surefire.booter.SurefireBooter.main(SurefireBooter.java:997)
[INFO] null
[INFO] null
[INFO] org.apache.commons.logging.impl.AvalonLogger: info statement
[INFO] org.apache.commons.logging.impl.AvalonLogger: info statement w/ null exception
java.lang.RuntimeException
	at org.apache.commons.logging.AbstractLogTest.testLoggingWithNullParameters(AbstractLogTest.java:76)
	at sun.reflect.NativeMethodAccessorImpl.invoke0(Native Method)
	at sun.reflect.NativeMethodAccessorImpl.invoke(NativeMethodAccessorImpl.java:39)
	at sun.reflect.DelegatingMethodAccessorImpl.invoke(DelegatingMethodAccessorImpl.java:25)
	at java.lang.reflect.Method.invoke(Method.java:324)
	at junit.framework.TestCase.runTest(TestCase.java:154)
	at junit.framework.TestCase.runBare(TestCase.java:127)
	at junit.framework.TestResult$1.protect(TestResult.java:106)
	at junit.framework.TestResult.runProtected(TestResult.java:124)
	at junit.framework.TestResult.run(TestResult.java:109)
	at junit.framework.TestCase.run(TestCase.java:118)
	at junit.framework.TestSuite.runTest(TestSuite.java:208)
	at junit.framework.TestSuite.run(TestSuite.java:203)
	at junit.framework.TestSuite.runTest(TestSuite.java:208)
	at junit.framework.TestSuite.run(TestSuite.java:203)
	at sun.reflect.NativeMethodAccessorImpl.invoke0(Native Method)
	at sun.reflect.NativeMethodAccessorImpl.invoke(NativeMethodAccessorImpl.java:39)
	at sun.reflect.DelegatingMethodAccessorImpl.invoke(DelegatingMethodAccessorImpl.java:25)
	at java.lang.reflect.Method.invoke(Method.java:324)
	at org.apache.maven.surefire.junit.JUnitTestSet.execute(JUnitTestSet.java:213)
	at org.apache.maven.surefire.suite.AbstractDirectoryTestSuite.executeTestSet(AbstractDirectoryTestSuite.java:140)
	at org.apache.maven.surefire.suite.AbstractDirectoryTestSuite.execute(AbstractDirectoryTestSuite.java:127)
	at org.apache.maven.surefire.Surefire.run(Surefire.java:177)
	at sun.reflect.NativeMethodAccessorImpl.invoke0(Native Method)
	at sun.reflect.NativeMethodAccessorImpl.invoke(NativeMethodAccessorImpl.java:39)
	at sun.reflect.DelegatingMethodAccessorImpl.invoke(DelegatingMethodAccessorImpl.java:25)
	at java.lang.reflect.Method.invoke(Method.java:324)
	at org.apache.maven.surefire.booter.SurefireBooter.runSuitesInProcess(SurefireBooter.java:338)
	at org.apache.maven.surefire.booter.SurefireBooter.main(SurefireBooter.java:997)
[DEBUG] null
[DEBUG] null
[DEBUG] org.apache.commons.logging.impl.AvalonLogger: trace statement
[DEBUG] org.apache.commons.logging.impl.AvalonLogger: trace statement w/ null exception
java.lang.RuntimeException
	at org.apache.commons.logging.AbstractLogTest.testLoggingWithNullParameters(AbstractLogTest.java:85)
	at sun.reflect.NativeMethodAccessorImpl.invoke0(Native Method)
	at sun.reflect.NativeMethodAccessorImpl.invoke(NativeMethodAccessorImpl.java:39)
	at sun.reflect.DelegatingMethodAccessorImpl.invoke(DelegatingMethodAccessorImpl.java:25)
	at java.lang.reflect.Method.invoke(Method.java:324)
	at junit.framework.TestCase.runTest(TestCase.java:154)
	at junit.framework.TestCase.runBare(TestCase.java:127)
	at junit.framework.TestResult$1.protect(TestResult.java:106)
	at junit.framework.TestResult.runProtected(TestResult.java:124)
	at junit.framework.TestResult.run(TestResult.java:109)
	at junit.framework.TestCase.run(TestCase.java:118)
	at junit.framework.TestSuite.runTest(TestSuite.java:208)
	at junit.framework.TestSuite.run(TestSuite.java:203)
	at junit.framework.TestSuite.runTest(TestSuite.java:208)
	at junit.framework.TestSuite.run(TestSuite.java:203)
	at sun.reflect.NativeMethodAccessorImpl.invoke0(Native Method)
	at sun.reflect.NativeMethodAccessorImpl.invoke(NativeMethodAccessorImpl.java:39)
	at sun.reflect.DelegatingMethodAccessorImpl.invoke(DelegatingMethodAccessorImpl.java:25)
	at java.lang.reflect.Method.invoke(Method.java:324)
	at org.apache.maven.surefire.junit.JUnitTestSet.execute(JUnitTestSet.java:213)
	at org.apache.maven.surefire.suite.AbstractDirectoryTestSuite.executeTestSet(AbstractDirectoryTestSuite.java:140)
	at org.apache.maven.surefire.suite.AbstractDirectoryTestSuite.execute(AbstractDirectoryTestSuite.java:127)
	at org.apache.maven.surefire.Surefire.run(Surefire.java:177)
	at sun.reflect.NativeMethodAccessorImpl.invoke0(Native Method)
	at sun.reflect.NativeMethodAccessorImpl.invoke(NativeMethodAccessorImpl.java:39)
	at sun.reflect.DelegatingMethodAccessorImpl.invoke(DelegatingMethodAccessorImpl.java:25)
	at java.lang.reflect.Method.invoke(Method.java:324)
	at org.apache.maven.surefire.booter.SurefireBooter.runSuitesInProcess(SurefireBooter.java:338)
	at org.apache.maven.surefire.booter.SurefireBooter.main(SurefireBooter.java:997)
[WARNING] null
[WARNING] null
[WARNING] org.apache.commons.logging.impl.AvalonLogger: warn statement
[WARNING] org.apache.commons.logging.impl.AvalonLogger: warn statement w/ null exception
java.lang.RuntimeException
	at org.apache.commons.logging.AbstractLogTest.testLoggingWithNullParameters(AbstractLogTest.java:94)
	at sun.reflect.NativeMethodAccessorImpl.invoke0(Native Method)
	at sun.reflect.NativeMethodAccessorImpl.invoke(NativeMethodAccessorImpl.java:39)
	at sun.reflect.DelegatingMethodAccessorImpl.invoke(DelegatingMethodAccessorImpl.java:25)
	at java.lang.reflect.Method.invoke(Method.java:324)
	at junit.framework.TestCase.runTest(TestCase.java:154)
	at junit.framework.TestCase.runBare(TestCase.java:127)
	at junit.framework.TestResult$1.protect(TestResult.java:106)
	at junit.framework.TestResult.runProtected(TestResult.java:124)
	at junit.framework.TestResult.run(TestResult.java:109)
	at junit.framework.TestCase.run(TestCase.java:118)
	at junit.framework.TestSuite.runTest(TestSuite.java:208)
	at junit.framework.TestSuite.run(TestSuite.java:203)
	at junit.framework.TestSuite.runTest(TestSuite.java:208)
	at junit.framework.TestSuite.run(TestSuite.java:203)
	at sun.reflect.NativeMethodAccessorImpl.invoke0(Native Method)
	at sun.reflect.NativeMethodAccessorImpl.invoke(NativeMethodAccessorImpl.java:39)
	at sun.reflect.DelegatingMethodAccessorImpl.invoke(DelegatingMethodAccessorImpl.java:25)
	at java.lang.reflect.Method.invoke(Method.java:324)
	at org.apache.maven.surefire.junit.JUnitTestSet.execute(JUnitTestSet.java:213)
	at org.apache.maven.surefire.suite.AbstractDirectoryTestSuite.executeTestSet(AbstractDirectoryTestSuite.java:140)
	at org.apache.maven.surefire.suite.AbstractDirectoryTestSuite.execute(AbstractDirectoryTestSuite.java:127)
	at org.apache.maven.surefire.Surefire.run(Surefire.java:177)
	at sun.reflect.NativeMethodAccessorImpl.invoke0(Native Method)
	at sun.reflect.NativeMethodAccessorImpl.invoke(NativeMethodAccessorImpl.java:39)
	at sun.reflect.DelegatingMethodAccessorImpl.invoke(DelegatingMethodAccessorImpl.java:25)
	at java.lang.reflect.Method.invoke(Method.java:324)
	at org.apache.maven.surefire.booter.SurefireBooter.runSuitesInProcess(SurefireBooter.java:338)
	at org.apache.maven.surefire.booter.SurefireBooter.main(SurefireBooter.java:997)
Tests run: 1, Failures: 0, Errors: 0, Skipped: 0, Time elapsed: 0.133 sec

Results :

Tests run: 1, Failures: 0, Errors: 0, Skipped: 0

[INFO] [jar:jar]
[INFO] Building jar: /home/continuum/data/working-directory/168/target/commons-logging-1.1.2-SNAPSHOT.jar
[INFO] [jar:test-jar {execution: testjar}]
[INFO] Building jar: /home/continuum/data/working-directory/168/target/commons-logging-tests.jar
[INFO] [antrun:run {execution: apijar}]
[INFO] Executing tasks
    [mkdir] Created dir: /home/continuum/data/working-directory/168/target/rejar
    [unjar] Expanding: /home/continuum/data/working-directory/168/target/commons-logging-1.1.2-SNAPSHOT.jar into /home/continuum/data/working-directory/168/target/rejar
      [jar] Building jar: /home/continuum/data/working-directory/168/target/commons-logging-api-1.1.2-SNAPSHOT.jar
[INFO] Executed tasks
[INFO] [antrun:run {execution: adaptersjar}]
[INFO] Executing tasks
   [delete] Deleting directory /home/continuum/data/working-directory/168/target/rejar
    [mkdir] Created dir: /home/continuum/data/working-directory/168/target/rejar
    [unjar] Expanding: /home/continuum/data/working-directory/168/target/commons-logging-1.1.2-SNAPSHOT.jar into /home/continuum/data/working-directory/168/target/rejar
      [jar] Building jar: /home/continuum/data/working-directory/168/target/commons-logging-adapters-1.1.2-SNAPSHOT.jar
[INFO] Executed tasks
[INFO] [build-helper:attach-artifact {execution: attach-artifacts}]
[INFO] [surefire:test {execution: integration-test}]
[INFO] Surefire report directory: /home/continuum/data/working-directory/168/target/surefire-reports

-------------------------------------------------------
 T E S T S
-------------------------------------------------------
Running org.apache.commons.logging.pathable.GeneralTestCase
Tests run: 4, Failures: 0, Errors: 0, Skipped: 0, Time elapsed: 0.069 sec
Running org.apache.commons.logging.AltHashtableTestCase
Tests run: 2, Failures: 0, Errors: 0, Skipped: 0, Time elapsed: 0.052 sec
Running org.apache.commons.logging.config.PriorityConfigTestCase
Tests run: 1, Failures: 0, Errors: 0, Skipped: 0, Time elapsed: 0.052 sec
Running org.apache.commons.logging.simple.CustomConfigTestCase
[DEBUG] DecoratedLogger - debug <org.apache.commons.logging.DummyException>org.apache.commons.logging.DummyException
	at org.apache.commons.logging.simple.CustomConfigTestCase.logExceptionMessages(CustomConfigTestCase.java:238)
	at org.apache.commons.logging.simple.CustomConfigTestCase.testExceptionMessages(CustomConfigTestCase.java:137)
	at sun.reflect.NativeMethodAccessorImpl.invoke0(Native Method)
	at sun.reflect.NativeMethodAccessorImpl.invoke(NativeMethodAccessorImpl.java:39)
	at sun.reflect.DelegatingMethodAccessorImpl.invoke(DelegatingMethodAccessorImpl.java:25)
	at java.lang.reflect.Method.invoke(Method.java:324)
	at junit.framework.TestCase.runTest(TestCase.java:154)
	at junit.framework.TestCase.runBare(TestCase.java:127)
	at junit.framework.TestResult$1.protect(TestResult.java:106)
	at junit.framework.TestResult.runProtected(TestResult.java:124)
	at junit.framework.TestResult.run(TestResult.java:109)
	at junit.framework.TestCase.run(TestCase.java:118)
	at org.apache.commons.logging.PathableTestSuite.runTest(PathableTestSuite.java:142)
	at junit.framework.TestSuite.run(TestSuite.java:203)
	at sun.reflect.NativeMethodAccessorImpl.invoke0(Native Method)
	at sun.reflect.NativeMethodAccessorImpl.invoke(NativeMethodAccessorImpl.java:39)
	at sun.reflect.DelegatingMethodAccessorImpl.invoke(DelegatingMethodAccessorImpl.java:25)
	at java.lang.reflect.Method.invoke(Method.java:324)
	at org.apache.maven.surefire.junit.JUnitTestSet.execute(JUnitTestSet.java:213)
	at org.apache.maven.surefire.suite.AbstractDirectoryTestSuite.executeTestSet(AbstractDirectoryTestSuite.java:140)
	at org.apache.maven.surefire.suite.AbstractDirectoryTestSuite.execute(AbstractDirectoryTestSuite.java:127)
	at org.apache.maven.surefire.Surefire.run(Surefire.java:177)
	at sun.reflect.NativeMethodAccessorImpl.invoke0(Native Method)
	at sun.reflect.NativeMethodAccessorImpl.invoke(NativeMethodAccessorImpl.java:39)
	at sun.reflect.DelegatingMethodAccessorImpl.invoke(DelegatingMethodAccessorImpl.java:25)
	at java.lang.reflect.Method.invoke(Method.java:324)
	at org.apache.maven.surefire.booter.SurefireBooter.runSuitesInProcess(SurefireBooter.java:338)
	at org.apache.maven.surefire.booter.SurefireBooter.main(SurefireBooter.java:997)

[INFO] DecoratedLogger - info <org.apache.commons.logging.DummyException>org.apache.commons.logging.DummyException
	at org.apache.commons.logging.simple.CustomConfigTestCase.logExceptionMessages(CustomConfigTestCase.java:238)
	at org.apache.commons.logging.simple.CustomConfigTestCase.testExceptionMessages(CustomConfigTestCase.java:137)
	at sun.reflect.NativeMethodAccessorImpl.invoke0(Native Method)
	at sun.reflect.NativeMethodAccessorImpl.invoke(NativeMethodAccessorImpl.java:39)
	at sun.reflect.DelegatingMethodAccessorImpl.invoke(DelegatingMethodAccessorImpl.java:25)
	at java.lang.reflect.Method.invoke(Method.java:324)
	at junit.framework.TestCase.runTest(TestCase.java:154)
	at junit.framework.TestCase.runBare(TestCase.java:127)
	at junit.framework.TestResult$1.protect(TestResult.java:106)
	at junit.framework.TestResult.runProtected(TestResult.java:124)
	at junit.framework.TestResult.run(TestResult.java:109)
	at junit.framework.TestCase.run(TestCase.java:118)
	at org.apache.commons.logging.PathableTestSuite.runTest(PathableTestSuite.java:142)
	at junit.framework.TestSuite.run(TestSuite.java:203)
	at sun.reflect.NativeMethodAccessorImpl.invoke0(Native Method)
	at sun.reflect.NativeMethodAccessorImpl.invoke(NativeMethodAccessorImpl.java:39)
	at sun.reflect.DelegatingMethodAccessorImpl.invoke(DelegatingMethodAccessorImpl.java:25)
	at java.lang.reflect.Method.invoke(Method.java:324)
	at org.apache.maven.surefire.junit.JUnitTestSet.execute(JUnitTestSet.java:213)
	at org.apache.maven.surefire.suite.AbstractDirectoryTestSuite.executeTestSet(AbstractDirectoryTestSuite.java:140)
	at org.apache.maven.surefire.suite.AbstractDirectoryTestSuite.execute(AbstractDirectoryTestSuite.java:127)
	at org.apache.maven.surefire.Surefire.run(Surefire.java:177)
	at sun.reflect.NativeMethodAccessorImpl.invoke0(Native Method)
	at sun.reflect.NativeMethodAccessorImpl.invoke(NativeMethodAccessorImpl.java:39)
	at sun.reflect.DelegatingMethodAccessorImpl.invoke(DelegatingMethodAccessorImpl.java:25)
	at java.lang.reflect.Method.invoke(Method.java:324)
	at org.apache.maven.surefire.booter.SurefireBooter.runSuitesInProcess(SurefireBooter.java:338)
	at org.apache.maven.surefire.booter.SurefireBooter.main(SurefireBooter.java:997)

[WARN] DecoratedLogger - warn <org.apache.commons.logging.DummyException>org.apache.commons.logging.DummyException
	at org.apache.commons.logging.simple.CustomConfigTestCase.logExceptionMessages(CustomConfigTestCase.java:238)
	at org.apache.commons.logging.simple.CustomConfigTestCase.testExceptionMessages(CustomConfigTestCase.java:137)
	at sun.reflect.NativeMethodAccessorImpl.invoke0(Native Method)
	at sun.reflect.NativeMethodAccessorImpl.invoke(NativeMethodAccessorImpl.java:39)
	at sun.reflect.DelegatingMethodAccessorImpl.invoke(DelegatingMethodAccessorImpl.java:25)
	at java.lang.reflect.Method.invoke(Method.java:324)
	at junit.framework.TestCase.runTest(TestCase.java:154)
	at junit.framework.TestCase.runBare(TestCase.java:127)
	at junit.framework.TestResult$1.protect(TestResult.java:106)
	at junit.framework.TestResult.runProtected(TestResult.java:124)
	at junit.framework.TestResult.run(TestResult.java:109)
	at junit.framework.TestCase.run(TestCase.java:118)
	at org.apache.commons.logging.PathableTestSuite.runTest(PathableTestSuite.java:142)
	at junit.framework.TestSuite.run(TestSuite.java:203)
	at sun.reflect.NativeMethodAccessorImpl.invoke0(Native Method)
	at sun.reflect.NativeMethodAccessorImpl.invoke(NativeMethodAccessorImpl.java:39)
	at sun.reflect.DelegatingMethodAccessorImpl.invoke(DelegatingMethodAccessorImpl.java:25)
	at java.lang.reflect.Method.invoke(Method.java:324)
	at org.apache.maven.surefire.junit.JUnitTestSet.execute(JUnitTestSet.java:213)
	at org.apache.maven.surefire.suite.AbstractDirectoryTestSuite.executeTestSet(AbstractDirectoryTestSuite.java:140)
	at org.apache.maven.surefire.suite.AbstractDirectoryTestSuite.execute(AbstractDirectoryTestSuite.java:127)
	at org.apache.maven.surefire.Surefire.run(Surefire.java:177)
	at sun.reflect.NativeMethodAccessorImpl.invoke0(Native Method)
	at sun.reflect.NativeMethodAccessorImpl.invoke(NativeMethodAccessorImpl.java:39)
	at sun.reflect.DelegatingMethodAccessorImpl.invoke(DelegatingMethodAccessorImpl.java:25)
	at java.lang.reflect.Method.invoke(Method.java:324)
	at org.apache.maven.surefire.booter.SurefireBooter.runSuitesInProcess(SurefireBooter.java:338)
	at org.apache.maven.surefire.booter.SurefireBooter.main(SurefireBooter.java:997)

[ERROR] DecoratedLogger - error <org.apache.commons.logging.DummyException>org.apache.commons.logging.DummyException
	at org.apache.commons.logging.simple.CustomConfigTestCase.logExceptionMessages(CustomConfigTestCase.java:238)
	at org.apache.commons.logging.simple.CustomConfigTestCase.testExceptionMessages(CustomConfigTestCase.java:137)
	at sun.reflect.NativeMethodAccessorImpl.invoke0(Native Method)
	at sun.reflect.NativeMethodAccessorImpl.invoke(NativeMethodAccessorImpl.java:39)
	at sun.reflect.DelegatingMethodAccessorImpl.invoke(DelegatingMethodAccessorImpl.java:25)
	at java.lang.reflect.Method.invoke(Method.java:324)
	at junit.framework.TestCase.runTest(TestCase.java:154)
	at junit.framework.TestCase.runBare(TestCase.java:127)
	at junit.framework.TestResult$1.protect(TestResult.java:106)
	at junit.framework.TestResult.runProtected(TestResult.java:124)
	at junit.framework.TestResult.run(TestResult.java:109)
	at junit.framework.TestCase.run(TestCase.java:118)
	at org.apache.commons.logging.PathableTestSuite.runTest(PathableTestSuite.java:142)
	at junit.framework.TestSuite.run(TestSuite.java:203)
	at sun.reflect.NativeMethodAccessorImpl.invoke0(Native Method)
	at sun.reflect.NativeMethodAccessorImpl.invoke(NativeMethodAccessorImpl.java:39)
	at sun.reflect.DelegatingMethodAccessorImpl.invoke(DelegatingMethodAccessorImpl.java:25)
	at java.lang.reflect.Method.invoke(Method.java:324)
	at org.apache.maven.surefire.junit.JUnitTestSet.execute(JUnitTestSet.java:213)
	at org.apache.maven.surefire.suite.AbstractDirectoryTestSuite.executeTestSet(AbstractDirectoryTestSuite.java:140)
	at org.apache.maven.surefire.suite.AbstractDirectoryTestSuite.execute(AbstractDirectoryTestSuite.java:127)
	at org.apache.maven.surefire.Surefire.run(Surefire.java:177)
	at sun.reflect.NativeMethodAccessorImpl.invoke0(Native Method)
	at sun.reflect.NativeMethodAccessorImpl.invoke(NativeMethodAccessorImpl.java:39)
	at sun.reflect.DelegatingMethodAccessorImpl.invoke(DelegatingMethodAccessorImpl.java:25)
	at java.lang.reflect.Method.invoke(Method.java:324)
	at org.apache.maven.surefire.booter.SurefireBooter.runSuitesInProcess(SurefireBooter.java:338)
	at org.apache.maven.surefire.booter.SurefireBooter.main(SurefireBooter.java:997)

[FATAL] DecoratedLogger - fatal <org.apache.commons.logging.DummyException>org.apache.commons.logging.DummyException
	at org.apache.commons.logging.simple.CustomConfigTestCase.logExceptionMessages(CustomConfigTestCase.java:238)
	at org.apache.commons.logging.simple.CustomConfigTestCase.testExceptionMessages(CustomConfigTestCase.java:137)
	at sun.reflect.NativeMethodAccessorImpl.invoke0(Native Method)
	at sun.reflect.NativeMethodAccessorImpl.invoke(NativeMethodAccessorImpl.java:39)
	at sun.reflect.DelegatingMethodAccessorImpl.invoke(DelegatingMethodAccessorImpl.java:25)
	at java.lang.reflect.Method.invoke(Method.java:324)
	at junit.framework.TestCase.runTest(TestCase.java:154)
	at junit.framework.TestCase.runBare(TestCase.java:127)
	at junit.framework.TestResult$1.protect(TestResult.java:106)
	at junit.framework.TestResult.runProtected(TestResult.java:124)
	at junit.framework.TestResult.run(TestResult.java:109)
	at junit.framework.TestCase.run(TestCase.java:118)
	at org.apache.commons.logging.PathableTestSuite.runTest(PathableTestSuite.java:142)
	at junit.framework.TestSuite.run(TestSuite.java:203)
	at sun.reflect.NativeMethodAccessorImpl.invoke0(Native Method)
	at sun.reflect.NativeMethodAccessorImpl.invoke(NativeMethodAccessorImpl.java:39)
	at sun.reflect.DelegatingMethodAccessorImpl.invoke(DelegatingMethodAccessorImpl.java:25)
	at java.lang.reflect.Method.invoke(Method.java:324)
	at org.apache.maven.surefire.junit.JUnitTestSet.execute(JUnitTestSet.java:213)
	at org.apache.maven.surefire.suite.AbstractDirectoryTestSuite.executeTestSet(AbstractDirectoryTestSuite.java:140)
	at org.apache.maven.surefire.suite.AbstractDirectoryTestSuite.execute(AbstractDirectoryTestSuite.java:127)
	at org.apache.maven.surefire.Surefire.run(Surefire.java:177)
	at sun.reflect.NativeMethodAccessorImpl.invoke0(Native Method)
	at sun.reflect.NativeMethodAccessorImpl.invoke(NativeMethodAccessorImpl.java:39)
	at sun.reflect.DelegatingMethodAccessorImpl.invoke(DelegatingMethodAccessorImpl.java:25)
	at java.lang.reflect.Method.invoke(Method.java:324)
	at org.apache.maven.surefire.booter.SurefireBooter.runSuitesInProcess(SurefireBooter.java:338)
	at org.apache.maven.surefire.booter.SurefireBooter.main(SurefireBooter.java:997)

[DEBUG] DecoratedLogger - debug
[INFO] DecoratedLogger - info
[WARN] DecoratedLogger - warn
[ERROR] DecoratedLogger - error
[FATAL] DecoratedLogger - fatal
[DEBUG] DecoratedLogger - debug
[INFO] DecoratedLogger - info
[WARN] DecoratedLogger - warn
[ERROR] DecoratedLogger - error
[FATAL] DecoratedLogger - fatal
[DEBUG] DecoratedLogger - debug <org.apache.commons.logging.DummyException>org.apache.commons.logging.DummyException
	at org.apache.commons.logging.simple.CustomConfigTestCase.logExceptionMessages(CustomConfigTestCase.java:238)
	at org.apache.commons.logging.simple.CustomConfigTestCase.testSerializable(CustomConfigTestCase.java:159)
	at sun.reflect.NativeMethodAccessorImpl.invoke0(Native Method)
	at sun.reflect.NativeMethodAccessorImpl.invoke(NativeMethodAccessorImpl.java:39)
	at sun.reflect.DelegatingMethodAccessorImpl.invoke(DelegatingMethodAccessorImpl.java:25)
	at java.lang.reflect.Method.invoke(Method.java:324)
	at junit.framework.TestCase.runTest(TestCase.java:154)
	at junit.framework.TestCase.runBare(TestCase.java:127)
	at junit.framework.TestResult$1.protect(TestResult.java:106)
	at junit.framework.TestResult.runProtected(TestResult.java:124)
	at junit.framework.TestResult.run(TestResult.java:109)
	at junit.framework.TestCase.run(TestCase.java:118)
	at org.apache.commons.logging.PathableTestSuite.runTest(PathableTestSuite.java:142)
	at junit.framework.TestSuite.run(TestSuite.java:203)
	at sun.reflect.NativeMethodAccessorImpl.invoke0(Native Method)
	at sun.reflect.NativeMethodAccessorImpl.invoke(NativeMethodAccessorImpl.java:39)
	at sun.reflect.DelegatingMethodAccessorImpl.invoke(DelegatingMethodAccessorImpl.java:25)
	at java.lang.reflect.Method.invoke(Method.java:324)
	at org.apache.maven.surefire.junit.JUnitTestSet.execute(JUnitTestSet.java:213)
	at org.apache.maven.surefire.suite.AbstractDirectoryTestSuite.executeTestSet(AbstractDirectoryTestSuite.java:140)
	at org.apache.maven.surefire.suite.AbstractDirectoryTestSuite.execute(AbstractDirectoryTestSuite.java:127)
	at org.apache.maven.surefire.Surefire.run(Surefire.java:177)
	at sun.reflect.NativeMethodAccessorImpl.invoke0(Native Method)
	at sun.reflect.NativeMethodAccessorImpl.invoke(NativeMethodAccessorImpl.java:39)
	at sun.reflect.DelegatingMethodAccessorImpl.invoke(DelegatingMethodAccessorImpl.java:25)
	at java.lang.reflect.Method.invoke(Method.java:324)
	at org.apache.maven.surefire.booter.SurefireBooter.runSuitesInProcess(SurefireBooter.java:338)
	at org.apache.maven.surefire.booter.SurefireBooter.main(SurefireBooter.java:997)

[INFO] DecoratedLogger - info <org.apache.commons.logging.DummyException>org.apache.commons.logging.DummyException
	at org.apache.commons.logging.simple.CustomConfigTestCase.logExceptionMessages(CustomConfigTestCase.java:238)
	at org.apache.commons.logging.simple.CustomConfigTestCase.testSerializable(CustomConfigTestCase.java:159)
	at sun.reflect.NativeMethodAccessorImpl.invoke0(Native Method)
	at sun.reflect.NativeMethodAccessorImpl.invoke(NativeMethodAccessorImpl.java:39)
	at sun.reflect.DelegatingMethodAccessorImpl.invoke(DelegatingMethodAccessorImpl.java:25)
	at java.lang.reflect.Method.invoke(Method.java:324)
	at junit.framework.TestCase.runTest(TestCase.java:154)
	at junit.framework.TestCase.runBare(TestCase.java:127)
	at junit.framework.TestResult$1.protect(TestResult.java:106)
	at junit.framework.TestResult.runProtected(TestResult.java:124)
	at junit.framework.TestResult.run(TestResult.java:109)
	at junit.framework.TestCase.run(TestCase.java:118)
	at org.apache.commons.logging.PathableTestSuite.runTest(PathableTestSuite.java:142)
	at junit.framework.TestSuite.run(TestSuite.java:203)
	at sun.reflect.NativeMethodAccessorImpl.invoke0(Native Method)
	at sun.reflect.NativeMethodAccessorImpl.invoke(NativeMethodAccessorImpl.java:39)
	at sun.reflect.DelegatingMethodAccessorImpl.invoke(DelegatingMethodAccessorImpl.java:25)
	at java.lang.reflect.Method.invoke(Method.java:324)
	at org.apache.maven.surefire.junit.JUnitTestSet.execute(JUnitTestSet.java:213)
	at org.apache.maven.surefire.suite.AbstractDirectoryTestSuite.executeTestSet(AbstractDirectoryTestSuite.java:140)
	at org.apache.maven.surefire.suite.AbstractDirectoryTestSuite.execute(AbstractDirectoryTestSuite.java:127)
	at org.apache.maven.surefire.Surefire.run(Surefire.java:177)
	at sun.reflect.NativeMethodAccessorImpl.invoke0(Native Method)
	at sun.reflect.NativeMethodAccessorImpl.invoke(NativeMethodAccessorImpl.java:39)
	at sun.reflect.DelegatingMethodAccessorImpl.invoke(DelegatingMethodAccessorImpl.java:25)
	at java.lang.reflect.Method.invoke(Method.java:324)
	at org.apache.maven.surefire.booter.SurefireBooter.runSuitesInProcess(SurefireBooter.java:338)
	at org.apache.maven.surefire.booter.SurefireBooter.main(SurefireBooter.java:997)

[WARN] DecoratedLogger - warn <org.apache.commons.logging.DummyException>org.apache.commons.logging.DummyException
	at org.apache.commons.logging.simple.CustomConfigTestCase.logExceptionMessages(CustomConfigTestCase.java:238)
	at org.apache.commons.logging.simple.CustomConfigTestCase.testSerializable(CustomConfigTestCase.java:159)
	at sun.reflect.NativeMethodAccessorImpl.invoke0(Native Method)
	at sun.reflect.NativeMethodAccessorImpl.invoke(NativeMethodAccessorImpl.java:39)
	at sun.reflect.DelegatingMethodAccessorImpl.invoke(DelegatingMethodAccessorImpl.java:25)
	at java.lang.reflect.Method.invoke(Method.java:324)
	at junit.framework.TestCase.runTest(TestCase.java:154)
	at junit.framework.TestCase.runBare(TestCase.java:127)
	at junit.framework.TestResult$1.protect(TestResult.java:106)
	at junit.framework.TestResult.runProtected(TestResult.java:124)
	at junit.framework.TestResult.run(TestResult.java:109)
	at junit.framework.TestCase.run(TestCase.java:118)
	at org.apache.commons.logging.PathableTestSuite.runTest(PathableTestSuite.java:142)
	at junit.framework.TestSuite.run(TestSuite.java:203)
	at sun.reflect.NativeMethodAccessorImpl.invoke0(Native Method)
	at sun.reflect.NativeMethodAccessorImpl.invoke(NativeMethodAccessorImpl.java:39)
	at sun.reflect.DelegatingMethodAccessorImpl.invoke(DelegatingMethodAccessorImpl.java:25)
	at java.lang.reflect.Method.invoke(Method.java:324)
	at org.apache.maven.surefire.junit.JUnitTestSet.execute(JUnitTestSet.java:213)
	at org.apache.maven.surefire.suite.AbstractDirectoryTestSuite.executeTestSet(AbstractDirectoryTestSuite.java:140)
	at org.apache.maven.surefire.suite.AbstractDirectoryTestSuite.execute(AbstractDirectoryTestSuite.java:127)
	at org.apache.maven.surefire.Surefire.run(Surefire.java:177)
	at sun.reflect.NativeMethodAccessorImpl.invoke0(Native Method)
	at sun.reflect.NativeMethodAccessorImpl.invoke(NativeMethodAccessorImpl.java:39)
	at sun.reflect.DelegatingMethodAccessorImpl.invoke(DelegatingMethodAccessorImpl.java:25)
	at java.lang.reflect.Method.invoke(Method.java:324)
	at org.apache.maven.surefire.booter.SurefireBooter.runSuitesInProcess(SurefireBooter.java:338)
	at org.apache.maven.surefire.booter.SurefireBooter.main(SurefireBooter.java:997)

[ERROR] DecoratedLogger - error <org.apache.commons.logging.DummyException>org.apache.commons.logging.DummyException
	at org.apache.commons.logging.simple.CustomConfigTestCase.logExceptionMessages(CustomConfigTestCase.java:238)
	at org.apache.commons.logging.simple.CustomConfigTestCase.testSerializable(CustomConfigTestCase.java:159)
	at sun.reflect.NativeMethodAccessorImpl.invoke0(Native Method)
	at sun.reflect.NativeMethodAccessorImpl.invoke(NativeMethodAccessorImpl.java:39)
	at sun.reflect.DelegatingMethodAccessorImpl.invoke(DelegatingMethodAccessorImpl.java:25)
	at java.lang.reflect.Method.invoke(Method.java:324)
	at junit.framework.TestCase.runTest(TestCase.java:154)
	at junit.framework.TestCase.runBare(TestCase.java:127)
	at junit.framework.TestResult$1.protect(TestResult.java:106)
	at junit.framework.TestResult.runProtected(TestResult.java:124)
	at junit.framework.TestResult.run(TestResult.java:109)
	at junit.framework.TestCase.run(TestCase.java:118)
	at org.apache.commons.logging.PathableTestSuite.runTest(PathableTestSuite.java:142)
	at junit.framework.TestSuite.run(TestSuite.java:203)
	at sun.reflect.NativeMethodAccessorImpl.invoke0(Native Method)
	at sun.reflect.NativeMethodAccessorImpl.invoke(NativeMethodAccessorImpl.java:39)
	at sun.reflect.DelegatingMethodAccessorImpl.invoke(DelegatingMethodAccessorImpl.java:25)
	at java.lang.reflect.Method.invoke(Method.java:324)
	at org.apache.maven.surefire.junit.JUnitTestSet.execute(JUnitTestSet.java:213)
	at org.apache.maven.surefire.suite.AbstractDirectoryTestSuite.executeTestSet(AbstractDirectoryTestSuite.java:140)
	at org.apache.maven.surefire.suite.AbstractDirectoryTestSuite.execute(AbstractDirectoryTestSuite.java:127)
	at org.apache.maven.surefire.Surefire.run(Surefire.java:177)
	at sun.reflect.NativeMethodAccessorImpl.invoke0(Native Method)
	at sun.reflect.NativeMethodAccessorImpl.invoke(NativeMethodAccessorImpl.java:39)
	at sun.reflect.DelegatingMethodAccessorImpl.invoke(DelegatingMethodAccessorImpl.java:25)
	at java.lang.reflect.Method.invoke(Method.java:324)
	at org.apache.maven.surefire.booter.SurefireBooter.runSuitesInProcess(SurefireBooter.java:338)
	at org.apache.maven.surefire.booter.SurefireBooter.main(SurefireBooter.java:997)

[FATAL] DecoratedLogger - fatal <org.apache.commons.logging.DummyException>org.apache.commons.logging.DummyException
	at org.apache.commons.logging.simple.CustomConfigTestCase.logExceptionMessages(CustomConfigTestCase.java:238)
	at org.apache.commons.logging.simple.CustomConfigTestCase.testSerializable(CustomConfigTestCase.java:159)
	at sun.reflect.NativeMethodAccessorImpl.invoke0(Native Method)
	at sun.reflect.NativeMethodAccessorImpl.invoke(NativeMethodAccessorImpl.java:39)
	at sun.reflect.DelegatingMethodAccessorImpl.invoke(DelegatingMethodAccessorImpl.java:25)
	at java.lang.reflect.Method.invoke(Method.java:324)
	at junit.framework.TestCase.runTest(TestCase.java:154)
	at junit.framework.TestCase.runBare(TestCase.java:127)
	at junit.framework.TestResult$1.protect(TestResult.java:106)
	at junit.framework.TestResult.runProtected(TestResult.java:124)
	at junit.framework.TestResult.run(TestResult.java:109)
	at junit.framework.TestCase.run(TestCase.java:118)
	at org.apache.commons.logging.PathableTestSuite.runTest(PathableTestSuite.java:142)
	at junit.framework.TestSuite.run(TestSuite.java:203)
	at sun.reflect.NativeMethodAccessorImpl.invoke0(Native Method)
	at sun.reflect.NativeMethodAccessorImpl.invoke(NativeMethodAccessorImpl.java:39)
	at sun.reflect.DelegatingMethodAccessorImpl.invoke(DelegatingMethodAccessorImpl.java:25)
	at java.lang.reflect.Method.invoke(Method.java:324)
	at org.apache.maven.surefire.junit.JUnitTestSet.execute(JUnitTestSet.java:213)
	at org.apache.maven.surefire.suite.AbstractDirectoryTestSuite.executeTestSet(AbstractDirectoryTestSuite.java:140)
	at org.apache.maven.surefire.suite.AbstractDirectoryTestSuite.execute(AbstractDirectoryTestSuite.java:127)
	at org.apache.maven.surefire.Surefire.run(Surefire.java:177)
	at sun.reflect.NativeMethodAccessorImpl.invoke0(Native Method)
	at sun.reflect.NativeMethodAccessorImpl.invoke(NativeMethodAccessorImpl.java:39)
	at sun.reflect.DelegatingMethodAccessorImpl.invoke(DelegatingMethodAccessorImpl.java:25)
	at java.lang.reflect.Method.invoke(Method.java:324)
	at org.apache.maven.surefire.booter.SurefireBooter.runSuitesInProcess(SurefireBooter.java:338)
	at org.apache.maven.surefire.booter.SurefireBooter.main(SurefireBooter.java:997)

Tests run: 6, Failures: 0, Errors: 0, Skipped: 0, Time elapsed: 0.138 sec
Running org.apache.commons.logging.logkit.StandardTestCase
org.apache.maven.surefire.booter.SurefireExecutionException: org.apache.commons.logging.logkit.StandardTestCase; nested exception is java.lang.UnknownError: Logical lib [logkit] is not defined as a System property.; nested exception is org.apache.maven.surefire.testset.TestSetFailedException: org.apache.commons.logging.logkit.StandardTestCase; nested exception is java.lang.UnknownError: Logical lib [logkit] is not defined as a System property.
org.apache.maven.surefire.testset.TestSetFailedException: org.apache.commons.logging.logkit.StandardTestCase; nested exception is java.lang.UnknownError: Logical lib [logkit] is not defined as a System property.
java.lang.UnknownError: Logical lib [logkit] is not defined as a System property.
	at org.apache.commons.logging.PathableClassLoader.addLogicalLib(PathableClassLoader.java:230)
	at org.apache.commons.logging.logkit.StandardTestCase.suite(StandardTestCase.java:70)
	at sun.reflect.NativeMethodAccessorImpl.invoke0(Native Method)
	at sun.reflect.NativeMethodAccessorImpl.invoke(NativeMethodAccessorImpl.java:39)
	at sun.reflect.DelegatingMethodAccessorImpl.invoke(DelegatingMethodAccessorImpl.java:25)
	at java.lang.reflect.Method.invoke(Method.java:324)
	at org.apache.maven.surefire.junit.JUnitTestSet.createInstanceFromSuiteMethod(JUnitTestSet.java:180)
	at org.apache.maven.surefire.junit.JUnitTestSet.constructTestObject(JUnitTestSet.java:140)
	at org.apache.maven.surefire.junit.JUnitTestSet.execute(JUnitTestSet.java:197)
	at org.apache.maven.surefire.suite.AbstractDirectoryTestSuite.executeTestSet(AbstractDirectoryTestSuite.java:140)
	at org.apache.maven.surefire.suite.AbstractDirectoryTestSuite.execute(AbstractDirectoryTestSuite.java:127)
	at org.apache.maven.surefire.Surefire.run(Surefire.java:177)
	at sun.reflect.NativeMethodAccessorImpl.invoke0(Native Method)
	at sun.reflect.NativeMethodAccessorImpl.invoke(NativeMethodAccessorImpl.java:39)
	at sun.reflect.DelegatingMethodAccessorImpl.invoke(DelegatingMethodAccessorImpl.java:25)
	at java.lang.reflect.Method.invoke(Method.java:324)
	at org.apache.maven.surefire.booter.SurefireBooter.runSuitesInProcess(SurefireBooter.java:338)
	at org.apache.maven.surefire.booter.SurefireBooter.main(SurefireBooter.java:997)
[INFO] ------------------------------------------------------------------------
[ERROR] BUILD FAILURE
[INFO] ------------------------------------------------------------------------
[INFO] There are test failures.

Please refer to /home/continuum/data/working-directory/168/target/surefire-reports for the individual test results.
[INFO] ------------------------------------------------------------------------
[INFO] For more information, run Maven with the -e switch
[INFO] ------------------------------------------------------------------------
[INFO] Total time: 18 seconds
[INFO] Finished at: Sun Mar 02 12:18:38 PST 2008
[INFO] Final Memory: 13M/24M
[INFO] ------------------------------------------------------------------------

****************************************************************************



---------------------------------------------------------------------
To unsubscribe, e-mail: dev-unsubscribe@commons.apache.org
For additional commands, e-mail: dev-help@commons.apache.org


Mime
View raw message