commons-dev mailing list archives

Site index · List index
Message view « Date » · « Thread »
Top « Date » · « Thread »
From Continuum VMBuild Server <contin...@apache.org>
Subject [continuum] BUILD FAILURE: Commons Codec
Date Fri, 14 Mar 2008 07:16:02 GMT
Online report : http://vmbuild.apache.org/continuum/buildResult.action?buildId=65143&projectId=159

Build statistics:
  State: Failed
  Previous State: Failed
  Started at: Fri 14 Mar 2008 00:15:28 -0700
  Finished at: Fri 14 Mar 2008 00:15:53 -0700
  Total time: 24s
  Build Trigger: Schedule
  Build Number: 6
  Exit code: 1
  Building machine hostname: vmbuild.apache.org
  Operating system : Linux(unknown)
  Java Home version : 
          java version "1.5.0_12"
          Java(TM) 2 Runtime Environment, Standard Edition (build 1.5.0_12-b04)
          Java HotSpot(TM) Client VM (build 1.5.0_12-b04, mixed mode, sharing)
        
  Builder version :
          Maven version: 2.0.7
          Java version: 1.5.0_12
          OS name: "linux" version: "2.6.20-16-server" arch: "i386"
    
****************************************************************************
SCM Changes:
****************************************************************************
Changed: bayard @ Thu 13 Mar 2008 23:41:17 -0700
Comment: Fixing the assemblies to say project.version instead of version to stop '2.4.1' leaking
through from the JVM properties. Also making it project.artifactId while I'm doing this.
Files changed:
  /commons/proper/betwixt/trunk/src/assembly/src.xml ( 637007 )
  /commons/proper/chain/trunk/src/assembly/src.xml ( 637007 )
  /commons/proper/cli/trunk/src/assembly/src.xml ( 637007 )
  /commons/proper/codec/trunk/src/assembly/src.xml ( 637007 )
  /commons/proper/collections/branches/collections_jdk5_branch/src/assembly/src.xml ( 637007
)
  /commons/proper/collections/trunk/src/assembly/src.xml ( 637007 )
  /commons/proper/configuration/trunk/src/assembly/src.xml ( 637007 )
  /commons/proper/daemon/trunk/src/assembly/src.xml ( 637007 )
  /commons/proper/dbcp/trunk/src/assembly/src.xml ( 637007 )
  /commons/proper/dbutils/trunk/src/assembly/src.xml ( 637007 )
  /commons/proper/digester/trunk/src/assembly/src.xml ( 637007 )
  /commons/proper/discovery/trunk/src/assembly/src.xml ( 637007 )
  /commons/proper/el/trunk/src/assembly/src.xml ( 637007 )
  /commons/proper/jexl/trunk/src/assembly/src.xml ( 637007 )
  /commons/proper/jxpath/trunk/src/assembly/src.xml ( 637007 )
  /commons/proper/lang/trunk/src/assembly/src.xml ( 637007 )
  /commons/proper/launcher/trunk/src/assembly/src.xml ( 637007 )
  /commons/proper/logging/trunk/src/assembly/src.xml ( 637007 )
  /commons/proper/math/trunk/src/assembly/src.xml ( 637007 )
  /commons/proper/modeler/trunk/src/assembly/src.xml ( 637007 )
  /commons/proper/net/trunk/src/assembly/src.xml ( 637007 )
  /commons/proper/pool/trunk/src/assembly/src.xml ( 637007 )
  /commons/proper/primitives/trunk/src/assembly/src.xml ( 637007 )
  /commons/proper/scxml/trunk/src/assembly/src.xml ( 637007 )
  /commons/proper/transaction/trunk/src/assembly/src.xml ( 637007 )

****************************************************************************
Dependencies Changes:
****************************************************************************
No dependencies changed


****************************************************************************
Build Defintion:
****************************************************************************
POM filename: pom.xml
Goals: clean deploy   
Arguments: --batch-mode -DaltDeploymentRepository=vmbuild.repo::default::file://localhost/home/continuum/data/commons
-Pci
Build Fresh: false
Always Build: false
Default Build Definition: true
Schedule: COMMONS_SCHEDULE
Profile Name: Java 5
Description: 


****************************************************************************
Test Summary:
****************************************************************************
Tests: 201
Failures: 1
Total time: 1978

****************************************************************************
Output:
****************************************************************************
[INFO] Scanning for projects...
[INFO] ----------------------------------------------------------------------------
[INFO] Building Commons Codec
[INFO]    task-segment: [clean, deploy]
[INFO] ----------------------------------------------------------------------------
[INFO] [clean:clean]
[INFO] Deleting directory /home/continuum/data/working-directory/159/target
[INFO] Deleting directory /home/continuum/data/working-directory/159/target/classes
[INFO] Deleting directory /home/continuum/data/working-directory/159/target/test-classes
[INFO] Deleting directory /home/continuum/data/working-directory/159/target/site
[INFO] [antrun:run {execution: javadoc.resources}]
[INFO] Executing tasks
     [copy] Copying 2 files to /home/continuum/data/working-directory/159/target/apidocs/META-INF
[INFO] Executed tasks
[INFO] [resources:resources]
[INFO] Using default encoding to copy filtered resources.
[INFO] [compiler:compile]
[INFO] Compiling 25 source files to /home/continuum/data/working-directory/159/target/classes
[INFO] [bundle:manifest {execution: bundle-manifest}]
[INFO] [resources:testResources]
[INFO] Using default encoding to copy filtered resources.
[INFO] [compiler:testCompile]
[INFO] Compiling 18 source files to /home/continuum/data/working-directory/159/target/test-classes
[INFO] [surefire:test]
[INFO] Surefire report directory: /home/continuum/data/working-directory/159/target/surefire-reports

-------------------------------------------------------
 T E S T S
-------------------------------------------------------
Running org.apache.commons.codec.net.URLCodecTest
Tests run: 16, Failures: 0, Errors: 0, Skipped: 0, Time elapsed: 0.108 sec
Running org.apache.commons.codec.language.MetaphoneTest
Tests run: 33, Failures: 1, Errors: 0, Skipped: 0, Time elapsed: 0.113 sec <<< FAILURE!
Running org.apache.commons.codec.net.QuotedPrintableCodecTest
Tests run: 15, Failures: 0, Errors: 0, Skipped: 0, Time elapsed: 0.03 sec
Running org.apache.commons.codec.net.RFC1522CodecTest
Tests run: 2, Failures: 0, Errors: 0, Skipped: 0, Time elapsed: 0.01 sec
Running org.apache.commons.codec.net.QCodecTest
Tests run: 12, Failures: 0, Errors: 0, Skipped: 0, Time elapsed: 0.025 sec
Running org.apache.commons.codec.binary.HexTest
Tests run: 12, Failures: 0, Errors: 0, Skipped: 0, Time elapsed: 0.074 sec
Running org.apache.commons.codec.language.RefinedSoundexTest
Tests run: 6, Failures: 0, Errors: 0, Skipped: 0, Time elapsed: 0.01 sec
Running org.apache.commons.codec.binary.Base64Test
Tests run: 29, Failures: 0, Errors: 0, Skipped: 0, Time elapsed: 0.08 sec
Running org.apache.commons.codec.language.CaverphoneTest
Tests run: 4, Failures: 0, Errors: 0, Skipped: 0, Time elapsed: 0.085 sec
Running org.apache.commons.codec.digest.DigestUtilsTest
Tests run: 8, Failures: 0, Errors: 0, Skipped: 0, Time elapsed: 1.297 sec
Running org.apache.commons.codec.StringEncoderComparatorTest
Tests run: 4, Failures: 0, Errors: 0, Skipped: 0, Time elapsed: 0.02 sec
Running org.apache.commons.codec.language.SoundexTest
Tests run: 25, Failures: 0, Errors: 0, Skipped: 0, Time elapsed: 0.025 sec
Running org.apache.commons.codec.language.DoubleMetaphoneTest
Tests run: 13, Failures: 0, Errors: 0, Skipped: 0, Time elapsed: 0.127 sec
Running org.apache.commons.codec.net.BCodecTest
Tests run: 9, Failures: 0, Errors: 0, Skipped: 0, Time elapsed: 0.015 sec
Running org.apache.commons.codec.binary.BinaryCodecTest
Tests run: 13, Failures: 0, Errors: 0, Skipped: 0, Time elapsed: 0.022 sec

Results :

Failed tests: 
  testWhy(org.apache.commons.codec.language.MetaphoneTest)

Tests run: 201, Failures: 1, Errors: 0, Skipped: 0

[INFO] ------------------------------------------------------------------------
[ERROR] BUILD FAILURE
[INFO] ------------------------------------------------------------------------
[INFO] There are test failures.

Please refer to /home/continuum/data/working-directory/159/target/surefire-reports for the
individual test results.
[INFO] ------------------------------------------------------------------------
[INFO] For more information, run Maven with the -e switch
[INFO] ------------------------------------------------------------------------
[INFO] Total time: 14 seconds
[INFO] Finished at: Fri Mar 14 00:15:52 PDT 2008
[INFO] Final Memory: 11M/25M
[INFO] ------------------------------------------------------------------------

****************************************************************************



---------------------------------------------------------------------
To unsubscribe, e-mail: dev-unsubscribe@commons.apache.org
For additional commands, e-mail: dev-help@commons.apache.org


Mime
View raw message