commons-dev mailing list archives

Site index · List index
Message view « Date » · « Thread »
Top « Date » · « Thread »
From Continuum VMBuild Server <contin...@apache.org>
Subject [continuum] BUILD FAILURE: Commons Codec
Date Sun, 02 Mar 2008 20:01:08 GMT
Online report : http://vmbuild.apache.org/continuum/buildResult.action?buildId=58535&projectId=159

Build statistics:
  State: Failed
  Previous State: Failed
  Started at: Sun 2 Mar 2008 12:00:26 -0800
  Finished at: Sun 2 Mar 2008 12:00:46 -0800
  Total time: 20s
  Build Trigger: Schedule
  Build Number: 6
  Exit code: 1
  Building machine hostname: vmbuild.apache.org
  Operating system : Linux(unknown)
  Java Home version : 
          java version "1.4.2_15"
          Java(TM) 2 Runtime Environment, Standard Edition (build 1.4.2_15-b02)
          Java HotSpot(TM) Client VM (build 1.4.2_15-b02, mixed mode)
        
  Builder version :
          Maven version: 2.0.7
          Java version: 1.4.2_15
          OS name: "linux" version: "2.6.20-16-server" arch: "i386"
    
****************************************************************************
SCM Changes:
****************************************************************************
Changed: niallp @ Sun 2 Mar 2008 11:37:56 -0800
Comment: Upgrade to commons-parent-8 and add configuration properties for OSGi (maven-bundle-plugin)
and commons-build-plugin
Files changed:
  /commons/proper/beanutils/trunk/pom.xml ( 632815 )
  /commons/proper/betwixt/trunk/pom.xml ( 632815 )
  /commons/proper/chain/trunk/pom.xml ( 632815 )
  /commons/proper/cli/trunk/pom.xml ( 632815 )
  /commons/proper/codec/trunk/pom.xml ( 632815 )
  /commons/proper/collections/trunk/pom.xml ( 632815 )
  /commons/proper/configuration/trunk/pom.xml ( 632815 )
  /commons/proper/daemon/trunk/pom.xml ( 632815 )
  /commons/proper/dbcp/trunk/pom.xml ( 632815 )
  /commons/proper/dbutils/trunk/pom.xml ( 632815 )
  /commons/proper/digester/trunk/pom.xml ( 632815 )
  /commons/proper/discovery/trunk/pom.xml ( 632815 )
  /commons/proper/el/trunk/pom.xml ( 632815 )
  /commons/proper/email/trunk/pom.xml ( 632815 )
  /commons/proper/fileupload/trunk/pom.xml ( 632815 )
  /commons/proper/io/trunk/pom.xml ( 632815 )
  /commons/proper/jci/trunk/compilers/eclipse/pom.xml ( 632815 )
  /commons/proper/jci/trunk/compilers/groovy/pom.xml ( 632815 )
  /commons/proper/jci/trunk/compilers/janino/pom.xml ( 632815 )
  /commons/proper/jci/trunk/compilers/javac/pom.xml ( 632815 )
  /commons/proper/jci/trunk/compilers/jsr199/pom.xml ( 632815 )
  /commons/proper/jci/trunk/compilers/rhino/pom.xml ( 632815 )
  /commons/proper/jci/trunk/core/pom.xml ( 632815 )
  /commons/proper/jci/trunk/examples/pom.xml ( 632815 )
  /commons/proper/jci/trunk/fam/pom.xml ( 632815 )
  /commons/proper/jci/trunk/pom.xml ( 632815 )
  /commons/proper/jexl/trunk/pom.xml ( 632815 )
  /commons/proper/jxpath/trunk/pom.xml ( 632815 )
  /commons/proper/lang/trunk/pom.xml ( 632815 )
  /commons/proper/launcher/trunk/pom.xml ( 632815 )
  /commons/proper/logging/trunk/pom.xml ( 632815 )
  /commons/proper/math/trunk/pom.xml ( 632815 )
  /commons/proper/modeler/trunk/pom.xml ( 632815 )
  /commons/proper/net/trunk/pom.xml ( 632815 )
  /commons/proper/pool/trunk/pom.xml ( 632815 )
  /commons/proper/primitives/trunk/pom.xml ( 632815 )
  /commons/proper/proxy/trunk/pom.xml ( 632815 )
  /commons/proper/scxml/trunk/pom.xml ( 632815 )
  /commons/proper/transaction/trunk/pom.xml ( 632815 )
  /commons/proper/validator/trunk/pom.xml ( 632815 )
  /commons/proper/vfs/trunk/core/pom.xml ( 632815 )
  /commons/proper/vfs/trunk/examples/pom.xml ( 632815 )
  /commons/proper/vfs/trunk/pom.xml ( 632815 )
  /commons/proper/vfs/trunk/sandbox/pom.xml ( 632815 )

Changed: niallp @ Sun 2 Mar 2008 11:46:00 -0800
Comment: Add Issue Tracking and Download pages generated by commons-build-plugin
Files changed:
  /commons/proper/beanutils/trunk/xdocs/download_beanutils.xml ( 632817 )
  /commons/proper/beanutils/trunk/xdocs/issue-tracking.xml ( 632817 )
  /commons/proper/betwixt/trunk/xdocs/download_betwixt.xml ( 632817 )
  /commons/proper/betwixt/trunk/xdocs/issue-tracking.xml ( 632817 )
  /commons/proper/chain/trunk/xdocs/download_chain.xml ( 632817 )
  /commons/proper/chain/trunk/xdocs/issue-tracking.xml ( 632817 )
  /commons/proper/cli/trunk/xdocs/download_cli.xml ( 632817 )
  /commons/proper/cli/trunk/xdocs/issue-tracking.xml ( 632817 )
  /commons/proper/codec/trunk/xdocs/download_codec.xml ( 632817 )
  /commons/proper/codec/trunk/xdocs/issue-tracking.xml ( 632817 )
  /commons/proper/collections/trunk/xdocs/download_collections.xml ( 632817 )
  /commons/proper/collections/trunk/xdocs/issue-tracking.xml ( 632817 )
  /commons/proper/commons-parent/trunk/pom.xml ( 632817 )
  /commons/proper/configuration/trunk/xdocs/download_configuration.xml ( 632817 )
  /commons/proper/configuration/trunk/xdocs/issue-tracking.xml ( 632817 )
  /commons/proper/daemon/trunk/xdocs/download_daemon.xml ( 632817 )
  /commons/proper/daemon/trunk/xdocs/issue-tracking.xml ( 632817 )
  /commons/proper/dbcp/trunk/xdocs/download_dbcp.xml ( 632817 )
  /commons/proper/dbcp/trunk/xdocs/issue-tracking.xml ( 632817 )
  /commons/proper/dbutils/trunk/xdocs/download_dbutils.xml ( 632817 )
  /commons/proper/dbutils/trunk/xdocs/issue-tracking.xml ( 632817 )
  /commons/proper/digester/trunk/xdocs/download_digester.xml ( 632817 )
  /commons/proper/digester/trunk/xdocs/issue-tracking.xml ( 632817 )
  /commons/proper/discovery/trunk/xdocs/download_discovery.xml ( 632817 )
  /commons/proper/discovery/trunk/xdocs/issue-tracking.xml ( 632817 )
  /commons/proper/el/trunk/xdocs/download_el.xml ( 632817 )
  /commons/proper/el/trunk/xdocs/issue-tracking.xml ( 632817 )
  /commons/proper/email/trunk/xdocs/download_email.xml ( 632817 )
  /commons/proper/email/trunk/xdocs/issue-tracking.xml ( 632817 )
  /commons/proper/fileupload/trunk/xdocs/download_fileupload.xml ( 632817 )
  /commons/proper/fileupload/trunk/xdocs/issue-tracking.xml ( 632817 )
  /commons/proper/io/trunk/xdocs/download_io.xml ( 632817 )
  /commons/proper/io/trunk/xdocs/issue-tracking.xml ( 632817 )
  /commons/proper/jci/trunk/src/site/site.xml ( 632817 )
  /commons/proper/jci/trunk/src/site/xdoc/download_jci.xml ( 632817 )
  /commons/proper/jci/trunk/src/site/xdoc/issue-tracking.xml ( 632817 )
  /commons/proper/jexl/trunk/xdocs/download_jexl.xml ( 632817 )
  /commons/proper/jexl/trunk/xdocs/issue-tracking.xml ( 632817 )
  /commons/proper/jxpath/trunk/xdocs/download_jxpath.xml ( 632817 )
  /commons/proper/jxpath/trunk/xdocs/issue-tracking.xml ( 632817 )
  /commons/proper/lang/trunk/xdocs/download_lang.xml ( 632817 )
  /commons/proper/lang/trunk/xdocs/issue-tracking.xml ( 632817 )
  /commons/proper/launcher/trunk/xdocs/download_launcher.xml ( 632817 )
  /commons/proper/launcher/trunk/xdocs/issue-tracking.xml ( 632817 )
  /commons/proper/logging/trunk/src/site/site.xml ( 632817 )
  /commons/proper/logging/trunk/xdocs/download_logging.xml ( 632817 )
  /commons/proper/logging/trunk/xdocs/issue-tracking.xml ( 632817 )
  /commons/proper/math/trunk/src/site/xdoc/download_math.xml ( 632817 )
  /commons/proper/math/trunk/src/site/xdoc/issue-tracking.xml ( 632817 )
  /commons/proper/modeler/trunk/xdocs/download_modeler.xml ( 632817 )
  /commons/proper/modeler/trunk/xdocs/issue-tracking.xml ( 632817 )
  /commons/proper/net/trunk/xdocs/download_net.xml ( 632817 )
  /commons/proper/net/trunk/xdocs/issue-tracking.xml ( 632817 )
  /commons/proper/pool/trunk/xdocs/download_pool.xml ( 632817 )
  /commons/proper/pool/trunk/xdocs/issue-tracking.xml ( 632817 )
  /commons/proper/primitives/trunk/xdocs/download_primitives.xml ( 632817 )
  /commons/proper/primitives/trunk/xdocs/issue-tracking.xml ( 632817 )
  /commons/proper/proxy/trunk/src/site/site.xml ( 632817 )
  /commons/proper/proxy/trunk/src/site/xdoc/download_proxy.xml ( 632817 )
  /commons/proper/proxy/trunk/src/site/xdoc/issue-tracking.xml ( 632817 )
  /commons/proper/scxml/trunk/xdocs/download_scxml.xml ( 632817 )
  /commons/proper/scxml/trunk/xdocs/issue-tracking.xml ( 632817 )
  /commons/proper/transaction/trunk/xdocs/download_transaction.xml ( 632817 )
  /commons/proper/transaction/trunk/xdocs/issue-tracking.xml ( 632817 )
  /commons/proper/validator/trunk/xdocs/download_validator.xml ( 632817 )
  /commons/proper/validator/trunk/xdocs/issue-tracking.xml ( 632817 )
  /commons/proper/vfs/trunk/xdocs/download_vfs.xml ( 632817 )
  /commons/proper/vfs/trunk/xdocs/issue-tracking.xml ( 632817 )

****************************************************************************
Dependencies Changes:
****************************************************************************
No dependencies changed


****************************************************************************
Build Defintion:
****************************************************************************
POM filename: pom.xml
Goals: clean deploy   
Arguments: --batch-mode -DaltDeploymentRepository=vmbuild.repo::default::file://localhost/home/continuum/data/commons
-Pci
Build Fresh: false
Always Build: false
Default Build Definition: true
Schedule: COMMONS_SCHEDULE
Profile Name: Java 1.4
Description: 


****************************************************************************
Test Summary:
****************************************************************************
Tests: 192
Failures: 1
Total time: 707

****************************************************************************
Output:
****************************************************************************
[INFO] Scanning for projects...
[INFO] ----------------------------------------------------------------------------
[INFO] Building Commons Codec
[INFO]    task-segment: [clean, deploy]
[INFO] ----------------------------------------------------------------------------
[INFO] [clean:clean]
[INFO] Deleting directory /home/continuum/data/working-directory/159/target
[INFO] Deleting directory /home/continuum/data/working-directory/159/target/classes
[INFO] Deleting directory /home/continuum/data/working-directory/159/target/test-classes
[INFO] Deleting directory /home/continuum/data/working-directory/159/target/site
[INFO] [antrun:run {execution: javadoc.resources}]
[INFO] Executing tasks
     [copy] Copying 2 files to /home/continuum/data/working-directory/159/target/apidocs/META-INF
[INFO] Executed tasks
[INFO] [resources:resources]
[INFO] Using default encoding to copy filtered resources.
[INFO] [compiler:compile]
[INFO] Compiling 24 source files to /home/continuum/data/working-directory/159/target/classes
[INFO] [resources:testResources]
[INFO] Using default encoding to copy filtered resources.
[INFO] [compiler:testCompile]
[INFO] Compiling 17 source files to /home/continuum/data/working-directory/159/target/test-classes
[INFO] [surefire:test]
[INFO] Surefire report directory: /home/continuum/data/working-directory/159/target/surefire-reports

-------------------------------------------------------
 T E S T S
-------------------------------------------------------
Running org.apache.commons.codec.net.URLCodecTest
Tests run: 16, Failures: 0, Errors: 0, Skipped: 0, Time elapsed: 0.125 sec
Running org.apache.commons.codec.language.MetaphoneTest
Tests run: 33, Failures: 1, Errors: 0, Skipped: 0, Time elapsed: 0.108 sec <<< FAILURE!
Running org.apache.commons.codec.net.QuotedPrintableCodecTest
Tests run: 15, Failures: 0, Errors: 0, Skipped: 0, Time elapsed: 0.029 sec
Running org.apache.commons.codec.net.RFC1522CodecTest
Tests run: 2, Failures: 0, Errors: 0, Skipped: 0, Time elapsed: 0.024 sec
Running org.apache.commons.codec.net.QCodecTest
Tests run: 12, Failures: 0, Errors: 0, Skipped: 0, Time elapsed: 0.043 sec
Running org.apache.commons.codec.binary.HexTest
Tests run: 12, Failures: 0, Errors: 0, Skipped: 0, Time elapsed: 0.06 sec
Running org.apache.commons.codec.language.RefinedSoundexTest
Tests run: 6, Failures: 0, Errors: 0, Skipped: 0, Time elapsed: 0.013 sec
Running org.apache.commons.codec.binary.Base64Test
Tests run: 24, Failures: 0, Errors: 0, Skipped: 0, Time elapsed: 0.075 sec
Running org.apache.commons.codec.digest.DigestUtilsTest
Tests run: 8, Failures: 0, Errors: 0, Skipped: 0, Time elapsed: 0.142 sec
Running org.apache.commons.codec.StringEncoderComparatorTest
Tests run: 4, Failures: 0, Errors: 0, Skipped: 0, Time elapsed: 0.019 sec
Running org.apache.commons.codec.language.SoundexTest
Tests run: 25, Failures: 0, Errors: 0, Skipped: 0, Time elapsed: 0.024 sec
Running org.apache.commons.codec.language.DoubleMetaphoneTest
Tests run: 13, Failures: 0, Errors: 0, Skipped: 0, Time elapsed: 0.084 sec
Running org.apache.commons.codec.net.BCodecTest
Tests run: 9, Failures: 0, Errors: 0, Skipped: 0, Time elapsed: 0.015 sec
Running org.apache.commons.codec.binary.BinaryCodecTest
Tests run: 13, Failures: 0, Errors: 0, Skipped: 0, Time elapsed: 0.026 sec

Results :

Failed tests: 
  testWhy(org.apache.commons.codec.language.MetaphoneTest)

Tests run: 192, Failures: 1, Errors: 0, Skipped: 0

[INFO] ------------------------------------------------------------------------
[ERROR] BUILD FAILURE
[INFO] ------------------------------------------------------------------------
[INFO] There are test failures.

Please refer to /home/continuum/data/working-directory/159/target/surefire-reports for the
individual test results.
[INFO] ------------------------------------------------------------------------
[INFO] For more information, run Maven with the -e switch
[INFO] ------------------------------------------------------------------------
[INFO] Total time: 12 seconds
[INFO] Finished at: Sun Mar 02 12:00:46 PST 2008
[INFO] Final Memory: 8M/20M
[INFO] ------------------------------------------------------------------------

****************************************************************************



---------------------------------------------------------------------
To unsubscribe, e-mail: dev-unsubscribe@commons.apache.org
For additional commands, e-mail: dev-help@commons.apache.org


Mime
View raw message