commons-dev mailing list archives

Site index · List index
Message view « Date » · « Thread »
Top « Date » · « Thread »
From Continuum VMBuild Server <contin...@apache.org>
Subject [continuum] BUILD SUCCESSFUL: Commons BeanUtils
Date Mon, 04 Feb 2008 09:32:19 GMT
Online report : http://vmbuild.apache.org/continuum/buildResult.action?buildId=46014&projectId=156

Build statistics:
  State: Ok
  Previous State: Error
  Started at: Mon 4 Feb 2008 01:30:18 -0800
  Finished at: Mon 4 Feb 2008 01:32:11 -0800
  Total time: 1m 52s
  Build Trigger: Schedule
  Build Number: 10
  Exit code: 0
  Building machine hostname: vmbuild.apache.org
  Operating system : Linux(unknown)
  Java Home version : 
          java version "1.4.2_15"
          Java(TM) 2 Runtime Environment, Standard Edition (build 1.4.2_15-b02)
          Java HotSpot(TM) Client VM (build 1.4.2_15-b02, mixed mode)
        
  Builder version :
          Maven version: 2.0.7
          Java version: 1.4.2_15
          OS name: "linux" version: "2.6.20-16-server" arch: "i386"
    
****************************************************************************
SCM Changes:
****************************************************************************
Changed: niallp @ Mon 4 Feb 2008 00:55:29 -0800
Comment: Fix for BEANUTILS-302 - NPE in ArrayConverter when converting a string with underscores to a string array - reported by Martin Bartlett
Files changed:
  /commons/proper/beanutils/trunk/src/java/org/apache/commons/beanutils/converters/ArrayConverter.java ( 618207 )
  /commons/proper/beanutils/trunk/src/test/org/apache/commons/beanutils/converters/ArrayConverterTestCase.java ( 618207 )

****************************************************************************
Dependencies Changes:
****************************************************************************
No dependencies changed


****************************************************************************
Build Defintion:
****************************************************************************
POM filename: pom.xml
Goals: clean deploy   
Arguments: --batch-mode -DaltDeploymentRepository=vmbuild.repo::default::file://localhost/home/continuum/data/commons -Pci
Build Fresh: false
Always Build: false
Default Build Definition: true
Schedule: COMMONS_SCHEDULE
Profile Name: Java 1.4
Description: 


****************************************************************************
Test Summary:
****************************************************************************
Tests: 1137
Failures: 0
Total time: 10583

****************************************************************************
Output:
****************************************************************************
[INFO] Scanning for projects...
[INFO] ----------------------------------------------------------------------------
[INFO] Building Commons BeanUtils
[INFO]    task-segment: [clean, deploy]
[INFO] ----------------------------------------------------------------------------
[INFO] [clean:clean]
[INFO] Deleting directory /home/continuum/data/working-directory/156/target
[INFO] Deleting directory /home/continuum/data/working-directory/156/target/classes
[INFO] Deleting directory /home/continuum/data/working-directory/156/target/test-classes
[INFO] Deleting directory /home/continuum/data/working-directory/156/target/site
Downloading: http://repo1.maven.org/maven2/commons-collections/commons-collections-testframework/3.2/commons-collections-testframework-3.2.pom
[INFO] [antrun:run {execution: javadoc.resources}]
[INFO] Executing tasks
     [copy] Copying 2 files to /home/continuum/data/working-directory/156/target/apidocs/META-INF
[INFO] Executed tasks
[INFO] [resources:resources]
[INFO] Using default encoding to copy filtered resources.
[INFO] [compiler:compile]
[INFO] Compiling 100 source files to /home/continuum/data/working-directory/156/target/classes
[INFO] [resources:testResources]
[INFO] Using default encoding to copy filtered resources.
[INFO] [compiler:testCompile]
[INFO] Compiling 118 source files to /home/continuum/data/working-directory/156/target/test-classes
[INFO] [surefire:test]
[INFO] Surefire report directory: /home/continuum/data/working-directory/156/target/surefire-reports

-------------------------------------------------------
 T E S T S
-------------------------------------------------------
Running org.apache.commons.beanutils.DynaBeanMapDecoratorTestCase
Tests run: 13, Failures: 0, Errors: 0, Skipped: 0, Time elapsed: 0.055 sec
Running org.apache.commons.beanutils.bugs.Jira157TestCase
Tests run: 3, Failures: 0, Errors: 0, Skipped: 0, Time elapsed: 0.046 sec
Running org.apache.commons.beanutils.BeanPropertyValueChangeClosureTestCase
Feb 4, 2008 1:30:42 AM org.apache.commons.beanutils.BeanPropertyValueChangeClosure execute
SEVERE: ERROR: Unable to execute Closure. Null value encountered in property path...
java.lang.IllegalArgumentException: Cannot invoke org.apache.commons.beanutils.TestBean.setFloatProperty on bean class 'class org.apache.commons.beanutils.TestBean' - argument type mismatch - had objects of type "java.lang.String" but expected signature "float"
	at org.apache.commons.beanutils.PropertyUtilsBean.invokeMethod(PropertyUtilsBean.java:2094)
	at org.apache.commons.beanutils.PropertyUtilsBean.setSimpleProperty(PropertyUtilsBean.java:2054)
	at org.apache.commons.beanutils.PropertyUtilsBean.setNestedProperty(PropertyUtilsBean.java:1861)
	at org.apache.commons.beanutils.PropertyUtilsBean.setProperty(PropertyUtilsBean.java:1967)
	at org.apache.commons.beanutils.PropertyUtils.setProperty(PropertyUtils.java:858)
	at org.apache.commons.beanutils.BeanPropertyValueChangeClosure.execute(BeanPropertyValueChangeClosure.java:166)
	at org.apache.commons.beanutils.BeanPropertyValueChangeClosureTestCase.testExecuteWithSimpleFloatPropertyAndStringValue(BeanPropertyValueChangeClosureTestCase.java:59)
	at sun.reflect.NativeMethodAccessorImpl.invoke0(Native Method)
	at sun.reflect.NativeMethodAccessorImpl.invoke(NativeMethodAccessorImpl.java:39)
	at sun.reflect.DelegatingMethodAccessorImpl.invoke(DelegatingMethodAccessorImpl.java:25)
	at java.lang.reflect.Method.invoke(Method.java:324)
	at junit.framework.TestCase.runTest(TestCase.java:154)
	at junit.framework.TestCase.runBare(TestCase.java:127)
	at junit.framework.TestResult$1.protect(TestResult.java:106)
	at junit.framework.TestResult.runProtected(TestResult.java:124)
	at junit.framework.TestResult.run(TestResult.java:109)
	at junit.framework.TestCase.run(TestCase.java:118)
	at junit.framework.TestSuite.runTest(TestSuite.java:208)
	at junit.framework.TestSuite.run(TestSuite.java:203)
	at sun.reflect.NativeMethodAccessorImpl.invoke0(Native Method)
	at sun.reflect.NativeMethodAccessorImpl.invoke(NativeMethodAccessorImpl.java:39)
	at sun.reflect.DelegatingMethodAccessorImpl.invoke(DelegatingMethodAccessorImpl.java:25)
	at java.lang.reflect.Method.invoke(Method.java:324)
	at org.apache.maven.surefire.junit.JUnitTestSet.execute(JUnitTestSet.java:213)
	at org.apache.maven.surefire.suite.AbstractDirectoryTestSuite.executeTestSet(AbstractDirectoryTestSuite.java:138)
	at org.apache.maven.surefire.suite.AbstractDirectoryTestSuite.execute(AbstractDirectoryTestSuite.java:163)
	at org.apache.maven.surefire.Surefire.run(Surefire.java:84)
	at sun.reflect.NativeMethodAccessorImpl.invoke0(Native Method)
	at sun.reflect.NativeMethodAccessorImpl.invoke(NativeMethodAccessorImpl.java:39)
	at sun.reflect.DelegatingMethodAccessorImpl.invoke(DelegatingMethodAccessorImpl.java:25)
	at java.lang.reflect.Method.invoke(Method.java:324)
	at org.apache.maven.surefire.booter.SurefireBooter.runSuitesInProcess(SurefireBooter.java:244)
	at org.apache.maven.surefire.booter.SurefireBooter.main(SurefireBooter.java:814)
Caused by: java.lang.IllegalArgumentException: argument type mismatch
	at sun.reflect.NativeMethodAccessorImpl.invoke0(Native Method)
	at sun.reflect.NativeMethodAccessorImpl.invoke(NativeMethodAccessorImpl.java:39)
	at sun.reflect.DelegatingMethodAccessorImpl.invoke(DelegatingMethodAccessorImpl.java:25)
	at java.lang.reflect.Method.invoke(Method.java:324)
	at org.apache.commons.beanutils.PropertyUtilsBean.invokeMethod(PropertyUtilsBean.java:2068)
	... 32 more
Feb 4, 2008 1:30:42 AM org.apache.commons.beanutils.BeanPropertyValueChangeClosure execute
SEVERE: ERROR: Unable to execute Closure. Null value encountered in property path...
java.lang.IllegalArgumentException: Cannot invoke org.apache.commons.beanutils.TestBean.setFloatProperty on bean class 'class org.apache.commons.beanutils.TestBean' - argument type mismatch - had objects of type "java.lang.Double" but expected signature "float"
	at org.apache.commons.beanutils.PropertyUtilsBean.invokeMethod(PropertyUtilsBean.java:2094)
	at org.apache.commons.beanutils.PropertyUtilsBean.setSimpleProperty(PropertyUtilsBean.java:2054)
	at org.apache.commons.beanutils.PropertyUtilsBean.setNestedProperty(PropertyUtilsBean.java:1861)
	at org.apache.commons.beanutils.PropertyUtilsBean.setProperty(PropertyUtilsBean.java:1967)
	at org.apache.commons.beanutils.PropertyUtils.setProperty(PropertyUtils.java:858)
	at org.apache.commons.beanutils.BeanPropertyValueChangeClosure.execute(BeanPropertyValueChangeClosure.java:166)
	at org.apache.commons.beanutils.BeanPropertyValueChangeClosureTestCase.testExecuteWithSimpleFloatPropertyAndDoubleValue(BeanPropertyValueChangeClosureTestCase.java:71)
	at sun.reflect.NativeMethodAccessorImpl.invoke0(Native Method)
	at sun.reflect.NativeMethodAccessorImpl.invoke(NativeMethodAccessorImpl.java:39)
	at sun.reflect.DelegatingMethodAccessorImpl.invoke(DelegatingMethodAccessorImpl.java:25)
	at java.lang.reflect.Method.invoke(Method.java:324)
	at junit.framework.TestCase.runTest(TestCase.java:154)
	at junit.framework.TestCase.runBare(TestCase.java:127)
	at junit.framework.TestResult$1.protect(TestResult.java:106)
	at junit.framework.TestResult.runProtected(TestResult.java:124)
	at junit.framework.TestResult.run(TestResult.java:109)
	at junit.framework.TestCase.run(TestCase.java:118)
	at junit.framework.TestSuite.runTest(TestSuite.java:208)
	at junit.framework.TestSuite.run(TestSuite.java:203)
	at sun.reflect.NativeMethodAccessorImpl.invoke0(Native Method)
	at sun.reflect.NativeMethodAccessorImpl.invoke(NativeMethodAccessorImpl.java:39)
	at sun.reflect.DelegatingMethodAccessorImpl.invoke(DelegatingMethodAccessorImpl.java:25)
	at java.lang.reflect.Method.invoke(Method.java:324)
	at org.apache.maven.surefire.junit.JUnitTestSet.execute(JUnitTestSet.java:213)
	at org.apache.maven.surefire.suite.AbstractDirectoryTestSuite.executeTestSet(AbstractDirectoryTestSuite.java:138)
	at org.apache.maven.surefire.suite.AbstractDirectoryTestSuite.execute(AbstractDirectoryTestSuite.java:163)
	at org.apache.maven.surefire.Surefire.run(Surefire.java:84)
	at sun.reflect.NativeMethodAccessorImpl.invoke0(Native Method)
	at sun.reflect.NativeMethodAccessorImpl.invoke(NativeMethodAccessorImpl.java:39)
	at sun.reflect.DelegatingMethodAccessorImpl.invoke(DelegatingMethodAccessorImpl.java:25)
	at java.lang.reflect.Method.invoke(Method.java:324)
	at org.apache.maven.surefire.booter.SurefireBooter.runSuitesInProcess(SurefireBooter.java:244)
	at org.apache.maven.surefire.booter.SurefireBooter.main(SurefireBooter.java:814)
Caused by: java.lang.IllegalArgumentException: argument type mismatch
	at sun.reflect.NativeMethodAccessorImpl.invoke0(Native Method)
	at sun.reflect.NativeMethodAccessorImpl.invoke(NativeMethodAccessorImpl.java:39)
	at sun.reflect.DelegatingMethodAccessorImpl.invoke(DelegatingMethodAccessorImpl.java:25)
	at java.lang.reflect.Method.invoke(Method.java:324)
	at org.apache.commons.beanutils.PropertyUtilsBean.invokeMethod(PropertyUtilsBean.java:2068)
	... 32 more
Feb 4, 2008 1:30:42 AM org.apache.commons.beanutils.BeanPropertyValueChangeClosure execute
SEVERE: ERROR: Unable to execute Closure. Null value encountered in property path...
java.lang.IllegalArgumentException: Cannot invoke org.apache.commons.beanutils.TestBean.setDoubleProperty on bean class 'class org.apache.commons.beanutils.TestBean' - argument type mismatch - had objects of type "java.lang.String" but expected signature "double"
	at org.apache.commons.beanutils.PropertyUtilsBean.invokeMethod(PropertyUtilsBean.java:2094)
	at org.apache.commons.beanutils.PropertyUtilsBean.setSimpleProperty(PropertyUtilsBean.java:2054)
	at org.apache.commons.beanutils.PropertyUtilsBean.setNestedProperty(PropertyUtilsBean.java:1861)
	at org.apache.commons.beanutils.PropertyUtilsBean.setProperty(PropertyUtilsBean.java:1967)
	at org.apache.commons.beanutils.PropertyUtils.setProperty(PropertyUtils.java:858)
	at org.apache.commons.beanutils.BeanPropertyValueChangeClosure.execute(BeanPropertyValueChangeClosure.java:166)
	at org.apache.commons.beanutils.BeanPropertyValueChangeClosureTestCase.testExecuteWithSimpleDoublePropertyAndStringValue(BeanPropertyValueChangeClosureTestCase.java:101)
	at sun.reflect.NativeMethodAccessorImpl.invoke0(Native Method)
	at sun.reflect.NativeMethodAccessorImpl.invoke(NativeMethodAccessorImpl.java:39)
	at sun.reflect.DelegatingMethodAccessorImpl.invoke(DelegatingMethodAccessorImpl.java:25)
	at java.lang.reflect.Method.invoke(Method.java:324)
	at junit.framework.TestCase.runTest(TestCase.java:154)
	at junit.framework.TestCase.runBare(TestCase.java:127)
	at junit.framework.TestResult$1.protect(TestResult.java:106)
	at junit.framework.TestResult.runProtected(TestResult.java:124)
	at junit.framework.TestResult.run(TestResult.java:109)
	at junit.framework.TestCase.run(TestCase.java:118)
	at junit.framework.TestSuite.runTest(TestSuite.java:208)
	at junit.framework.TestSuite.run(TestSuite.java:203)
	at sun.reflect.NativeMethodAccessorImpl.invoke0(Native Method)
	at sun.reflect.NativeMethodAccessorImpl.invoke(NativeMethodAccessorImpl.java:39)
	at sun.reflect.DelegatingMethodAccessorImpl.invoke(DelegatingMethodAccessorImpl.java:25)
	at java.lang.reflect.Method.invoke(Method.java:324)
	at org.apache.maven.surefire.junit.JUnitTestSet.execute(JUnitTestSet.java:213)
	at org.apache.maven.surefire.suite.AbstractDirectoryTestSuite.executeTestSet(AbstractDirectoryTestSuite.java:138)
	at org.apache.maven.surefire.suite.AbstractDirectoryTestSuite.execute(AbstractDirectoryTestSuite.java:163)
	at org.apache.maven.surefire.Surefire.run(Surefire.java:84)
	at sun.reflect.NativeMethodAccessorImpl.invoke0(Native Method)
	at sun.reflect.NativeMethodAccessorImpl.invoke(NativeMethodAccessorImpl.java:39)
	at sun.reflect.DelegatingMethodAccessorImpl.invoke(DelegatingMethodAccessorImpl.java:25)
	at java.lang.reflect.Method.invoke(Method.java:324)
	at org.apache.maven.surefire.booter.SurefireBooter.runSuitesInProcess(SurefireBooter.java:244)
	at org.apache.maven.surefire.booter.SurefireBooter.main(SurefireBooter.java:814)
Caused by: java.lang.IllegalArgumentException: argument type mismatch
	at sun.reflect.NativeMethodAccessorImpl.invoke0(Native Method)
	at sun.reflect.NativeMethodAccessorImpl.invoke(NativeMethodAccessorImpl.java:39)
	at sun.reflect.DelegatingMethodAccessorImpl.invoke(DelegatingMethodAccessorImpl.java:25)
	at java.lang.reflect.Method.invoke(Method.java:324)
	at org.apache.commons.beanutils.PropertyUtilsBean.invokeMethod(PropertyUtilsBean.java:2068)
	... 32 more
Feb 4, 2008 1:30:42 AM org.apache.commons.beanutils.BeanPropertyValueChangeClosure execute
SEVERE: ERROR: Unable to execute Closure. Null value encountered in property path...
java.lang.IllegalArgumentException: Cannot invoke org.apache.commons.beanutils.TestBean.setIntProperty on bean class 'class org.apache.commons.beanutils.TestBean' - argument type mismatch - had objects of type "java.lang.Double" but expected signature "int"
	at org.apache.commons.beanutils.PropertyUtilsBean.invokeMethod(PropertyUtilsBean.java:2094)
	at org.apache.commons.beanutils.PropertyUtilsBean.setSimpleProperty(PropertyUtilsBean.java:2054)
	at org.apache.commons.beanutils.PropertyUtilsBean.setNestedProperty(PropertyUtilsBean.java:1861)
	at org.apache.commons.beanutils.PropertyUtilsBean.setProperty(PropertyUtilsBean.java:1967)
	at org.apache.commons.beanutils.PropertyUtils.setProperty(PropertyUtils.java:858)
	at org.apache.commons.beanutils.BeanPropertyValueChangeClosure.execute(BeanPropertyValueChangeClosure.java:166)
	at org.apache.commons.beanutils.BeanPropertyValueChangeClosureTestCase.testExecuteWithSimpleIntPropertyAndDoubleValue(BeanPropertyValueChangeClosureTestCase.java:131)
	at sun.reflect.NativeMethodAccessorImpl.invoke0(Native Method)
	at sun.reflect.NativeMethodAccessorImpl.invoke(NativeMethodAccessorImpl.java:39)
	at sun.reflect.DelegatingMethodAccessorImpl.invoke(DelegatingMethodAccessorImpl.java:25)
	at java.lang.reflect.Method.invoke(Method.java:324)
	at junit.framework.TestCase.runTest(TestCase.java:154)
	at junit.framework.TestCase.runBare(TestCase.java:127)
	at junit.framework.TestResult$1.protect(TestResult.java:106)
	at junit.framework.TestResult.runProtected(TestResult.java:124)
	at junit.framework.TestResult.run(TestResult.java:109)
	at junit.framework.TestCase.run(TestCase.java:118)
	at junit.framework.TestSuite.runTest(TestSuite.java:208)
	at junit.framework.TestSuite.run(TestSuite.java:203)
	at sun.reflect.NativeMethodAccessorImpl.invoke0(Native Method)
	at sun.reflect.NativeMethodAccessorImpl.invoke(NativeMethodAccessorImpl.java:39)
	at sun.reflect.DelegatingMethodAccessorImpl.invoke(DelegatingMethodAccessorImpl.java:25)
	at java.lang.reflect.Method.invoke(Method.java:324)
	at org.apache.maven.surefire.junit.JUnitTestSet.execute(JUnitTestSet.java:213)
	at org.apache.maven.surefire.suite.AbstractDirectoryTestSuite.executeTestSet(AbstractDirectoryTestSuite.java:138)
	at org.apache.maven.surefire.suite.AbstractDirectoryTestSuite.execute(AbstractDirectoryTestSuite.java:163)
	at org.apache.maven.surefire.Surefire.run(Surefire.java:84)
	at sun.reflect.NativeMethodAccessorImpl.invoke0(Native Method)
	at sun.reflect.NativeMethodAccessorImpl.invoke(NativeMethodAccessorImpl.java:39)
	at sun.reflect.DelegatingMethodAccessorImpl.invoke(DelegatingMethodAccessorImpl.java:25)
	at java.lang.reflect.Method.invoke(Method.java:324)
	at org.apache.maven.surefire.booter.SurefireBooter.runSuitesInProcess(SurefireBooter.java:244)
	at org.apache.maven.surefire.booter.SurefireBooter.main(SurefireBooter.java:814)
Caused by: java.lang.IllegalArgumentException: argument type mismatch
	at sun.reflect.NativeMethodAccessorImpl.invoke0(Native Method)
	at sun.reflect.NativeMethodAccessorImpl.invoke(NativeMethodAccessorImpl.java:39)
	at sun.reflect.DelegatingMethodAccessorImpl.invoke(DelegatingMethodAccessorImpl.java:25)
	at java.lang.reflect.Method.invoke(Method.java:324)
	at org.apache.commons.beanutils.PropertyUtilsBean.invokeMethod(PropertyUtilsBean.java:2068)
	... 32 more
Feb 4, 2008 1:30:42 AM org.apache.commons.beanutils.BeanPropertyValueChangeClosure execute
SEVERE: ERROR: Unable to execute Closure. Null value encountered in property path...
java.lang.IllegalArgumentException: Cannot invoke org.apache.commons.beanutils.TestBean.setIntProperty on bean class 'class org.apache.commons.beanutils.TestBean' - argument type mismatch - had objects of type "java.lang.String" but expected signature "int"
	at org.apache.commons.beanutils.PropertyUtilsBean.invokeMethod(PropertyUtilsBean.java:2094)
	at org.apache.commons.beanutils.PropertyUtilsBean.setSimpleProperty(PropertyUtilsBean.java:2054)
	at org.apache.commons.beanutils.PropertyUtilsBean.setNestedProperty(PropertyUtilsBean.java:1861)
	at org.apache.commons.beanutils.PropertyUtilsBean.setProperty(PropertyUtilsBean.java:1967)
	at org.apache.commons.beanutils.PropertyUtils.setProperty(PropertyUtils.java:858)
	at org.apache.commons.beanutils.BeanPropertyValueChangeClosure.execute(BeanPropertyValueChangeClosure.java:166)
	at org.apache.commons.beanutils.BeanPropertyValueChangeClosureTestCase.testExecuteWithSimpleIntPropertyAndStringValue(BeanPropertyValueChangeClosureTestCase.java:143)
	at sun.reflect.NativeMethodAccessorImpl.invoke0(Native Method)
	at sun.reflect.NativeMethodAccessorImpl.invoke(NativeMethodAccessorImpl.java:39)
	at sun.reflect.DelegatingMethodAccessorImpl.invoke(DelegatingMethodAccessorImpl.java:25)
	at java.lang.reflect.Method.invoke(Method.java:324)
	at junit.framework.TestCase.runTest(TestCase.java:154)
	at junit.framework.TestCase.runBare(TestCase.java:127)
	at junit.framework.TestResult$1.protect(TestResult.java:106)
	at junit.framework.TestResult.runProtected(TestResult.java:124)
	at junit.framework.TestResult.run(TestResult.java:109)
	at junit.framework.TestCase.run(TestCase.java:118)
	at junit.framework.TestSuite.runTest(TestSuite.java:208)
	at junit.framework.TestSuite.run(TestSuite.java:203)
	at sun.reflect.NativeMethodAccessorImpl.invoke0(Native Method)
	at sun.reflect.NativeMethodAccessorImpl.invoke(NativeMethodAccessorImpl.java:39)
	at sun.reflect.DelegatingMethodAccessorImpl.invoke(DelegatingMethodAccessorImpl.java:25)
	at java.lang.reflect.Method.invoke(Method.java:324)
	at org.apache.maven.surefire.junit.JUnitTestSet.execute(JUnitTestSet.java:213)
	at org.apache.maven.surefire.suite.AbstractDirectoryTestSuite.executeTestSet(AbstractDirectoryTestSuite.java:138)
	at org.apache.maven.surefire.suite.AbstractDirectoryTestSuite.execute(AbstractDirectoryTestSuite.java:163)
	at org.apache.maven.surefire.Surefire.run(Surefire.java:84)
	at sun.reflect.NativeMethodAccessorImpl.invoke0(Native Method)
	at sun.reflect.NativeMethodAccessorImpl.invoke(NativeMethodAccessorImpl.java:39)
	at sun.reflect.DelegatingMethodAccessorImpl.invoke(DelegatingMethodAccessorImpl.java:25)
	at java.lang.reflect.Method.invoke(Method.java:324)
	at org.apache.maven.surefire.booter.SurefireBooter.runSuitesInProcess(SurefireBooter.java:244)
	at org.apache.maven.surefire.booter.SurefireBooter.main(SurefireBooter.java:814)
Caused by: java.lang.IllegalArgumentException: argument type mismatch
	at sun.reflect.NativeMethodAccessorImpl.invoke0(Native Method)
	at sun.reflect.NativeMethodAccessorImpl.invoke(NativeMethodAccessorImpl.java:39)
	at sun.reflect.DelegatingMethodAccessorImpl.invoke(DelegatingMethodAccessorImpl.java:25)
	at java.lang.reflect.Method.invoke(Method.java:324)
	at org.apache.commons.beanutils.PropertyUtilsBean.invokeMethod(PropertyUtilsBean.java:2068)
	... 32 more
Feb 4, 2008 1:30:42 AM org.apache.commons.beanutils.BeanPropertyValueChangeClosure execute
SEVERE: ERROR: Unable to execute Closure. Null value encountered in property path...
java.lang.IllegalArgumentException: Cannot invoke org.apache.commons.beanutils.TestBean.setIntProperty on bean class 'class org.apache.commons.beanutils.TestBean' - argument type mismatch - had objects of type "java.lang.Float" but expected signature "int"
	at org.apache.commons.beanutils.PropertyUtilsBean.invokeMethod(PropertyUtilsBean.java:2094)
	at org.apache.commons.beanutils.PropertyUtilsBean.setSimpleProperty(PropertyUtilsBean.java:2054)
	at org.apache.commons.beanutils.PropertyUtilsBean.setNestedProperty(PropertyUtilsBean.java:1861)
	at org.apache.commons.beanutils.PropertyUtilsBean.setProperty(PropertyUtilsBean.java:1967)
	at org.apache.commons.beanutils.PropertyUtils.setProperty(PropertyUtils.java:858)
	at org.apache.commons.beanutils.BeanPropertyValueChangeClosure.execute(BeanPropertyValueChangeClosure.java:166)
	at org.apache.commons.beanutils.BeanPropertyValueChangeClosureTestCase.testExecuteWithSimpleIntPropertyAndFloatValue(BeanPropertyValueChangeClosureTestCase.java:155)
	at sun.reflect.NativeMethodAccessorImpl.invoke0(Native Method)
	at sun.reflect.NativeMethodAccessorImpl.invoke(NativeMethodAccessorImpl.java:39)
	at sun.reflect.DelegatingMethodAccessorImpl.invoke(DelegatingMethodAccessorImpl.java:25)
	at java.lang.reflect.Method.invoke(Method.java:324)
	at junit.framework.TestCase.runTest(TestCase.java:154)
	at junit.framework.TestCase.runBare(TestCase.java:127)
	at junit.framework.TestResult$1.protect(TestResult.java:106)
	at junit.framework.TestResult.runProtected(TestResult.java:124)
	at junit.framework.TestResult.run(TestResult.java:109)
	at junit.framework.TestCase.run(TestCase.java:118)
	at junit.framework.TestSuite.runTest(TestSuite.java:208)
	at junit.framework.TestSuite.run(TestSuite.java:203)
	at sun.reflect.NativeMethodAccessorImpl.invoke0(Native Method)
	at sun.reflect.NativeMethodAccessorImpl.invoke(NativeMethodAccessorImpl.java:39)
	at sun.reflect.DelegatingMethodAccessorImpl.invoke(DelegatingMethodAccessorImpl.java:25)
	at java.lang.reflect.Method.invoke(Method.java:324)
	at org.apache.maven.surefire.junit.JUnitTestSet.execute(JUnitTestSet.java:213)
	at org.apache.maven.surefire.suite.AbstractDirectoryTestSuite.executeTestSet(AbstractDirectoryTestSuite.java:138)
	at org.apache.maven.surefire.suite.AbstractDirectoryTestSuite.execute(AbstractDirectoryTestSuite.java:163)
	at org.apache.maven.surefire.Surefire.run(Surefire.java:84)
	at sun.reflect.NativeMethodAccessorImpl.invoke0(Native Method)
	at sun.reflect.NativeMethodAccessorImpl.invoke(NativeMethodAccessorImpl.java:39)
	at sun.reflect.DelegatingMethodAccessorImpl.invoke(DelegatingMethodAccessorImpl.java:25)
	at java.lang.reflect.Method.invoke(Method.java:324)
	at org.apache.maven.surefire.booter.SurefireBooter.runSuitesInProcess(SurefireBooter.java:244)
	at org.apache.maven.surefire.booter.SurefireBooter.main(SurefireBooter.java:814)
Caused by: java.lang.IllegalArgumentException: argument type mismatch
	at sun.reflect.NativeMethodAccessorImpl.invoke0(Native Method)
	at sun.reflect.NativeMethodAccessorImpl.invoke(NativeMethodAccessorImpl.java:39)
	at sun.reflect.DelegatingMethodAccessorImpl.invoke(DelegatingMethodAccessorImpl.java:25)
	at java.lang.reflect.Method.invoke(Method.java:324)
	at org.apache.commons.beanutils.PropertyUtilsBean.invokeMethod(PropertyUtilsBean.java:2068)
	... 32 more
Feb 4, 2008 1:30:42 AM org.apache.commons.beanutils.BeanPropertyValueChangeClosure execute
SEVERE: ERROR: Unable to execute Closure. Null value encountered in property path...
java.lang.IllegalArgumentException: Cannot invoke org.apache.commons.beanutils.TestBean.setBooleanProperty on bean class 'class org.apache.commons.beanutils.TestBean' - argument type mismatch - had objects of type "java.lang.String" but expected signature "boolean"
	at org.apache.commons.beanutils.PropertyUtilsBean.invokeMethod(PropertyUtilsBean.java:2094)
	at org.apache.commons.beanutils.PropertyUtilsBean.setSimpleProperty(PropertyUtilsBean.java:2054)
	at org.apache.commons.beanutils.PropertyUtilsBean.setNestedProperty(PropertyUtilsBean.java:1861)
	at org.apache.commons.beanutils.PropertyUtilsBean.setProperty(PropertyUtilsBean.java:1967)
	at org.apache.commons.beanutils.PropertyUtils.setProperty(PropertyUtils.java:858)
	at org.apache.commons.beanutils.BeanPropertyValueChangeClosure.execute(BeanPropertyValueChangeClosure.java:166)
	at org.apache.commons.beanutils.BeanPropertyValueChangeClosureTestCase.testExecuteWithSimpleBooleanPropertyAndStringValue(BeanPropertyValueChangeClosureTestCase.java:185)
	at sun.reflect.NativeMethodAccessorImpl.invoke0(Native Method)
	at sun.reflect.NativeMethodAccessorImpl.invoke(NativeMethodAccessorImpl.java:39)
	at sun.reflect.DelegatingMethodAccessorImpl.invoke(DelegatingMethodAccessorImpl.java:25)
	at java.lang.reflect.Method.invoke(Method.java:324)
	at junit.framework.TestCase.runTest(TestCase.java:154)
	at junit.framework.TestCase.runBare(TestCase.java:127)
	at junit.framework.TestResult$1.protect(TestResult.java:106)
	at junit.framework.TestResult.runProtected(TestResult.java:124)
	at junit.framework.TestResult.run(TestResult.java:109)
	at junit.framework.TestCase.run(TestCase.java:118)
	at junit.framework.TestSuite.runTest(TestSuite.java:208)
	at junit.framework.TestSuite.run(TestSuite.java:203)
	at sun.reflect.NativeMethodAccessorImpl.invoke0(Native Method)
	at sun.reflect.NativeMethodAccessorImpl.invoke(NativeMethodAccessorImpl.java:39)
	at sun.reflect.DelegatingMethodAccessorImpl.invoke(DelegatingMethodAccessorImpl.java:25)
	at java.lang.reflect.Method.invoke(Method.java:324)
	at org.apache.maven.surefire.junit.JUnitTestSet.execute(JUnitTestSet.java:213)
	at org.apache.maven.surefire.suite.AbstractDirectoryTestSuite.executeTestSet(AbstractDirectoryTestSuite.java:138)
	at org.apache.maven.surefire.suite.AbstractDirectoryTestSuite.execute(AbstractDirectoryTestSuite.java:163)
	at org.apache.maven.surefire.Surefire.run(Surefire.java:84)
	at sun.reflect.NativeMethodAccessorImpl.invoke0(Native Method)
	at sun.reflect.NativeMethodAccessorImpl.invoke(NativeMethodAccessorImpl.java:39)
	at sun.reflect.DelegatingMethodAccessorImpl.invoke(DelegatingMethodAccessorImpl.java:25)
	at java.lang.reflect.Method.invoke(Method.java:324)
	at org.apache.maven.surefire.booter.SurefireBooter.runSuitesInProcess(SurefireBooter.java:244)
	at org.apache.maven.surefire.booter.SurefireBooter.main(SurefireBooter.java:814)
Caused by: java.lang.IllegalArgumentException: argument type mismatch
	at sun.reflect.NativeMethodAccessorImpl.invoke0(Native Method)
	at sun.reflect.NativeMethodAccessorImpl.invoke(NativeMethodAccessorImpl.java:39)
	at sun.reflect.DelegatingMethodAccessorImpl.invoke(DelegatingMethodAccessorImpl.java:25)
	at java.lang.reflect.Method.invoke(Method.java:324)
	at org.apache.commons.beanutils.PropertyUtilsBean.invokeMethod(PropertyUtilsBean.java:2068)
	... 32 more
Feb 4, 2008 1:30:42 AM org.apache.commons.beanutils.BeanPropertyValueChangeClosure execute
SEVERE: ERROR: Unable to execute Closure. Null value encountered in property path...
java.lang.IllegalArgumentException: Cannot invoke org.apache.commons.beanutils.TestBean.setByteProperty on bean class 'class org.apache.commons.beanutils.TestBean' - argument type mismatch - had objects of type "java.lang.String" but expected signature "byte"
	at org.apache.commons.beanutils.PropertyUtilsBean.invokeMethod(PropertyUtilsBean.java:2094)
	at org.apache.commons.beanutils.PropertyUtilsBean.setSimpleProperty(PropertyUtilsBean.java:2054)
	at org.apache.commons.beanutils.PropertyUtilsBean.setNestedProperty(PropertyUtilsBean.java:1861)
	at org.apache.commons.beanutils.PropertyUtilsBean.setProperty(PropertyUtilsBean.java:1967)
	at org.apache.commons.beanutils.PropertyUtils.setProperty(PropertyUtils.java:858)
	at org.apache.commons.beanutils.BeanPropertyValueChangeClosure.execute(BeanPropertyValueChangeClosure.java:166)
	at org.apache.commons.beanutils.BeanPropertyValueChangeClosureTestCase.testExecuteWithSimpleBytePropertyAndStringValue(BeanPropertyValueChangeClosureTestCase.java:206)
	at sun.reflect.NativeMethodAccessorImpl.invoke0(Native Method)
	at sun.reflect.NativeMethodAccessorImpl.invoke(NativeMethodAccessorImpl.java:39)
	at sun.reflect.DelegatingMethodAccessorImpl.invoke(DelegatingMethodAccessorImpl.java:25)
	at java.lang.reflect.Method.invoke(Method.java:324)
	at junit.framework.TestCase.runTest(TestCase.java:154)
	at junit.framework.TestCase.runBare(TestCase.java:127)
	at junit.framework.TestResult$1.protect(TestResult.java:106)
	at junit.framework.TestResult.runProtected(TestResult.java:124)
	at junit.framework.TestResult.run(TestResult.java:109)
	at junit.framework.TestCase.run(TestCase.java:118)
	at junit.framework.TestSuite.runTest(TestSuite.java:208)
	at junit.framework.TestSuite.run(TestSuite.java:203)
	at sun.reflect.NativeMethodAccessorImpl.invoke0(Native Method)
	at sun.reflect.NativeMethodAccessorImpl.invoke(NativeMethodAccessorImpl.java:39)
	at sun.reflect.DelegatingMethodAccessorImpl.invoke(DelegatingMethodAccessorImpl.java:25)
	at java.lang.reflect.Method.invoke(Method.java:324)
	at org.apache.maven.surefire.junit.JUnitTestSet.execute(JUnitTestSet.java:213)
	at org.apache.maven.surefire.suite.AbstractDirectoryTestSuite.executeTestSet(AbstractDirectoryTestSuite.java:138)
	at org.apache.maven.surefire.suite.AbstractDirectoryTestSuite.execute(AbstractDirectoryTestSuite.java:163)
	at org.apache.maven.surefire.Surefire.run(Surefire.java:84)
	at sun.reflect.NativeMethodAccessorImpl.invoke0(Native Method)
	at sun.reflect.NativeMethodAccessorImpl.invoke(NativeMethodAccessorImpl.java:39)
	at sun.reflect.DelegatingMethodAccessorImpl.invoke(DelegatingMethodAccessorImpl.java:25)
	at java.lang.reflect.Method.invoke(Method.java:324)
	at org.apache.maven.surefire.booter.SurefireBooter.runSuitesInProcess(SurefireBooter.java:244)
	at org.apache.maven.surefire.booter.SurefireBooter.main(SurefireBooter.java:814)
Caused by: java.lang.IllegalArgumentException: argument type mismatch
	at sun.reflect.NativeMethodAccessorImpl.invoke0(Native Method)
	at sun.reflect.NativeMethodAccessorImpl.invoke(NativeMethodAccessorImpl.java:39)
	at sun.reflect.DelegatingMethodAccessorImpl.invoke(DelegatingMethodAccessorImpl.java:25)
	at java.lang.reflect.Method.invoke(Method.java:324)
	at org.apache.commons.beanutils.PropertyUtilsBean.invokeMethod(PropertyUtilsBean.java:2068)
	... 32 more
Feb 4, 2008 1:30:42 AM org.apache.commons.beanutils.BeanPropertyValueChangeClosure execute
SEVERE: Property not found
java.lang.NoSuchMethodException: Property 'readOnlyProperty' has no setter method in class 'class org.apache.commons.beanutils.TestBean'
	at org.apache.commons.beanutils.PropertyUtilsBean.setSimpleProperty(PropertyUtilsBean.java:2041)
	at org.apache.commons.beanutils.PropertyUtilsBean.setNestedProperty(PropertyUtilsBean.java:1861)
	at org.apache.commons.beanutils.PropertyUtilsBean.setProperty(PropertyUtilsBean.java:1967)
	at org.apache.commons.beanutils.PropertyUtils.setProperty(PropertyUtils.java:858)
	at org.apache.commons.beanutils.BeanPropertyValueChangeClosure.execute(BeanPropertyValueChangeClosure.java:166)
	at org.apache.commons.beanutils.BeanPropertyValueChangeClosureTestCase.testExecuteWithReadOnlyProperty(BeanPropertyValueChangeClosureTestCase.java:230)
	at sun.reflect.NativeMethodAccessorImpl.invoke0(Native Method)
	at sun.reflect.NativeMethodAccessorImpl.invoke(NativeMethodAccessorImpl.java:39)
	at sun.reflect.DelegatingMethodAccessorImpl.invoke(DelegatingMethodAccessorImpl.java:25)
	at java.lang.reflect.Method.invoke(Method.java:324)
	at junit.framework.TestCase.runTest(TestCase.java:154)
	at junit.framework.TestCase.runBare(TestCase.java:127)
	at junit.framework.TestResult$1.protect(TestResult.java:106)
	at junit.framework.TestResult.runProtected(TestResult.java:124)
	at junit.framework.TestResult.run(TestResult.java:109)
	at junit.framework.TestCase.run(TestCase.java:118)
	at junit.framework.TestSuite.runTest(TestSuite.java:208)
	at junit.framework.TestSuite.run(TestSuite.java:203)
	at sun.reflect.NativeMethodAccessorImpl.invoke0(Native Method)
	at sun.reflect.NativeMethodAccessorImpl.invoke(NativeMethodAccessorImpl.java:39)
	at sun.reflect.DelegatingMethodAccessorImpl.invoke(DelegatingMethodAccessorImpl.java:25)
	at java.lang.reflect.Method.invoke(Method.java:324)
	at org.apache.maven.surefire.junit.JUnitTestSet.execute(JUnitTestSet.java:213)
	at org.apache.maven.surefire.suite.AbstractDirectoryTestSuite.executeTestSet(AbstractDirectoryTestSuite.java:138)
	at org.apache.maven.surefire.suite.AbstractDirectoryTestSuite.execute(AbstractDirectoryTestSuite.java:163)
	at org.apache.maven.surefire.Surefire.run(Surefire.java:84)
	at sun.reflect.NativeMethodAccessorImpl.invoke0(Native Method)
	at sun.reflect.NativeMethodAccessorImpl.invoke(NativeMethodAccessorImpl.java:39)
	at sun.reflect.DelegatingMethodAccessorImpl.invoke(DelegatingMethodAccessorImpl.java:25)
	at java.lang.reflect.Method.invoke(Method.java:324)
	at org.apache.maven.surefire.booter.SurefireBooter.runSuitesInProcess(SurefireBooter.java:244)
	at org.apache.maven.surefire.booter.SurefireBooter.main(SurefireBooter.java:814)
Feb 4, 2008 1:30:42 AM org.apache.commons.beanutils.BeanPropertyValueChangeClosure execute
SEVERE: ERROR: Unable to execute Closure. Null value encountered in property path...
org.apache.commons.beanutils.NestedNullException: Null property value for 'anotherNested.stringProperty' on bean class 'class org.apache.commons.beanutils.TestBean'
	at org.apache.commons.beanutils.PropertyUtilsBean.setNestedProperty(PropertyUtilsBean.java:1846)
	at org.apache.commons.beanutils.PropertyUtilsBean.setProperty(PropertyUtilsBean.java:1967)
	at org.apache.commons.beanutils.PropertyUtils.setProperty(PropertyUtils.java:858)
	at org.apache.commons.beanutils.BeanPropertyValueChangeClosure.execute(BeanPropertyValueChangeClosure.java:166)
	at org.apache.commons.beanutils.BeanPropertyValueChangeClosureTestCase.testExecuteWithNullInPropertyPath(BeanPropertyValueChangeClosureTestCase.java:260)
	at sun.reflect.NativeMethodAccessorImpl.invoke0(Native Method)
	at sun.reflect.NativeMethodAccessorImpl.invoke(NativeMethodAccessorImpl.java:39)
	at sun.reflect.DelegatingMethodAccessorImpl.invoke(DelegatingMethodAccessorImpl.java:25)
	at java.lang.reflect.Method.invoke(Method.java:324)
	at junit.framework.TestCase.runTest(TestCase.java:154)
	at junit.framework.TestCase.runBare(TestCase.java:127)
	at junit.framework.TestResult$1.protect(TestResult.java:106)
	at junit.framework.TestResult.runProtected(TestResult.java:124)
	at junit.framework.TestResult.run(TestResult.java:109)
	at junit.framework.TestCase.run(TestCase.java:118)
	at junit.framework.TestSuite.runTest(TestSuite.java:208)
	at junit.framework.TestSuite.run(TestSuite.java:203)
	at sun.reflect.NativeMethodAccessorImpl.invoke0(Native Method)
	at sun.reflect.NativeMethodAccessorImpl.invoke(NativeMethodAccessorImpl.java:39)
	at sun.reflect.DelegatingMethodAccessorImpl.invoke(DelegatingMethodAccessorImpl.java:25)
	at java.lang.reflect.Method.invoke(Method.java:324)
	at org.apache.maven.surefire.junit.JUnitTestSet.execute(JUnitTestSet.java:213)
	at org.apache.maven.surefire.suite.AbstractDirectoryTestSuite.executeTestSet(AbstractDirectoryTestSuite.java:138)
	at org.apache.maven.surefire.suite.AbstractDirectoryTestSuite.execute(AbstractDirectoryTestSuite.java:163)
	at org.apache.maven.surefire.Surefire.run(Surefire.java:84)
	at sun.reflect.NativeMethodAccessorImpl.invoke0(Native Method)
	at sun.reflect.NativeMethodAccessorImpl.invoke(NativeMethodAccessorImpl.java:39)
	at sun.reflect.DelegatingMethodAccessorImpl.invoke(DelegatingMethodAccessorImpl.java:25)
	at java.lang.reflect.Method.invoke(Method.java:324)
	at org.apache.maven.surefire.booter.SurefireBooter.runSuitesInProcess(SurefireBooter.java:244)
	at org.apache.maven.surefire.booter.SurefireBooter.main(SurefireBooter.java:814)
Feb 4, 2008 1:30:42 AM org.apache.commons.beanutils.BeanPropertyValueChangeClosure execute
WARNING: WARNING: Unable to execute Closure. Null value encountered in property path...
org.apache.commons.beanutils.NestedNullException: Null property value for 'anotherNested.stringProperty' on bean class 'class org.apache.commons.beanutils.TestBean'
	at org.apache.commons.beanutils.PropertyUtilsBean.setNestedProperty(PropertyUtilsBean.java:1846)
	at org.apache.commons.beanutils.PropertyUtilsBean.setProperty(PropertyUtilsBean.java:1967)
	at org.apache.commons.beanutils.PropertyUtils.setProperty(PropertyUtils.java:858)
	at org.apache.commons.beanutils.BeanPropertyValueChangeClosure.execute(BeanPropertyValueChangeClosure.java:166)
	at org.apache.commons.beanutils.BeanPropertyValueChangeClosureTestCase.testExecuteWithNullInPropertyPathAngIgnoreTrue(BeanPropertyValueChangeClosureTestCase.java:278)
	at sun.reflect.NativeMethodAccessorImpl.invoke0(Native Method)
	at sun.reflect.NativeMethodAccessorImpl.invoke(NativeMethodAccessorImpl.java:39)
	at sun.reflect.DelegatingMethodAccessorImpl.invoke(DelegatingMethodAccessorImpl.java:25)
	at java.lang.reflect.Method.invoke(Method.java:324)
	at junit.framework.TestCase.runTest(TestCase.java:154)
	at junit.framework.TestCase.runBare(TestCase.java:127)
	at junit.framework.TestResult$1.protect(TestResult.java:106)
	at junit.framework.TestResult.runProtected(TestResult.java:124)
	at junit.framework.TestResult.run(TestResult.java:109)
	at junit.framework.TestCase.run(TestCase.java:118)
	at junit.framework.TestSuite.runTest(TestSuite.java:208)
	at junit.framework.TestSuite.run(TestSuite.java:203)
	at sun.reflect.NativeMethodAccessorImpl.invoke0(Native Method)
	at sun.reflect.NativeMethodAccessorImpl.invoke(NativeMethodAccessorImpl.java:39)
	at sun.reflect.DelegatingMethodAccessorImpl.invoke(DelegatingMethodAccessorImpl.java:25)
	at java.lang.reflect.Method.invoke(Method.java:324)
	at org.apache.maven.surefire.junit.JUnitTestSet.execute(JUnitTestSet.java:213)
	at org.apache.maven.surefire.suite.AbstractDirectoryTestSuite.executeTestSet(AbstractDirectoryTestSuite.java:138)
	at org.apache.maven.surefire.suite.AbstractDirectoryTestSuite.execute(AbstractDirectoryTestSuite.java:163)
	at org.apache.maven.surefire.Surefire.run(Surefire.java:84)
	at sun.reflect.NativeMethodAccessorImpl.invoke0(Native Method)
	at sun.reflect.NativeMethodAccessorImpl.invoke(NativeMethodAccessorImpl.java:39)
	at sun.reflect.DelegatingMethodAccessorImpl.invoke(DelegatingMethodAccessorImpl.java:25)
	at java.lang.reflect.Method.invoke(Method.java:324)
	at org.apache.maven.surefire.booter.SurefireBooter.runSuitesInProcess(SurefireBooter.java:244)
	at org.apache.maven.surefire.booter.SurefireBooter.main(SurefireBooter.java:814)
Feb 4, 2008 1:30:42 AM org.apache.commons.beanutils.BeanPropertyValueChangeClosure execute
SEVERE: Property not found
java.lang.NoSuchMethodException: Unknown property 'bogusProperty' on class 'class org.apache.commons.beanutils.TestBean'
	at org.apache.commons.beanutils.PropertyUtilsBean.setSimpleProperty(PropertyUtilsBean.java:2036)
	at org.apache.commons.beanutils.PropertyUtilsBean.setNestedProperty(PropertyUtilsBean.java:1861)
	at org.apache.commons.beanutils.PropertyUtilsBean.setProperty(PropertyUtilsBean.java:1967)
	at org.apache.commons.beanutils.PropertyUtils.setProperty(PropertyUtils.java:858)
	at org.apache.commons.beanutils.BeanPropertyValueChangeClosure.execute(BeanPropertyValueChangeClosure.java:166)
	at org.apache.commons.beanutils.BeanPropertyValueChangeClosureTestCase.testExecuteWithInvalidPropertyName(BeanPropertyValueChangeClosureTestCase.java:316)
	at sun.reflect.NativeMethodAccessorImpl.invoke0(Native Method)
	at sun.reflect.NativeMethodAccessorImpl.invoke(NativeMethodAccessorImpl.java:39)
	at sun.reflect.DelegatingMethodAccessorImpl.invoke(DelegatingMethodAccessorImpl.java:25)
	at java.lang.reflect.Method.invoke(Method.java:324)
	at junit.framework.TestCase.runTest(TestCase.java:154)
	at junit.framework.TestCase.runBare(TestCase.java:127)
	at junit.framework.TestResult$1.protect(TestResult.java:106)
	at junit.framework.TestResult.runProtected(TestResult.java:124)
	at junit.framework.TestResult.run(TestResult.java:109)
	at junit.framework.TestCase.run(TestCase.java:118)
	at junit.framework.TestSuite.runTest(TestSuite.java:208)
	at junit.framework.TestSuite.run(TestSuite.java:203)
	at sun.reflect.NativeMethodAccessorImpl.invoke0(Native Method)
	at sun.reflect.NativeMethodAccessorImpl.invoke(NativeMethodAccessorImpl.java:39)
	at sun.reflect.DelegatingMethodAccessorImpl.invoke(DelegatingMethodAccessorImpl.java:25)
	at java.lang.reflect.Method.invoke(Method.java:324)
	at org.apache.maven.surefire.junit.JUnitTestSet.execute(JUnitTestSet.java:213)
	at org.apache.maven.surefire.suite.AbstractDirectoryTestSuite.executeTestSet(AbstractDirectoryTestSuite.java:138)
	at org.apache.maven.surefire.suite.AbstractDirectoryTestSuite.execute(AbstractDirectoryTestSuite.java:163)
	at org.apache.maven.surefire.Surefire.run(Surefire.java:84)
	at sun.reflect.NativeMethodAccessorImpl.invoke0(Native Method)
	at sun.reflect.NativeMethodAccessorImpl.invoke(NativeMethodAccessorImpl.java:39)
	at sun.reflect.DelegatingMethodAccessorImpl.invoke(DelegatingMethodAccessorImpl.java:25)
	at java.lang.reflect.Method.invoke(Method.java:324)
	at org.apache.maven.surefire.booter.SurefireBooter.runSuitesInProcess(SurefireBooter.java:244)
	at org.apache.maven.surefire.booter.SurefireBooter.main(SurefireBooter.java:814)
Tests run: 26, Failures: 0, Errors: 0, Skipped: 0, Time elapsed: 0.2 sec
Running org.apache.commons.beanutils.BeanMapTestCase
Tests run: 129, Failures: 0, Errors: 0, Skipped: 0, Time elapsed: 0.421 sec
Running org.apache.commons.beanutils.bugs.Jira61TestCase
Tests run: 16, Failures: 0, Errors: 0, Skipped: 0, Time elapsed: 0.059 sec
Running org.apache.commons.beanutils.MappedPropertyTestCase
Tests run: 17, Failures: 0, Errors: 0, Skipped: 0, Time elapsed: 0.065 sec
Running org.apache.commons.beanutils.converters.BooleanArrayConverterTestCase
Tests run: 9, Failures: 0, Errors: 0, Skipped: 0, Time elapsed: 0.047 sec
Running org.apache.commons.beanutils.expression.DefaultResolverTestCase
Tests run: 7, Failures: 0, Errors: 0, Skipped: 0, Time elapsed: 0.106 sec
Running org.apache.commons.beanutils.bugs.Jira87TestCase
Tests run: 1, Failures: 0, Errors: 0, Skipped: 0, Time elapsed: 0.044 sec
Running org.apache.commons.beanutils.DynaResultSetTestCase
Tests run: 7, Failures: 0, Errors: 0, Skipped: 0, Time elapsed: 0.122 sec
Running org.apache.commons.beanutils.converters.BigDecimalConverterTestCase
Feb 4, 2008 1:30:52 AM org.apache.commons.beanutils.converters.NumberConverter toNumber
WARNING:     BigDecimalConverter cannot handle conversion to 'Object'
Tests run: 17, Failures: 0, Errors: 0, Skipped: 0, Time elapsed: 0.091 sec
Running org.apache.commons.beanutils.converters.SqlTimestampConverterTestCase
Feb 4, 2008 1:30:53 AM org.apache.commons.beanutils.converters.DateTimeConverter toDate
WARNING:     SqlTimestampConverter cannot handle conversion to 'Character'
Tests run: 11, Failures: 0, Errors: 0, Skipped: 0, Time elapsed: 0.162 sec
Running org.apache.commons.beanutils.converters.IntegerConverterTestCase
Feb 4, 2008 1:30:55 AM org.apache.commons.beanutils.converters.NumberConverter toNumber
WARNING:     IntegerConverter cannot handle conversion to 'Object'
Tests run: 18, Failures: 0, Errors: 0, Skipped: 0, Time elapsed: 0.153 sec
Running org.apache.commons.beanutils.WrapDynaBeanTestCase
Tests run: 39, Failures: 0, Errors: 0, Skipped: 0, Time elapsed: 0.105 sec
Running org.apache.commons.beanutils.bugs.Jira18TestCase
Tests run: 12, Failures: 0, Errors: 0, Skipped: 0, Time elapsed: 0.051 sec
Running org.apache.commons.beanutils.BeanComparatorTestCase
Tests run: 8, Failures: 0, Errors: 0, Skipped: 0, Time elapsed: 0.048 sec
Running org.apache.commons.beanutils.DynaPropertyTestCase
Tests run: 2, Failures: 0, Errors: 0, Skipped: 0, Time elapsed: 0.044 sec
Running org.apache.commons.beanutils.locale.LocaleBeanUtilsTestCase
Feb 4, 2008 1:31:01 AM org.apache.commons.beanutils.locale.converters.DecimalLocaleConverter parse
INFO: No pattern provided, using default.
Feb 4, 2008 1:31:01 AM org.apache.commons.beanutils.locale.converters.DecimalLocaleConverter parse
INFO: No pattern provided, using default.
Tests run: 2, Failures: 0, Errors: 0, Skipped: 0, Time elapsed: 0.097 sec
Running org.apache.commons.beanutils.converters.CharacterConverterTestCase
Tests run: 3, Failures: 0, Errors: 0, Skipped: 0, Time elapsed: 0.048 sec
Running org.apache.commons.beanutils.converters.ByteConverterTestCase
Feb 4, 2008 1:31:03 AM org.apache.commons.beanutils.converters.NumberConverter toNumber
WARNING:     ByteConverter cannot handle conversion to 'Object'
Tests run: 18, Failures: 0, Errors: 0, Skipped: 0, Time elapsed: 0.145 sec
Running org.apache.commons.beanutils.converters.ClassConverterTestCase
Tests run: 6, Failures: 0, Errors: 0, Skipped: 0, Time elapsed: 0.093 sec
Running org.apache.commons.beanutils.BeanificationTestCase
Tests run: 8, Failures: 0, Errors: 0, Skipped: 0, Time elapsed: 1.546 sec
Running org.apache.commons.beanutils.BeanToPropertyValueTransformerTestCase
Feb 4, 2008 1:31:08 AM org.apache.commons.beanutils.BeanToPropertyValueTransformer transform
SEVERE: No property found for name [writeOnlyProperty]
java.lang.NoSuchMethodException: Property 'writeOnlyProperty' has no getter method in class 'class org.apache.commons.beanutils.TestBean'
	at org.apache.commons.beanutils.PropertyUtilsBean.getSimpleProperty(PropertyUtilsBean.java:1296)
	at org.apache.commons.beanutils.PropertyUtilsBean.getNestedProperty(PropertyUtilsBean.java:762)
	at org.apache.commons.beanutils.PropertyUtilsBean.getProperty(PropertyUtilsBean.java:837)
	at org.apache.commons.beanutils.PropertyUtils.getProperty(PropertyUtils.java:426)
	at org.apache.commons.beanutils.BeanToPropertyValueTransformer.transform(BeanToPropertyValueTransformer.java:153)
	at org.apache.commons.beanutils.BeanToPropertyValueTransformerTestCase.testTransformWithWriteOnlyProperty(BeanToPropertyValueTransformerTestCase.java:134)
	at sun.reflect.NativeMethodAccessorImpl.invoke0(Native Method)
	at sun.reflect.NativeMethodAccessorImpl.invoke(NativeMethodAccessorImpl.java:39)
	at sun.reflect.DelegatingMethodAccessorImpl.invoke(DelegatingMethodAccessorImpl.java:25)
	at java.lang.reflect.Method.invoke(Method.java:324)
	at junit.framework.TestCase.runTest(TestCase.java:154)
	at junit.framework.TestCase.runBare(TestCase.java:127)
	at junit.framework.TestResult$1.protect(TestResult.java:106)
	at junit.framework.TestResult.runProtected(TestResult.java:124)
	at junit.framework.TestResult.run(TestResult.java:109)
	at junit.framework.TestCase.run(TestCase.java:118)
	at junit.framework.TestSuite.runTest(TestSuite.java:208)
	at junit.framework.TestSuite.run(TestSuite.java:203)
	at sun.reflect.NativeMethodAccessorImpl.invoke0(Native Method)
	at sun.reflect.NativeMethodAccessorImpl.invoke(NativeMethodAccessorImpl.java:39)
	at sun.reflect.DelegatingMethodAccessorImpl.invoke(DelegatingMethodAccessorImpl.java:25)
	at java.lang.reflect.Method.invoke(Method.java:324)
	at org.apache.maven.surefire.junit.JUnitTestSet.execute(JUnitTestSet.java:213)
	at org.apache.maven.surefire.suite.AbstractDirectoryTestSuite.executeTestSet(AbstractDirectoryTestSuite.java:138)
	at org.apache.maven.surefire.suite.AbstractDirectoryTestSuite.execute(AbstractDirectoryTestSuite.java:163)
	at org.apache.maven.surefire.Surefire.run(Surefire.java:84)
	at sun.reflect.NativeMethodAccessorImpl.invoke0(Native Method)
	at sun.reflect.NativeMethodAccessorImpl.invoke(NativeMethodAccessorImpl.java:39)
	at sun.reflect.DelegatingMethodAccessorImpl.invoke(DelegatingMethodAccessorImpl.java:25)
	at java.lang.reflect.Method.invoke(Method.java:324)
	at org.apache.maven.surefire.booter.SurefireBooter.runSuitesInProcess(SurefireBooter.java:244)
	at org.apache.maven.surefire.booter.SurefireBooter.main(SurefireBooter.java:814)
Feb 4, 2008 1:31:08 AM org.apache.commons.beanutils.BeanToPropertyValueTransformer transform
SEVERE: No property found for name [bogusProperty]
java.lang.NoSuchMethodException: Unknown property 'bogusProperty' on class 'class org.apache.commons.beanutils.TestBean'
	at org.apache.commons.beanutils.PropertyUtilsBean.getSimpleProperty(PropertyUtilsBean.java:1291)
	at org.apache.commons.beanutils.PropertyUtilsBean.getNestedProperty(PropertyUtilsBean.java:762)
	at org.apache.commons.beanutils.PropertyUtilsBean.getProperty(PropertyUtilsBean.java:837)
	at org.apache.commons.beanutils.PropertyUtils.getProperty(PropertyUtils.java:426)
	at org.apache.commons.beanutils.BeanToPropertyValueTransformer.transform(BeanToPropertyValueTransformer.java:153)
	at org.apache.commons.beanutils.BeanToPropertyValueTransformerTestCase.testTransformWithInvalidProperty(BeanToPropertyValueTransformerTestCase.java:155)
	at sun.reflect.NativeMethodAccessorImpl.invoke0(Native Method)
	at sun.reflect.NativeMethodAccessorImpl.invoke(NativeMethodAccessorImpl.java:39)
	at sun.reflect.DelegatingMethodAccessorImpl.invoke(DelegatingMethodAccessorImpl.java:25)
	at java.lang.reflect.Method.invoke(Method.java:324)
	at junit.framework.TestCase.runTest(TestCase.java:154)
	at junit.framework.TestCase.runBare(TestCase.java:127)
	at junit.framework.TestResult$1.protect(TestResult.java:106)
	at junit.framework.TestResult.runProtected(TestResult.java:124)
	at junit.framework.TestResult.run(TestResult.java:109)
	at junit.framework.TestCase.run(TestCase.java:118)
	at junit.framework.TestSuite.runTest(TestSuite.java:208)
	at junit.framework.TestSuite.run(TestSuite.java:203)
	at sun.reflect.NativeMethodAccessorImpl.invoke0(Native Method)
	at sun.reflect.NativeMethodAccessorImpl.invoke(NativeMethodAccessorImpl.java:39)
	at sun.reflect.DelegatingMethodAccessorImpl.invoke(DelegatingMethodAccessorImpl.java:25)
	at java.lang.reflect.Method.invoke(Method.java:324)
	at org.apache.maven.surefire.junit.JUnitTestSet.execute(JUnitTestSet.java:213)
	at org.apache.maven.surefire.suite.AbstractDirectoryTestSuite.executeTestSet(AbstractDirectoryTestSuite.java:138)
	at org.apache.maven.surefire.suite.AbstractDirectoryTestSuite.execute(AbstractDirectoryTestSuite.java:163)
	at org.apache.maven.surefire.Surefire.run(Surefire.java:84)
	at sun.reflect.NativeMethodAccessorImpl.invoke0(Native Method)
	at sun.reflect.NativeMethodAccessorImpl.invoke(NativeMethodAccessorImpl.java:39)
	at sun.reflect.DelegatingMethodAccessorImpl.invoke(DelegatingMethodAccessorImpl.java:25)
	at java.lang.reflect.Method.invoke(Method.java:324)
	at org.apache.maven.surefire.booter.SurefireBooter.runSuitesInProcess(SurefireBooter.java:244)
	at org.apache.maven.surefire.booter.SurefireBooter.main(SurefireBooter.java:814)
Feb 4, 2008 1:31:08 AM org.apache.commons.beanutils.BeanToPropertyValueTransformer transform
SEVERE: ERROR: Problem during transformation. Null value encountered in property path...
org.apache.commons.beanutils.NestedNullException: Null property value for 'anotherNested.stringProperty' on bean class 'class org.apache.commons.beanutils.TestBean'
	at org.apache.commons.beanutils.PropertyUtilsBean.getNestedProperty(PropertyUtilsBean.java:747)
	at org.apache.commons.beanutils.PropertyUtilsBean.getProperty(PropertyUtilsBean.java:837)
	at org.apache.commons.beanutils.PropertyUtils.getProperty(PropertyUtils.java:426)
	at org.apache.commons.beanutils.BeanToPropertyValueTransformer.transform(BeanToPropertyValueTransformer.java:153)
	at org.apache.commons.beanutils.BeanToPropertyValueTransformerTestCase.testTransformWithNullInPath(BeanToPropertyValueTransformerTestCase.java:232)
	at sun.reflect.NativeMethodAccessorImpl.invoke0(Native Method)
	at sun.reflect.NativeMethodAccessorImpl.invoke(NativeMethodAccessorImpl.java:39)
	at sun.reflect.DelegatingMethodAccessorImpl.invoke(DelegatingMethodAccessorImpl.java:25)
	at java.lang.reflect.Method.invoke(Method.java:324)
	at junit.framework.TestCase.runTest(TestCase.java:154)
	at junit.framework.TestCase.runBare(TestCase.java:127)
	at junit.framework.TestResult$1.protect(TestResult.java:106)
	at junit.framework.TestResult.runProtected(TestResult.java:124)
	at junit.framework.TestResult.run(TestResult.java:109)
	at junit.framework.TestCase.run(TestCase.java:118)
	at junit.framework.TestSuite.runTest(TestSuite.java:208)
	at junit.framework.TestSuite.run(TestSuite.java:203)
	at sun.reflect.NativeMethodAccessorImpl.invoke0(Native Method)
	at sun.reflect.NativeMethodAccessorImpl.invoke(NativeMethodAccessorImpl.java:39)
	at sun.reflect.DelegatingMethodAccessorImpl.invoke(DelegatingMethodAccessorImpl.java:25)
	at java.lang.reflect.Method.invoke(Method.java:324)
	at org.apache.maven.surefire.junit.JUnitTestSet.execute(JUnitTestSet.java:213)
	at org.apache.maven.surefire.suite.AbstractDirectoryTestSuite.executeTestSet(AbstractDirectoryTestSuite.java:138)
	at org.apache.maven.surefire.suite.AbstractDirectoryTestSuite.execute(AbstractDirectoryTestSuite.java:163)
	at org.apache.maven.surefire.Surefire.run(Surefire.java:84)
	at sun.reflect.NativeMethodAccessorImpl.invoke0(Native Method)
	at sun.reflect.NativeMethodAccessorImpl.invoke(NativeMethodAccessorImpl.java:39)
	at sun.reflect.DelegatingMethodAccessorImpl.invoke(DelegatingMethodAccessorImpl.java:25)
	at java.lang.reflect.Method.invoke(Method.java:324)
	at org.apache.maven.surefire.booter.SurefireBooter.runSuitesInProcess(SurefireBooter.java:244)
	at org.apache.maven.surefire.booter.SurefireBooter.main(SurefireBooter.java:814)
Feb 4, 2008 1:31:08 AM org.apache.commons.beanutils.BeanToPropertyValueTransformer transform
WARNING: WARNING: Problem during transformation. Null value encountered in property path...
org.apache.commons.beanutils.NestedNullException: Null property value for 'anotherNested.stringProperty' on bean class 'class org.apache.commons.beanutils.TestBean'
	at org.apache.commons.beanutils.PropertyUtilsBean.getNestedProperty(PropertyUtilsBean.java:747)
	at org.apache.commons.beanutils.PropertyUtilsBean.getProperty(PropertyUtilsBean.java:837)
	at org.apache.commons.beanutils.PropertyUtils.getProperty(PropertyUtils.java:426)
	at org.apache.commons.beanutils.BeanToPropertyValueTransformer.transform(BeanToPropertyValueTransformer.java:153)
	at org.apache.commons.beanutils.BeanToPropertyValueTransformerTestCase.testTransformWithNullInPathAndIgnoreTrue(BeanToPropertyValueTransformerTestCase.java:245)
	at sun.reflect.NativeMethodAccessorImpl.invoke0(Native Method)
	at sun.reflect.NativeMethodAccessorImpl.invoke(NativeMethodAccessorImpl.java:39)
	at sun.reflect.DelegatingMethodAccessorImpl.invoke(DelegatingMethodAccessorImpl.java:25)
	at java.lang.reflect.Method.invoke(Method.java:324)
	at junit.framework.TestCase.runTest(TestCase.java:154)
	at junit.framework.TestCase.runBare(TestCase.java:127)
	at junit.framework.TestResult$1.protect(TestResult.java:106)
	at junit.framework.TestResult.runProtected(TestResult.java:124)
	at junit.framework.TestResult.run(TestResult.java:109)
	at junit.framework.TestCase.run(TestCase.java:118)
	at junit.framework.TestSuite.runTest(TestSuite.java:208)
	at junit.framework.TestSuite.run(TestSuite.java:203)
	at sun.reflect.NativeMethodAccessorImpl.invoke0(Native Method)
	at sun.reflect.NativeMethodAccessorImpl.invoke(NativeMethodAccessorImpl.java:39)
	at sun.reflect.DelegatingMethodAccessorImpl.invoke(DelegatingMethodAccessorImpl.java:25)
	at java.lang.reflect.Method.invoke(Method.java:324)
	at org.apache.maven.surefire.junit.JUnitTestSet.execute(JUnitTestSet.java:213)
	at org.apache.maven.surefire.suite.AbstractDirectoryTestSuite.executeTestSet(AbstractDirectoryTestSuite.java:138)
	at org.apache.maven.surefire.suite.AbstractDirectoryTestSuite.execute(AbstractDirectoryTestSuite.java:163)
	at org.apache.maven.surefire.Surefire.run(Surefire.java:84)
	at sun.reflect.NativeMethodAccessorImpl.invoke0(Native Method)
	at sun.reflect.NativeMethodAccessorImpl.invoke(NativeMethodAccessorImpl.java:39)
	at sun.reflect.DelegatingMethodAccessorImpl.invoke(DelegatingMethodAccessorImpl.java:25)
	at java.lang.reflect.Method.invoke(Method.java:324)
	at org.apache.maven.surefire.booter.SurefireBooter.runSuitesInProcess(SurefireBooter.java:244)
	at org.apache.maven.surefire.booter.SurefireBooter.main(SurefireBooter.java:814)
Tests run: 17, Failures: 0, Errors: 0, Skipped: 0, Time elapsed: 0.111 sec
Running org.apache.commons.beanutils.BeanPropertyValueEqualsPredicateTestCase
Feb 4, 2008 1:31:09 AM org.apache.commons.beanutils.BeanPropertyValueEqualsPredicate evaluate
SEVERE: ERROR: Problem during evaluation. Null value encountered in property path...
org.apache.commons.beanutils.NestedNullException: Null property value for 'anotherNested.stringProperty' on bean class 'class org.apache.commons.beanutils.TestBean'
	at org.apache.commons.beanutils.PropertyUtilsBean.getNestedProperty(PropertyUtilsBean.java:747)
	at org.apache.commons.beanutils.PropertyUtilsBean.getProperty(PropertyUtilsBean.java:837)
	at org.apache.commons.beanutils.PropertyUtils.getProperty(PropertyUtils.java:426)
	at org.apache.commons.beanutils.BeanPropertyValueEqualsPredicate.evaluate(BeanPropertyValueEqualsPredicate.java:200)
	at org.apache.commons.beanutils.BeanPropertyValueEqualsPredicateTestCase.testEvaluateWithNullInPath(BeanPropertyValueEqualsPredicateTestCase.java:87)
	at sun.reflect.NativeMethodAccessorImpl.invoke0(Native Method)
	at sun.reflect.NativeMethodAccessorImpl.invoke(NativeMethodAccessorImpl.java:39)
	at sun.reflect.DelegatingMethodAccessorImpl.invoke(DelegatingMethodAccessorImpl.java:25)
	at java.lang.reflect.Method.invoke(Method.java:324)
	at junit.framework.TestCase.runTest(TestCase.java:154)
	at junit.framework.TestCase.runBare(TestCase.java:127)
	at junit.framework.TestResult$1.protect(TestResult.java:106)
	at junit.framework.TestResult.runProtected(TestResult.java:124)
	at junit.framework.TestResult.run(TestResult.java:109)
	at junit.framework.TestCase.run(TestCase.java:118)
	at junit.framework.TestSuite.runTest(TestSuite.java:208)
	at junit.framework.TestSuite.run(TestSuite.java:203)
	at sun.reflect.NativeMethodAccessorImpl.invoke0(Native Method)
	at sun.reflect.NativeMethodAccessorImpl.invoke(NativeMethodAccessorImpl.java:39)
	at sun.reflect.DelegatingMethodAccessorImpl.invoke(DelegatingMethodAccessorImpl.java:25)
	at java.lang.reflect.Method.invoke(Method.java:324)
	at org.apache.maven.surefire.junit.JUnitTestSet.execute(JUnitTestSet.java:213)
	at org.apache.maven.surefire.suite.AbstractDirectoryTestSuite.executeTestSet(AbstractDirectoryTestSuite.java:138)
	at org.apache.maven.surefire.suite.AbstractDirectoryTestSuite.execute(AbstractDirectoryTestSuite.java:163)
	at org.apache.maven.surefire.Surefire.run(Surefire.java:84)
	at sun.reflect.NativeMethodAccessorImpl.invoke0(Native Method)
	at sun.reflect.NativeMethodAccessorImpl.invoke(NativeMethodAccessorImpl.java:39)
	at sun.reflect.DelegatingMethodAccessorImpl.invoke(DelegatingMethodAccessorImpl.java:25)
	at java.lang.reflect.Method.invoke(Method.java:324)
	at org.apache.maven.surefire.booter.SurefireBooter.runSuitesInProcess(SurefireBooter.java:244)
	at org.apache.maven.surefire.booter.SurefireBooter.main(SurefireBooter.java:814)
Feb 4, 2008 1:31:09 AM org.apache.commons.beanutils.BeanPropertyValueEqualsPredicate evaluate
WARNING: WARNING: Problem during evaluation. Null value encountered in property path...
org.apache.commons.beanutils.NestedNullException: Null property value for 'anotherNested.stringProperty' on bean class 'class org.apache.commons.beanutils.TestBean'
	at org.apache.commons.beanutils.PropertyUtilsBean.getNestedProperty(PropertyUtilsBean.java:747)
	at org.apache.commons.beanutils.PropertyUtilsBean.getProperty(PropertyUtilsBean.java:837)
	at org.apache.commons.beanutils.PropertyUtils.getProperty(PropertyUtils.java:426)
	at org.apache.commons.beanutils.BeanPropertyValueEqualsPredicate.evaluate(BeanPropertyValueEqualsPredicate.java:200)
	at org.apache.commons.beanutils.BeanPropertyValueEqualsPredicateTestCase.testEvaluateWithNullInPathAndIgnoreTrue(BeanPropertyValueEqualsPredicateTestCase.java:101)
	at sun.reflect.NativeMethodAccessorImpl.invoke0(Native Method)
	at sun.reflect.NativeMethodAccessorImpl.invoke(NativeMethodAccessorImpl.java:39)
	at sun.reflect.DelegatingMethodAccessorImpl.invoke(DelegatingMethodAccessorImpl.java:25)
	at java.lang.reflect.Method.invoke(Method.java:324)
	at junit.framework.TestCase.runTest(TestCase.java:154)
	at junit.framework.TestCase.runBare(TestCase.java:127)
	at junit.framework.TestResult$1.protect(TestResult.java:106)
	at junit.framework.TestResult.runProtected(TestResult.java:124)
	at junit.framework.TestResult.run(TestResult.java:109)
	at junit.framework.TestCase.run(TestCase.java:118)
	at junit.framework.TestSuite.runTest(TestSuite.java:208)
	at junit.framework.TestSuite.run(TestSuite.java:203)
	at sun.reflect.NativeMethodAccessorImpl.invoke0(Native Method)
	at sun.reflect.NativeMethodAccessorImpl.invoke(NativeMethodAccessorImpl.java:39)
	at sun.reflect.DelegatingMethodAccessorImpl.invoke(DelegatingMethodAccessorImpl.java:25)
	at java.lang.reflect.Method.invoke(Method.java:324)
	at org.apache.maven.surefire.junit.JUnitTestSet.execute(JUnitTestSet.java:213)
	at org.apache.maven.surefire.suite.AbstractDirectoryTestSuite.executeTestSet(AbstractDirectoryTestSuite.java:138)
	at org.apache.maven.surefire.suite.AbstractDirectoryTestSuite.execute(AbstractDirectoryTestSuite.java:163)
	at org.apache.maven.surefire.Surefire.run(Surefire.java:84)
	at sun.reflect.NativeMethodAccessorImpl.invoke0(Native Method)
	at sun.reflect.NativeMethodAccessorImpl.invoke(NativeMethodAccessorImpl.java:39)
	at sun.reflect.DelegatingMethodAccessorImpl.invoke(DelegatingMethodAccessorImpl.java:25)
	at java.lang.reflect.Method.invoke(Method.java:324)
	at org.apache.maven.surefire.booter.SurefireBooter.runSuitesInProcess(SurefireBooter.java:244)
	at org.apache.maven.surefire.booter.SurefireBooter.main(SurefireBooter.java:814)
Feb 4, 2008 1:31:09 AM org.apache.commons.beanutils.BeanPropertyValueEqualsPredicate evaluate
SEVERE: Property not found.
java.lang.NoSuchMethodException: Property 'writeOnlyProperty' has no getter method in class 'class org.apache.commons.beanutils.TestBean'
	at org.apache.commons.beanutils.PropertyUtilsBean.getSimpleProperty(PropertyUtilsBean.java:1296)
	at org.apache.commons.beanutils.PropertyUtilsBean.getNestedProperty(PropertyUtilsBean.java:762)
	at org.apache.commons.beanutils.PropertyUtilsBean.getProperty(PropertyUtilsBean.java:837)
	at org.apache.commons.beanutils.PropertyUtils.getProperty(PropertyUtils.java:426)
	at org.apache.commons.beanutils.BeanPropertyValueEqualsPredicate.evaluate(BeanPropertyValueEqualsPredicate.java:200)
	at org.apache.commons.beanutils.BeanPropertyValueEqualsPredicateTestCase.testEvaluateWithWriteOnlyProperty(BeanPropertyValueEqualsPredicateTestCase.java:236)
	at sun.reflect.NativeMethodAccessorImpl.invoke0(Native Method)
	at sun.reflect.NativeMethodAccessorImpl.invoke(NativeMethodAccessorImpl.java:39)
	at sun.reflect.DelegatingMethodAccessorImpl.invoke(DelegatingMethodAccessorImpl.java:25)
	at java.lang.reflect.Method.invoke(Method.java:324)
	at junit.framework.TestCase.runTest(TestCase.java:154)
	at junit.framework.TestCase.runBare(TestCase.java:127)
	at junit.framework.TestResult$1.protect(TestResult.java:106)
	at junit.framework.TestResult.runProtected(TestResult.java:124)
	at junit.framework.TestResult.run(TestResult.java:109)
	at junit.framework.TestCase.run(TestCase.java:118)
	at junit.framework.TestSuite.runTest(TestSuite.java:208)
	at junit.framework.TestSuite.run(TestSuite.java:203)
	at sun.reflect.NativeMethodAccessorImpl.invoke0(Native Method)
	at sun.reflect.NativeMethodAccessorImpl.invoke(NativeMethodAccessorImpl.java:39)
	at sun.reflect.DelegatingMethodAccessorImpl.invoke(DelegatingMethodAccessorImpl.java:25)
	at java.lang.reflect.Method.invoke(Method.java:324)
	at org.apache.maven.surefire.junit.JUnitTestSet.execute(JUnitTestSet.java:213)
	at org.apache.maven.surefire.suite.AbstractDirectoryTestSuite.executeTestSet(AbstractDirectoryTestSuite.java:138)
	at org.apache.maven.surefire.suite.AbstractDirectoryTestSuite.execute(AbstractDirectoryTestSuite.java:163)
	at org.apache.maven.surefire.Surefire.run(Surefire.java:84)
	at sun.reflect.NativeMethodAccessorImpl.invoke0(Native Method)
	at sun.reflect.NativeMethodAccessorImpl.invoke(NativeMethodAccessorImpl.java:39)
	at sun.reflect.DelegatingMethodAccessorImpl.invoke(DelegatingMethodAccessorImpl.java:25)
	at java.lang.reflect.Method.invoke(Method.java:324)
	at org.apache.maven.surefire.booter.SurefireBooter.runSuitesInProcess(SurefireBooter.java:244)
	at org.apache.maven.surefire.booter.SurefireBooter.main(SurefireBooter.java:814)
Feb 4, 2008 1:31:09 AM org.apache.commons.beanutils.BeanPropertyValueEqualsPredicate evaluate
SEVERE: Property not found.
java.lang.NoSuchMethodException: Unknown property 'bogusProperty' on class 'class org.apache.commons.beanutils.TestBean'
	at org.apache.commons.beanutils.PropertyUtilsBean.getSimpleProperty(PropertyUtilsBean.java:1291)
	at org.apache.commons.beanutils.PropertyUtilsBean.getNestedProperty(PropertyUtilsBean.java:762)
	at org.apache.commons.beanutils.PropertyUtilsBean.getProperty(PropertyUtilsBean.java:837)
	at org.apache.commons.beanutils.PropertyUtils.getProperty(PropertyUtils.java:426)
	at org.apache.commons.beanutils.BeanPropertyValueEqualsPredicate.evaluate(BeanPropertyValueEqualsPredicate.java:200)
	at org.apache.commons.beanutils.BeanPropertyValueEqualsPredicateTestCase.testEvaluateWithInvalidPropertyName(BeanPropertyValueEqualsPredicateTestCase.java:257)
	at sun.reflect.NativeMethodAccessorImpl.invoke0(Native Method)
	at sun.reflect.NativeMethodAccessorImpl.invoke(NativeMethodAccessorImpl.java:39)
	at sun.reflect.DelegatingMethodAccessorImpl.invoke(DelegatingMethodAccessorImpl.java:25)
	at java.lang.reflect.Method.invoke(Method.java:324)
	at junit.framework.TestCase.runTest(TestCase.java:154)
	at junit.framework.TestCase.runBare(TestCase.java:127)
	at junit.framework.TestResult$1.protect(TestResult.java:106)
	at junit.framework.TestResult.runProtected(TestResult.java:124)
	at junit.framework.TestResult.run(TestResult.java:109)
	at junit.framework.TestCase.run(TestCase.java:118)
	at junit.framework.TestSuite.runTest(TestSuite.java:208)
	at junit.framework.TestSuite.run(TestSuite.java:203)
	at sun.reflect.NativeMethodAccessorImpl.invoke0(Native Method)
	at sun.reflect.NativeMethodAccessorImpl.invoke(NativeMethodAccessorImpl.java:39)
	at sun.reflect.DelegatingMethodAccessorImpl.invoke(DelegatingMethodAccessorImpl.java:25)
	at java.lang.reflect.Method.invoke(Method.java:324)
	at org.apache.maven.surefire.junit.JUnitTestSet.execute(JUnitTestSet.java:213)
	at org.apache.maven.surefire.suite.AbstractDirectoryTestSuite.executeTestSet(AbstractDirectoryTestSuite.java:138)
	at org.apache.maven.surefire.suite.AbstractDirectoryTestSuite.execute(AbstractDirectoryTestSuite.java:163)
	at org.apache.maven.surefire.Surefire.run(Surefire.java:84)
	at sun.reflect.NativeMethodAccessorImpl.invoke0(Native Method)
	at sun.reflect.NativeMethodAccessorImpl.invoke(NativeMethodAccessorImpl.java:39)
	at sun.reflect.DelegatingMethodAccessorImpl.invoke(DelegatingMethodAccessorImpl.java:25)
	at java.lang.reflect.Method.invoke(Method.java:324)
	at org.apache.maven.surefire.booter.SurefireBooter.runSuitesInProcess(SurefireBooter.java:244)
	at org.apache.maven.surefire.booter.SurefireBooter.main(SurefireBooter.java:814)
Tests run: 17, Failures: 0, Errors: 0, Skipped: 0, Time elapsed: 0.089 sec
Running org.apache.commons.beanutils.locale.converters.FloatLocaleConverterTestCase
Feb 4, 2008 1:31:10 AM org.apache.commons.beanutils.locale.converters.DecimalLocaleConverter parse
INFO: No pattern provided, using default.
Feb 4, 2008 1:31:10 AM org.apache.commons.beanutils.locale.converters.DecimalLocaleConverter parse
INFO: No pattern provided, using default.
Feb 4, 2008 1:31:10 AM org.apache.commons.beanutils.locale.converters.DecimalLocaleConverter parse
INFO: No pattern provided, using default.
Feb 4, 2008 1:31:10 AM org.apache.commons.beanutils.locale.converters.DecimalLocaleConverter parse
INFO: No pattern provided, using default.
Feb 4, 2008 1:31:10 AM org.apache.commons.beanutils.locale.converters.DecimalLocaleConverter parse
INFO: No pattern provided, using default.
Feb 4, 2008 1:31:10 AM org.apache.commons.beanutils.locale.converters.DecimalLocaleConverter parse
INFO: No pattern provided, using default.
Feb 4, 2008 1:31:10 AM org.apache.commons.beanutils.locale.converters.DecimalLocaleConverter parse
INFO: No pattern provided, using default.
Feb 4, 2008 1:31:10 AM org.apache.commons.beanutils.locale.converters.DecimalLocaleConverter parse
INFO: No pattern provided, using default.
Feb 4, 2008 1:31:10 AM org.apache.commons.beanutils.locale.converters.DecimalLocaleConverter parse
INFO: No pattern provided, using default.
Feb 4, 2008 1:31:10 AM org.apache.commons.beanutils.locale.converters.DecimalLocaleConverter parse
INFO: No pattern provided, using default.
Feb 4, 2008 1:31:10 AM org.apache.commons.beanutils.locale.converters.DecimalLocaleConverter parse
INFO: No pattern provided, using default.
Feb 4, 2008 1:31:10 AM org.apache.commons.beanutils.locale.converters.DecimalLocaleConverter parse
INFO: No pattern provided, using default.
Tests run: 11, Failures: 0, Errors: 0, Skipped: 0, Time elapsed: 0.123 sec
Running org.apache.commons.beanutils.converters.BooleanConverterTestCase
Tests run: 5, Failures: 0, Errors: 0, Skipped: 0, Time elapsed: 0.044 sec
Running org.apache.commons.beanutils.LazyDynaBeanTestCase
Tests run: 16, Failures: 0, Errors: 0, Skipped: 0, Time elapsed: 0.114 sec
Running org.apache.commons.beanutils.converters.CalendarConverterTestCase
Feb 4, 2008 1:31:14 AM org.apache.commons.beanutils.converters.DateTimeConverter toDate
WARNING:     CalendarConverter cannot handle conversion to 'Character'
Feb 4, 2008 1:31:14 AM org.apache.commons.beanutils.converters.DateTimeConverter toDate
WARNING:     CalendarConverter does not support default String to 'Calendar' conversion.
Feb 4, 2008 1:31:14 AM org.apache.commons.beanutils.converters.DateTimeConverter toDate
WARNING:     (N.B. Re-configure Converter or use alternative implementation)
Tests run: 11, Failures: 0, Errors: 0, Skipped: 0, Time elapsed: 0.098 sec
Running org.apache.commons.beanutils.locale.converters.IntegerLocaleConverterTestCase
Feb 4, 2008 1:31:15 AM org.apache.commons.beanutils.locale.converters.DecimalLocaleConverter parse
INFO: No pattern provided, using default.
Feb 4, 2008 1:31:15 AM org.apache.commons.beanutils.locale.converters.DecimalLocaleConverter parse
INFO: No pattern provided, using default.
Feb 4, 2008 1:31:15 AM org.apache.commons.beanutils.locale.converters.DecimalLocaleConverter parse
INFO: No pattern provided, using default.
Feb 4, 2008 1:31:15 AM org.apache.commons.beanutils.locale.converters.DecimalLocaleConverter parse
INFO: No pattern provided, using default.
Feb 4, 2008 1:31:15 AM org.apache.commons.beanutils.locale.converters.DecimalLocaleConverter parse
INFO: No pattern provided, using default.
Feb 4, 2008 1:31:15 AM org.apache.commons.beanutils.locale.converters.DecimalLocaleConverter parse
INFO: No pattern provided, using default.
Feb 4, 2008 1:31:15 AM org.apache.commons.beanutils.locale.converters.DecimalLocaleConverter parse
INFO: No pattern provided, using default.
Feb 4, 2008 1:31:15 AM org.apache.commons.beanutils.locale.converters.DecimalLocaleConverter parse
INFO: No pattern provided, using default.
Feb 4, 2008 1:31:15 AM org.apache.commons.beanutils.locale.converters.DecimalLocaleConverter parse
INFO: No pattern provided, using default.
Feb 4, 2008 1:31:15 AM org.apache.commons.beanutils.locale.converters.DecimalLocaleConverter parse
INFO: No pattern provided, using default.
Feb 4, 2008 1:31:15 AM org.apache.commons.beanutils.locale.converters.DecimalLocaleConverter parse
INFO: No pattern provided, using default.
Feb 4, 2008 1:31:15 AM org.apache.commons.beanutils.locale.converters.DecimalLocaleConverter parse
INFO: No pattern provided, using default.
Tests run: 11, Failures: 0, Errors: 0, Skipped: 0, Time elapsed: 0.104 sec
Running org.apache.commons.beanutils.locale.converters.BaseLocaleConverterTestCase
Tests run: 1, Failures: 0, Errors: 0, Skipped: 0, Time elapsed: 0.042 sec
Running org.apache.commons.beanutils.converters.FileConverterTestCase
Tests run: 1, Failures: 0, Errors: 0, Skipped: 0, Time elapsed: 0.038 sec
Running org.apache.commons.beanutils.converters.LongConverterTestCase
Feb 4, 2008 1:31:19 AM org.apache.commons.beanutils.converters.NumberConverter toNumber
WARNING:     LongConverter cannot handle conversion to 'Object'
Tests run: 17, Failures: 0, Errors: 0, Skipped: 0, Time elapsed: 0.093 sec
Running org.apache.commons.beanutils.PropertyUtilsTestCase
Tests run: 109, Failures: 0, Errors: 0, Skipped: 0, Time elapsed: 0.307 sec
Running org.apache.commons.beanutils.LazyDynaMapTestCase
Tests run: 17, Failures: 0, Errors: 0, Skipped: 0, Time elapsed: 0.076 sec
Running org.apache.commons.beanutils.locale.LocaleConvertUtilsTestCase
Feb 4, 2008 1:31:23 AM org.apache.commons.beanutils.locale.converters.DecimalLocaleConverter parse
INFO: No pattern provided, using default.
Feb 4, 2008 1:31:23 AM org.apache.commons.beanutils.locale.converters.DecimalLocaleConverter parse
INFO: No pattern provided, using default.
Feb 4, 2008 1:31:23 AM org.apache.commons.beanutils.locale.converters.DecimalLocaleConverter parse
INFO: No pattern provided, using default.
Feb 4, 2008 1:31:23 AM org.apache.commons.beanutils.locale.converters.DecimalLocaleConverter parse
INFO: No pattern provided, using default.
Feb 4, 2008 1:31:23 AM org.apache.commons.beanutils.locale.converters.DecimalLocaleConverter parse
INFO: No pattern provided, using default.
Feb 4, 2008 1:31:23 AM org.apache.commons.beanutils.locale.converters.DecimalLocaleConverter parse
INFO: No pattern provided, using default.
Feb 4, 2008 1:31:23 AM org.apache.commons.beanutils.locale.converters.DecimalLocaleConverter parse
INFO: No pattern provided, using default.
Feb 4, 2008 1:31:23 AM org.apache.commons.beanutils.locale.converters.DecimalLocaleConverter parse
INFO: No pattern provided, using default.
Feb 4, 2008 1:31:23 AM org.apache.commons.beanutils.locale.converters.DecimalLocaleConverter parse
INFO: No pattern provided, using default.
Feb 4, 2008 1:31:23 AM org.apache.commons.beanutils.locale.converters.DecimalLocaleConverter parse
INFO: No pattern provided, using default.
Feb 4, 2008 1:31:23 AM org.apache.commons.beanutils.locale.converters.DecimalLocaleConverter parse
INFO: No pattern provided, using default.
Feb 4, 2008 1:31:23 AM org.apache.commons.beanutils.locale.converters.DecimalLocaleConverter parse
INFO: No pattern provided, using default.
Feb 4, 2008 1:31:23 AM org.apache.commons.beanutils.locale.converters.StringLocaleConverter getDecimalFormat
INFO: No pattern provided, using default.
Feb 4, 2008 1:31:23 AM org.apache.commons.beanutils.locale.converters.StringLocaleConverter getDecimalFormat
INFO: No pattern provided, using default.
Feb 4, 2008 1:31:23 AM org.apache.commons.beanutils.locale.converters.StringLocaleConverter getDecimalFormat
INFO: No pattern provided, using default.
Feb 4, 2008 1:31:23 AM org.apache.commons.beanutils.locale.converters.StringLocaleConverter getDecimalFormat
INFO: No pattern provided, using default.
Feb 4, 2008 1:31:23 AM org.apache.commons.beanutils.locale.converters.StringLocaleConverter getDecimalFormat
INFO: No pattern provided, using default.
Feb 4, 2008 1:31:23 AM org.apache.commons.beanutils.locale.converters.StringLocaleConverter getDecimalFormat
INFO: No pattern provided, using default.
Feb 4, 2008 1:31:23 AM org.apache.commons.beanutils.locale.converters.DecimalLocaleConverter parse
INFO: No pattern provided, using default.
Feb 4, 2008 1:31:23 AM org.apache.commons.beanutils.locale.converters.DecimalLocaleConverter parse
INFO: No pattern provided, using default.
Feb 4, 2008 1:31:23 AM org.apache.commons.beanutils.locale.converters.DecimalLocaleConverter parse
INFO: No pattern provided, using default.
Feb 4, 2008 1:31:23 AM org.apache.commons.beanutils.locale.converters.DecimalLocaleConverter parse
INFO: No pattern provided, using default.
Feb 4, 2008 1:31:23 AM org.apache.commons.beanutils.locale.converters.DecimalLocaleConverter parse
INFO: No pattern provided, using default.
Feb 4, 2008 1:31:23 AM org.apache.commons.beanutils.locale.converters.DecimalLocaleConverter parse
INFO: No pattern provided, using default.
Feb 4, 2008 1:31:23 AM org.apache.commons.beanutils.locale.converters.DecimalLocaleConverter parse
INFO: No pattern provided, using default.
Feb 4, 2008 1:31:23 AM org.apache.commons.beanutils.locale.converters.DecimalLocaleConverter parse
INFO: No pattern provided, using default.
Feb 4, 2008 1:31:23 AM org.apache.commons.beanutils.locale.converters.DecimalLocaleConverter parse
INFO: No pattern provided, using default.
Feb 4, 2008 1:31:23 AM org.apache.commons.beanutils.locale.converters.DecimalLocaleConverter parse
INFO: No pattern provided, using default.
Tests run: 3, Failures: 0, Errors: 0, Skipped: 0, Time elapsed: 0.102 sec
Running org.apache.commons.beanutils.converters.DateConverterTestCase
Feb 4, 2008 1:31:24 AM org.apache.commons.beanutils.converters.DateTimeConverter toDate
WARNING:     DateConverter cannot handle conversion to 'Character'
Feb 4, 2008 1:31:24 AM org.apache.commons.beanutils.converters.DateTimeConverter toDate
WARNING:     DateConverter does not support default String to 'Date' conversion.
Feb 4, 2008 1:31:24 AM org.apache.commons.beanutils.converters.DateTimeConverter toDate
WARNING:     (N.B. Re-configure Converter or use alternative implementation)
Tests run: 11, Failures: 0, Errors: 0, Skipped: 0, Time elapsed: 0.095 sec
Running org.apache.commons.beanutils.locale.converters.DoubleLocaleConverterTestCase
Feb 4, 2008 1:31:25 AM org.apache.commons.beanutils.locale.converters.DecimalLocaleConverter parse
INFO: No pattern provided, using default.
Feb 4, 2008 1:31:25 AM org.apache.commons.beanutils.locale.converters.DecimalLocaleConverter parse
INFO: No pattern provided, using default.
Feb 4, 2008 1:31:25 AM org.apache.commons.beanutils.locale.converters.DecimalLocaleConverter parse
INFO: No pattern provided, using default.
Feb 4, 2008 1:31:25 AM org.apache.commons.beanutils.locale.converters.DecimalLocaleConverter parse
INFO: No pattern provided, using default.
Feb 4, 2008 1:31:25 AM org.apache.commons.beanutils.locale.converters.DecimalLocaleConverter parse
INFO: No pattern provided, using default.
Feb 4, 2008 1:31:25 AM org.apache.commons.beanutils.locale.converters.DecimalLocaleConverter parse
INFO: No pattern provided, using default.
Feb 4, 2008 1:31:25 AM org.apache.commons.beanutils.locale.converters.DecimalLocaleConverter parse
INFO: No pattern provided, using default.
Feb 4, 2008 1:31:25 AM org.apache.commons.beanutils.locale.converters.DecimalLocaleConverter parse
INFO: No pattern provided, using default.
Feb 4, 2008 1:31:25 AM org.apache.commons.beanutils.locale.converters.DecimalLocaleConverter parse
INFO: No pattern provided, using default.
Feb 4, 2008 1:31:25 AM org.apache.commons.beanutils.locale.converters.DecimalLocaleConverter parse
INFO: No pattern provided, using default.
Feb 4, 2008 1:31:25 AM org.apache.commons.beanutils.locale.converters.DecimalLocaleConverter parse
INFO: No pattern provided, using default.
Feb 4, 2008 1:31:25 AM org.apache.commons.beanutils.locale.converters.DecimalLocaleConverter parse
INFO: No pattern provided, using default.
Tests run: 10, Failures: 0, Errors: 0, Skipped: 0, Time elapsed: 0.15 sec
Running org.apache.commons.beanutils.converters.DoubleConverterTestCase
Feb 4, 2008 1:31:27 AM org.apache.commons.beanutils.converters.NumberConverter toNumber
WARNING:     DoubleConverter cannot handle conversion to 'Object'
Tests run: 17, Failures: 0, Errors: 0, Skipped: 0, Time elapsed: 0.167 sec
Running org.apache.commons.beanutils.converters.StringArrayConverterTestCase
Tests run: 1, Failures: 0, Errors: 0, Skipped: 0, Time elapsed: 0.048 sec
Running org.apache.commons.beanutils.LazyDynaListTestCase
Tests run: 10, Failures: 0, Errors: 0, Skipped: 0, Time elapsed: 0.141 sec
Running org.apache.commons.beanutils.BeanUtils2TestCase
Tests run: 54, Failures: 0, Errors: 0, Skipped: 0, Time elapsed: 0.389 sec
Running org.apache.commons.beanutils.converters.SqlDateConverterTestCase
Feb 4, 2008 1:31:32 AM org.apache.commons.beanutils.converters.DateTimeConverter toDate
WARNING:     SqlDateConverter cannot handle conversion to 'Character'
Tests run: 12, Failures: 0, Errors: 0, Skipped: 0, Time elapsed: 0.094 sec
Running org.apache.commons.beanutils.locale.converters.ByteLocaleConverterTestCase
Feb 4, 2008 1:31:33 AM org.apache.commons.beanutils.locale.converters.DecimalLocaleConverter parse
INFO: No pattern provided, using default.
Feb 4, 2008 1:31:33 AM org.apache.commons.beanutils.locale.converters.DecimalLocaleConverter parse
INFO: No pattern provided, using default.
Feb 4, 2008 1:31:33 AM org.apache.commons.beanutils.locale.converters.DecimalLocaleConverter parse
INFO: No pattern provided, using default.
Feb 4, 2008 1:31:33 AM org.apache.commons.beanutils.locale.converters.DecimalLocaleConverter parse
INFO: No pattern provided, using default.
Feb 4, 2008 1:31:33 AM org.apache.commons.beanutils.locale.converters.DecimalLocaleConverter parse
INFO: No pattern provided, using default.
Feb 4, 2008 1:31:33 AM org.apache.commons.beanutils.locale.converters.DecimalLocaleConverter parse
INFO: No pattern provided, using default.
Feb 4, 2008 1:31:33 AM org.apache.commons.beanutils.locale.converters.DecimalLocaleConverter parse
INFO: No pattern provided, using default.
Feb 4, 2008 1:31:33 AM org.apache.commons.beanutils.locale.converters.DecimalLocaleConverter parse
INFO: No pattern provided, using default.
Feb 4, 2008 1:31:33 AM org.apache.commons.beanutils.locale.converters.DecimalLocaleConverter parse
INFO: No pattern provided, using default.
Feb 4, 2008 1:31:33 AM org.apache.commons.beanutils.locale.converters.DecimalLocaleConverter parse
INFO: No pattern provided, using default.
Feb 4, 2008 1:31:33 AM org.apache.commons.beanutils.locale.converters.DecimalLocaleConverter parse
INFO: No pattern provided, using default.
Feb 4, 2008 1:31:33 AM org.apache.commons.beanutils.locale.converters.DecimalLocaleConverter parse
INFO: No pattern provided, using default.
Tests run: 10, Failures: 0, Errors: 0, Skipped: 0, Time elapsed: 0.085 sec
Running org.apache.commons.beanutils.converters.ClassReloaderTestCase
Tests run: 1, Failures: 0, Errors: 0, Skipped: 0, Time elapsed: 0.08 sec
Running org.apache.commons.beanutils.DynaRowSetTestCase
Tests run: 9, Failures: 0, Errors: 0, Skipped: 0, Time elapsed: 0.123 sec
Running org.apache.commons.beanutils.locale.converters.LongLocaleConverterTestCase
Feb 4, 2008 1:31:37 AM org.apache.commons.beanutils.locale.converters.DecimalLocaleConverter parse
INFO: No pattern provided, using default.
Feb 4, 2008 1:31:37 AM org.apache.commons.beanutils.locale.converters.DecimalLocaleConverter parse
INFO: No pattern provided, using default.
Feb 4, 2008 1:31:37 AM org.apache.commons.beanutils.locale.converters.DecimalLocaleConverter parse
INFO: No pattern provided, using default.
Feb 4, 2008 1:31:37 AM org.apache.commons.beanutils.locale.converters.DecimalLocaleConverter parse
INFO: No pattern provided, using default.
Feb 4, 2008 1:31:37 AM org.apache.commons.beanutils.locale.converters.DecimalLocaleConverter parse
INFO: No pattern provided, using default.
Feb 4, 2008 1:31:37 AM org.apache.commons.beanutils.locale.converters.DecimalLocaleConverter parse
INFO: No pattern provided, using default.
Feb 4, 2008 1:31:37 AM org.apache.commons.beanutils.locale.converters.DecimalLocaleConverter parse
INFO: No pattern provided, using default.
Feb 4, 2008 1:31:37 AM org.apache.commons.beanutils.locale.converters.DecimalLocaleConverter parse
INFO: No pattern provided, using default.
Feb 4, 2008 1:31:37 AM org.apache.commons.beanutils.locale.converters.DecimalLocaleConverter parse
INFO: No pattern provided, using default.
Feb 4, 2008 1:31:37 AM org.apache.commons.beanutils.locale.converters.DecimalLocaleConverter parse
INFO: No pattern provided, using default.
Feb 4, 2008 1:31:37 AM org.apache.commons.beanutils.locale.converters.DecimalLocaleConverter parse
INFO: No pattern provided, using default.
Feb 4, 2008 1:31:37 AM org.apache.commons.beanutils.locale.converters.DecimalLocaleConverter parse
INFO: No pattern provided, using default.
Tests run: 10, Failures: 0, Errors: 0, Skipped: 0, Time elapsed: 0.089 sec
Running org.apache.commons.beanutils.bugs.Jira273TestCase
Tests run: 6, Failures: 0, Errors: 0, Skipped: 0, Time elapsed: 0.056 sec
Running org.apache.commons.beanutils.LazyDynaClassTestCase
Tests run: 15, Failures: 0, Errors: 0, Skipped: 0, Time elapsed: 0.097 sec
Running org.apache.commons.beanutils.IndexedPropertyTestCase
Tests run: 29, Failures: 0, Errors: 0, Skipped: 0, Time elapsed: 0.126 sec
Running org.apache.commons.beanutils.converters.BigIntegerConverterTestCase
Feb 4, 2008 1:31:42 AM org.apache.commons.beanutils.converters.NumberConverter toNumber
WARNING:     BigIntegerConverter cannot handle conversion to 'Object'
Tests run: 17, Failures: 0, Errors: 0, Skipped: 0, Time elapsed: 0.14 sec
Running org.apache.commons.beanutils.converters.FloatConverterTestCase
Feb 4, 2008 1:31:43 AM org.apache.commons.beanutils.converters.NumberConverter toNumber
WARNING:     FloatConverter cannot handle conversion to 'Object'
Tests run: 18, Failures: 0, Errors: 0, Skipped: 0, Time elapsed: 0.149 sec
Running org.apache.commons.beanutils.locale.converters.ShortLocaleConverterTestCase
Feb 4, 2008 1:31:44 AM org.apache.commons.beanutils.locale.converters.DecimalLocaleConverter parse
INFO: No pattern provided, using default.
Feb 4, 2008 1:31:44 AM org.apache.commons.beanutils.locale.converters.DecimalLocaleConverter parse
INFO: No pattern provided, using default.
Feb 4, 2008 1:31:44 AM org.apache.commons.beanutils.locale.converters.DecimalLocaleConverter parse
INFO: No pattern provided, using default.
Feb 4, 2008 1:31:44 AM org.apache.commons.beanutils.locale.converters.DecimalLocaleConverter parse
INFO: No pattern provided, using default.
Feb 4, 2008 1:31:44 AM org.apache.commons.beanutils.locale.converters.DecimalLocaleConverter parse
INFO: No pattern provided, using default.
Feb 4, 2008 1:31:44 AM org.apache.commons.beanutils.locale.converters.DecimalLocaleConverter parse
INFO: No pattern provided, using default.
Feb 4, 2008 1:31:44 AM org.apache.commons.beanutils.locale.converters.DecimalLocaleConverter parse
INFO: No pattern provided, using default.
Feb 4, 2008 1:31:44 AM org.apache.commons.beanutils.locale.converters.DecimalLocaleConverter parse
INFO: No pattern provided, using default.
Feb 4, 2008 1:31:44 AM org.apache.commons.beanutils.locale.converters.DecimalLocaleConverter parse
INFO: No pattern provided, using default.
Feb 4, 2008 1:31:44 AM org.apache.commons.beanutils.locale.converters.DecimalLocaleConverter parse
INFO: No pattern provided, using default.
Feb 4, 2008 1:31:44 AM org.apache.commons.beanutils.locale.converters.DecimalLocaleConverter parse
INFO: No pattern provided, using default.
Feb 4, 2008 1:31:44 AM org.apache.commons.beanutils.locale.converters.DecimalLocaleConverter parse
INFO: No pattern provided, using default.
Tests run: 10, Failures: 0, Errors: 0, Skipped: 0, Time elapsed: 0.092 sec
Running org.apache.commons.beanutils.locale.converters.BigDecimalLocaleConverterTestCase
Feb 4, 2008 1:31:45 AM org.apache.commons.beanutils.locale.converters.DecimalLocaleConverter parse
INFO: No pattern provided, using default.
Feb 4, 2008 1:31:45 AM org.apache.commons.beanutils.locale.converters.DecimalLocaleConverter parse
INFO: No pattern provided, using default.
Feb 4, 2008 1:31:45 AM org.apache.commons.beanutils.locale.converters.DecimalLocaleConverter parse
INFO: No pattern provided, using default.
Feb 4, 2008 1:31:45 AM org.apache.commons.beanutils.locale.converters.DecimalLocaleConverter parse
INFO: No pattern provided, using default.
Feb 4, 2008 1:31:45 AM org.apache.commons.beanutils.locale.converters.DecimalLocaleConverter parse
INFO: No pattern provided, using default.
Feb 4, 2008 1:31:45 AM org.apache.commons.beanutils.locale.converters.DecimalLocaleConverter parse
INFO: No pattern provided, using default.
Feb 4, 2008 1:31:45 AM org.apache.commons.beanutils.locale.converters.DecimalLocaleConverter parse
INFO: No pattern provided, using default.
Feb 4, 2008 1:31:45 AM org.apache.commons.beanutils.locale.converters.DecimalLocaleConverter parse
INFO: No pattern provided, using default.
Feb 4, 2008 1:31:45 AM org.apache.commons.beanutils.locale.converters.DecimalLocaleConverter parse
INFO: No pattern provided, using default.
Feb 4, 2008 1:31:45 AM org.apache.commons.beanutils.locale.converters.DecimalLocaleConverter parse
INFO: No pattern provided, using default.
Feb 4, 2008 1:31:45 AM org.apache.commons.beanutils.locale.converters.DecimalLocaleConverter parse
INFO: No pattern provided, using default.
Feb 4, 2008 1:31:45 AM org.apache.commons.beanutils.locale.converters.DecimalLocaleConverter parse
INFO: No pattern provided, using default.
Tests run: 10, Failures: 0, Errors: 0, Skipped: 0, Time elapsed: 0.101 sec
Running org.apache.commons.beanutils.bugs.Jira92TestCase
Tests run: 1, Failures: 0, Errors: 0, Skipped: 0, Time elapsed: 0.049 sec
Running org.apache.commons.beanutils.BeanPredicateTestCase
Tests run: 4, Failures: 0, Errors: 0, Skipped: 0, Time elapsed: 0.048 sec
Running org.apache.commons.beanutils.ConstructorUtilsTestCase
Tests run: 9, Failures: 0, Errors: 0, Skipped: 0, Time elapsed: 0.048 sec
Running org.apache.commons.beanutils.locale.converters.BigIntegerLocaleConverterTestCase
Feb 4, 2008 1:31:50 AM org.apache.commons.beanutils.locale.converters.DecimalLocaleConverter parse
INFO: No pattern provided, using default.
Feb 4, 2008 1:31:50 AM org.apache.commons.beanutils.locale.converters.DecimalLocaleConverter parse
INFO: No pattern provided, using default.
Feb 4, 2008 1:31:50 AM org.apache.commons.beanutils.locale.converters.DecimalLocaleConverter parse
INFO: No pattern provided, using default.
Feb 4, 2008 1:31:50 AM org.apache.commons.beanutils.locale.converters.DecimalLocaleConverter parse
INFO: No pattern provided, using default.
Feb 4, 2008 1:31:50 AM org.apache.commons.beanutils.locale.converters.DecimalLocaleConverter parse
INFO: No pattern provided, using default.
Feb 4, 2008 1:31:50 AM org.apache.commons.beanutils.locale.converters.DecimalLocaleConverter parse
INFO: No pattern provided, using default.
Feb 4, 2008 1:31:50 AM org.apache.commons.beanutils.locale.converters.DecimalLocaleConverter parse
INFO: No pattern provided, using default.
Feb 4, 2008 1:31:50 AM org.apache.commons.beanutils.locale.converters.DecimalLocaleConverter parse
INFO: No pattern provided, using default.
Feb 4, 2008 1:31:50 AM org.apache.commons.beanutils.locale.converters.DecimalLocaleConverter parse
INFO: No pattern provided, using default.
Feb 4, 2008 1:31:50 AM org.apache.commons.beanutils.locale.converters.DecimalLocaleConverter parse
INFO: No pattern provided, using default.
Feb 4, 2008 1:31:50 AM org.apache.commons.beanutils.locale.converters.DecimalLocaleConverter parse
INFO: No pattern provided, using default.
Feb 4, 2008 1:31:50 AM org.apache.commons.beanutils.locale.converters.DecimalLocaleConverter parse
INFO: No pattern provided, using default.
Tests run: 10, Failures: 0, Errors: 0, Skipped: 0, Time elapsed: 0.148 sec
Running org.apache.commons.beanutils.converters.ShortConverterTestCase
Feb 4, 2008 1:31:52 AM org.apache.commons.beanutils.converters.NumberConverter toNumber
WARNING:     ShortConverter cannot handle conversion to 'Object'
Tests run: 18, Failures: 0, Errors: 0, Skipped: 0, Time elapsed: 0.096 sec
Running org.apache.commons.beanutils.converters.ArrayConverterTestCase
Tests run: 7, Failures: 0, Errors: 0, Skipped: 0, Time elapsed: 0.047 sec
Running org.apache.commons.beanutils.ConvertUtilsTestCase
Tests run: 12, Failures: 0, Errors: 0, Skipped: 0, Time elapsed: 0.101 sec
Running org.apache.commons.beanutils.locale.LocaleBeanificationTestCase
Feb 4, 2008 1:31:57 AM org.apache.commons.beanutils.locale.converters.DecimalLocaleConverter parse
INFO: No pattern provided, using default.
Tests run: 9, Failures: 0, Errors: 0, Skipped: 0, Time elapsed: 1.616 sec
Running org.apache.commons.beanutils.locale.converters.DateLocaleConverterTestCase
Feb 4, 2008 1:31:58 AM org.apache.commons.beanutils.locale.converters.DateLocaleConverterTestCase setUp
WARNING: JDK Version 1.4
Feb 4, 2008 1:31:58 AM org.apache.commons.beanutils.locale.converters.DateLocaleConverter convertLocalizedPattern
INFO: Converting pattern 'd MMMM yyyy' for de_AT
java.lang.IllegalArgumentException: Illegal pattern character 'd'
	at org.apache.commons.beanutils.locale.converters.DateLocaleConverter.convertPattern(DateLocaleConverter.java:358)
	at org.apache.commons.beanutils.locale.converters.DateLocaleConverter.convertLocalizedPattern(DateLocaleConverter.java:328)
	at org.apache.commons.beanutils.locale.converters.DateLocaleConverter.parse(DateLocaleConverter.java:275)
	at org.apache.commons.beanutils.locale.BaseLocaleConverter.convert(BaseLocaleConverter.java:230)
	at org.apache.commons.beanutils.locale.BaseLocaleConverter.convert(BaseLocaleConverter.java:184)
	at org.apache.commons.beanutils.locale.converters.BaseLocaleConverterTestCase.convertValueWithPattern(BaseLocaleConverterTestCase.java:150)
	at org.apache.commons.beanutils.locale.converters.DateLocaleConverterTestCase.testConstructorMain(DateLocaleConverterTestCase.java:236)
	at sun.reflect.NativeMethodAccessorImpl.invoke0(Native Method)
	at sun.reflect.NativeMethodAccessorImpl.invoke(NativeMethodAccessorImpl.java:39)
	at sun.reflect.DelegatingMethodAccessorImpl.invoke(DelegatingMethodAccessorImpl.java:25)
	at java.lang.reflect.Method.invoke(Method.java:324)
	at junit.framework.TestCase.runTest(TestCase.java:154)
	at junit.framework.TestCase.runBare(TestCase.java:127)
	at junit.framework.TestResult$1.protect(TestResult.java:106)
	at junit.framework.TestResult.runProtected(TestResult.java:124)
	at junit.framework.TestResult.run(TestResult.java:109)
	at junit.framework.TestCase.run(TestCase.java:118)
	at junit.framework.TestSuite.runTest(TestSuite.java:208)
	at junit.framework.TestSuite.run(TestSuite.java:203)
	at sun.reflect.NativeMethodAccessorImpl.invoke0(Native Method)
	at sun.reflect.NativeMethodAccessorImpl.invoke(NativeMethodAccessorImpl.java:39)
	at sun.reflect.DelegatingMethodAccessorImpl.invoke(DelegatingMethodAccessorImpl.java:25)
	at java.lang.reflect.Method.invoke(Method.java:324)
	at org.apache.maven.surefire.junit.JUnitTestSet.execute(JUnitTestSet.java:213)
	at org.apache.maven.surefire.suite.AbstractDirectoryTestSuite.executeTestSet(AbstractDirectoryTestSuite.java:138)
	at org.apache.maven.surefire.suite.AbstractDirectoryTestSuite.execute(AbstractDirectoryTestSuite.java:163)
	at org.apache.maven.surefire.Surefire.run(Surefire.java:84)
	at sun.reflect.NativeMethodAccessorImpl.invoke0(Native Method)
	at sun.reflect.NativeMethodAccessorImpl.invoke(NativeMethodAccessorImpl.java:39)
	at sun.reflect.DelegatingMethodAccessorImpl.invoke(DelegatingMethodAccessorImpl.java:25)
	at java.lang.reflect.Method.invoke(Method.java:324)
	at org.apache.maven.surefire.booter.SurefireBooter.runSuitesInProcess(SurefireBooter.java:244)
	at org.apache.maven.surefire.booter.SurefireBooter.main(SurefireBooter.java:814)
Feb 4, 2008 1:31:58 AM org.apache.commons.beanutils.locale.converters.DateLocaleConverterTestCase setUp
WARNING: JDK Version 1.4
Feb 4, 2008 1:31:58 AM org.apache.commons.beanutils.locale.converters.DateLocaleConverterTestCase setUp
WARNING: JDK Version 1.4
Feb 4, 2008 1:31:58 AM org.apache.commons.beanutils.locale.converters.DateLocaleConverterTestCase setUp
WARNING: JDK Version 1.4
Feb 4, 2008 1:31:58 AM org.apache.commons.beanutils.locale.converters.DateLocaleConverterTestCase setUp
WARNING: JDK Version 1.4
Feb 4, 2008 1:31:58 AM org.apache.commons.beanutils.locale.converters.DateLocaleConverterTestCase setUp
WARNING: JDK Version 1.4
Feb 4, 2008 1:31:58 AM org.apache.commons.beanutils.locale.converters.DateLocaleConverterTestCase setUp
WARNING: JDK Version 1.4
Feb 4, 2008 1:31:58 AM org.apache.commons.beanutils.locale.converters.DateLocaleConverterTestCase setUp
WARNING: JDK Version 1.4
Feb 4, 2008 1:31:58 AM org.apache.commons.beanutils.locale.converters.DateLocaleConverterTestCase setUp
WARNING: JDK Version 1.4
Feb 4, 2008 1:31:58 AM org.apache.commons.beanutils.locale.converters.DateLocaleConverterTestCase setUp
WARNING: JDK Version 1.4
Feb 4, 2008 1:31:58 AM org.apache.commons.beanutils.locale.converters.DateLocaleConverterTestCase setUp
WARNING: JDK Version 1.4
Feb 4, 2008 1:31:58 AM org.apache.commons.beanutils.locale.converters.DateLocaleConverterTestCase setUp
WARNING: JDK Version 1.4
Feb 4, 2008 1:31:58 AM org.apache.commons.beanutils.locale.converters.DateLocaleConverterTestCase setUp
WARNING: JDK Version 1.4
Feb 4, 2008 1:31:58 AM org.apache.commons.beanutils.locale.converters.DateLocaleConverterTestCase setUp
WARNING: JDK Version 1.4
Tests run: 14, Failures: 0, Errors: 0, Skipped: 0, Time elapsed: 0.182 sec
Running org.apache.commons.beanutils.converters.URLConverterTestCase
Tests run: 1, Failures: 0, Errors: 0, Skipped: 0, Time elapsed: 0.805 sec
Running org.apache.commons.beanutils.MethodUtilsTestCase
Tests run: 10, Failures: 0, Errors: 0, Skipped: 0, Time elapsed: 0.098 sec
Running org.apache.commons.beanutils.DynaBeanUtilsTestCase
Tests run: 29, Failures: 0, Errors: 0, Skipped: 0, Time elapsed: 0.192 sec
Running org.apache.commons.beanutils.converters.SqlTimeConverterTestCase
Feb 4, 2008 1:32:04 AM org.apache.commons.beanutils.converters.DateTimeConverter toDate
WARNING:     SqlTimeConverter cannot handle conversion to 'Character'
Tests run: 11, Failures: 0, Errors: 0, Skipped: 0, Time elapsed: 0.104 sec
Running org.apache.commons.beanutils.BeanUtilsTestCase
Tests run: 54, Failures: 0, Errors: 0, Skipped: 0, Time elapsed: 0.413 sec
Running org.apache.commons.beanutils.BasicDynaBeanTestCase
Tests run: 35, Failures: 0, Errors: 0, Skipped: 0, Time elapsed: 0.168 sec
Running org.apache.commons.beanutils.DynaPropertyUtilsTestCase
Tests run: 55, Failures: 0, Errors: 0, Skipped: 0, Time elapsed: 0.096 sec

Results :

Tests run: 1137, Failures: 0, Errors: 0, Skipped: 0

[INFO] [jar:jar]
[INFO] Building jar: /home/continuum/data/working-directory/156/target/commons-beanutils-1.8.0-SNAPSHOT.jar
[INFO] [antrun:run {execution: default}]
[INFO] Executing tasks

core-jar:
      [jar] Building jar: /home/continuum/data/working-directory/156/target/commons-beanutils-core-1.8.0-SNAPSHOT.jar

bean-collections-jar:
      [jar] Building jar: /home/continuum/data/working-directory/156/target/commons-beanutils-bean-collections-1.8.0-SNAPSHOT.jar

other-jars:
[INFO] Executed tasks
[INFO] [install:install]
[INFO] Installing /home/continuum/data/working-directory/156/target/commons-beanutils-1.8.0-SNAPSHOT.jar to /home/continuum/.m2/repository/commons-beanutils/commons-beanutils/1.8.0-SNAPSHOT/commons-beanutils-1.8.0-SNAPSHOT.jar
[INFO] [deploy:deploy]
altDeploymentRepository = vmbuild.repo::default::file://localhost/home/continuum/data/commons
[INFO] Using alternate deployment repository vmbuild.repo::default::file://localhost/home/continuum/data/commons
[INFO] Retrieving previous build number from vmbuild.repo
Uploading: file://localhost/home/continuum/data/commons/commons-beanutils/commons-beanutils/1.8.0-SNAPSHOT/commons-beanutils-1.8.0-SNAPSHOT.jar
209K uploaded
[INFO] Retrieving previous metadata from vmbuild.repo
[INFO] Uploading repository metadata for: 'artifact commons-beanutils:commons-beanutils'
[INFO] Retrieving previous metadata from vmbuild.repo
[INFO] Uploading repository metadata for: 'snapshot commons-beanutils:commons-beanutils:1.8.0-SNAPSHOT'
[INFO] Retrieving previous metadata from vmbuild.repo
[INFO] Uploading project information for commons-beanutils 1.8.0-SNAPSHOT
[INFO] ------------------------------------------------------------------------
[INFO] BUILD SUCCESSFUL
[INFO] ------------------------------------------------------------------------
[INFO] Total time: 1 minute 45 seconds
[INFO] Finished at: Mon Feb 04 01:32:10 PST 2008
[INFO] Final Memory: 9M/25M
[INFO] ------------------------------------------------------------------------

****************************************************************************



---------------------------------------------------------------------
To unsubscribe, e-mail: dev-unsubscribe@commons.apache.org
For additional commands, e-mail: dev-help@commons.apache.org


Mime
View raw message