commons-dev mailing list archives

Site index · List index
Message view « Date » · « Thread »
Top « Date » · « Thread »
From Continuum VMBuild Server <contin...@apache.org>
Subject [continuum] BUILD FAILURE: Commons Compress (Sandbox)
Date Sun, 20 Jan 2008 03:36:33 GMT
Online report : http://vmbuild.apache.org/continuum/buildResult.action?buildId=39077&projectId=176

Build statistics:
  State: Failed
  Previous State: Failed
  Started at: Sat 19 Jan 2008 19:36:02 -0800
  Finished at: Sat 19 Jan 2008 19:36:25 -0800
  Total time: 23s
  Build Trigger: Schedule
  Build Number: 0
  Exit code: 1
  Building machine hostname: vmbuild.apache.org
  Operating system : Linux(unknown)
  Java Home version : 
          java version "1.4.2_15"
          Java(TM) 2 Runtime Environment, Standard Edition (build 1.4.2_15-b02)
          Java HotSpot(TM) Client VM (build 1.4.2_15-b02, mixed mode)
        
  Builder version :
          Maven version: 2.0.7
          Java version: 1.4.2_15
          OS name: "linux" version: "2.6.20-16-server" arch: "i386"
    
****************************************************************************
SCM Changes:
****************************************************************************
Changed: niallp @ Wed 16 Jan 2008 05:26:26 -0800
Comment: Remove Jakarta references, fix site generation errors
Files changed:
  /commons/sandbox/compress/trunk/src/site/site.xml ( 612447 )
  /commons/sandbox/compress/trunk/src/site/xdoc/index.xml ( 612447 )
  /commons/sandbox/compress/trunk/src/site/xdoc/issue-tracking.xml ( 612447 )
  /commons/sandbox/csv/trunk/src/site/site.xml ( 612447 )
  /commons/sandbox/csv/trunk/src/site/xdoc/index.xml ( 612447 )
  /commons/sandbox/csv/trunk/src/site/xdoc/issue-tracking.xml ( 612447 )
  /commons/sandbox/exec/trunk/pom.xml ( 612447 )
  /commons/sandbox/exec/trunk/src/site/site.xml ( 612447 )
  /commons/sandbox/finder/trunk/src/site/site.xml ( 612447 )
  /commons/sandbox/finder/trunk/src/site/xdoc/index.xml ( 612447 )
  /commons/sandbox/finder/trunk/src/site/xdoc/issue-tracking.xml ( 612447 )
  /commons/sandbox/i18n/trunk/src/site/site.xml ( 612447 )
  /commons/sandbox/id/trunk/src/site/site.xml ( 612447 )
  /commons/sandbox/id/trunk/xdocs/navigation.xml ( 612447 )
  /commons/sandbox/id/trunk/xdocs/uuid.xml ( 612447 )
  /commons/sandbox/javaflow/trunk/pom.xml ( 612447 )
  /commons/sandbox/javaflow/trunk/src/site/site.xml ( 612447 )
  /commons/sandbox/js2j/trunk/assembly/pom.xml ( 612447 )
  /commons/sandbox/js2j/trunk/src/site ( 612447 )
  /commons/sandbox/js2j/trunk/src/site/site.xml ( 612447 )

Changed: niallp @ Wed 16 Jan 2008 20:03:01 -0800
Comment: Add logo to m2 build
Files changed:
  /commons/sandbox/compress/trunk/src/site/resources ( 612701 )
  /commons/sandbox/compress/trunk/src/site/resources/images (from /commons/sandbox/compress/trunk/src/site/xdoc/images:612456)
( 612701 )
  /commons/sandbox/compress/trunk/src/site/site.xml ( 612701 )

Changed: niallp @ Sat 19 Jan 2008 01:19:28 -0800
Comment: Update to released version 3 of commons-sandbox-parent pom
Files changed:
  /commons/sandbox/commons-build-plugin/pom.xml ( 613379 )
  /commons/sandbox/compress/trunk/pom.xml ( 613379 )
  /commons/sandbox/csv/trunk/pom.xml ( 613379 )
  /commons/sandbox/exec/trunk/pom.xml ( 613379 )
  /commons/sandbox/finder/trunk/pom.xml ( 613379 )
  /commons/sandbox/i18n/trunk/pom.xml ( 613379 )
  /commons/sandbox/id/trunk/pom.xml ( 613379 )
  /commons/sandbox/javaflow/trunk/pom.xml ( 613379 )
  /commons/sandbox/js2j/trunk/pom.xml ( 613379 )
  /commons/sandbox/monitoring/trunk/pom.xml ( 613379 )
  /commons/sandbox/openpgp/trunk/pom.xml ( 613379 )
  /commons/sandbox/performance/trunk/pom.xml ( 613379 )
  /commons/sandbox/pipeline/trunk/pom.xml ( 613379 )

****************************************************************************
Dependencies Changes:
****************************************************************************
No dependencies changed


****************************************************************************
Build Defintion:
****************************************************************************
POM filename: pom.xml
Goals: clean deploy   
Arguments: --batch-mode -DaltDeploymentRepository=vmbuild.repo::default::file://localhost/home/continuum/data/commons
-Pci
Build Fresh: false
Always Build: false
Default Build Definition: true
Schedule: COMMONS_SCHEDULE
Profile Name: Java 1.4
Description: 


****************************************************************************
Test Summary:
****************************************************************************
Tests: 26
Failures: 3
Total time: 9005

****************************************************************************
Output:
****************************************************************************
[INFO] Scanning for projects...
[INFO] ----------------------------------------------------------------------------
[INFO] Building Commons Compress (Sandbox)
[INFO]    task-segment: [clean, deploy]
[INFO] ----------------------------------------------------------------------------
[INFO] [clean:clean]
[INFO] Deleting directory /home/continuum/data/working-directory/176/target
[INFO] Deleting directory /home/continuum/data/working-directory/176/target/classes
[INFO] Deleting directory /home/continuum/data/working-directory/176/target/test-classes
[INFO] Deleting directory /home/continuum/data/working-directory/176/target/site
[INFO] [cobertura:clean {execution: default}]
[INFO] [antrun:run {execution: javadoc.resources}]
[INFO] Executing tasks
     [copy] Copying 2 files to /home/continuum/data/working-directory/176/target/apidocs/META-INF
[INFO] Executed tasks
[INFO] [resources:resources]
[INFO] Using default encoding to copy filtered resources.
[INFO] [compiler:compile]
[INFO] Compiling 34 source files to /home/continuum/data/working-directory/176/target/classes
[INFO] [resources:testResources]
[INFO] Using default encoding to copy filtered resources.
[INFO] [compiler:testCompile]
[INFO] Compiling 9 source files to /home/continuum/data/working-directory/176/target/test-classes
[INFO] [surefire:test]
[INFO] Surefire report directory: /home/continuum/data/working-directory/176/target/surefire-reports

-------------------------------------------------------
 T E S T S
-------------------------------------------------------
Running org.apache.commons.compress.archivers.tar.TarTestCase
count = 134
ch2 = 51
ch = 49
Tests run: 4, Failures: 3, Errors: 0, Skipped: 0, Time elapsed: 0.081 sec <<< FAILURE!
Running org.apache.commons.compress.archivers.zip.AsiExtraFieldTestCase
Tests run: 7, Failures: 0, Errors: 0, Skipped: 0, Time elapsed: 0.017 sec
Running org.apache.commons.compress.archivers.zip.ExtraFieldUtilsTestCase
Tests run: 2, Failures: 0, Errors: 0, Skipped: 0, Time elapsed: 0.01 sec
Running org.apache.commons.compress.archivers.zip.ZipEntryTestCase
Tests run: 1, Failures: 0, Errors: 0, Skipped: 0, Time elapsed: 0.009 sec
Running org.apache.commons.compress.compressors.bzip2.BzipTestCase
Tests run: 3, Failures: 0, Errors: 0, Skipped: 0, Time elapsed: 8.914 sec
Running org.apache.commons.compress.CompressUtilsTest
Tests run: 1, Failures: 0, Errors: 0, Skipped: 0, Time elapsed: 0.004 sec
Running org.apache.commons.compress.archivers.zip.ZipLongTestCase
Tests run: 4, Failures: 0, Errors: 0, Skipped: 0, Time elapsed: 0.005 sec
Running org.apache.commons.compress.archivers.zip.ZipShortTestCase
Tests run: 4, Failures: 0, Errors: 0, Skipped: 0, Time elapsed: 0.01 sec

Results :

Failed tests: 
  testReadPosixTar(org.apache.commons.compress.archivers.tar.TarTestCase)
  testReadGnuTar(org.apache.commons.compress.archivers.tar.TarTestCase)
  testWritePosixTar(org.apache.commons.compress.archivers.tar.TarTestCase)

Tests run: 26, Failures: 3, Errors: 0, Skipped: 0

[INFO] ------------------------------------------------------------------------
[ERROR] BUILD FAILURE
[INFO] ------------------------------------------------------------------------
[INFO] There are test failures.
[INFO] ------------------------------------------------------------------------
[INFO] For more information, run Maven with the -e switch
[INFO] ------------------------------------------------------------------------
[INFO] Total time: 18 seconds
[INFO] Finished at: Sat Jan 19 19:36:25 PST 2008
[INFO] Final Memory: 7M/17M
[INFO] ------------------------------------------------------------------------

****************************************************************************



---------------------------------------------------------------------
To unsubscribe, e-mail: dev-unsubscribe@commons.apache.org
For additional commands, e-mail: dev-help@commons.apache.org


Mime
View raw message