commons-dev mailing list archives

Site index · List index
Message view « Date » · « Thread »
Top « Date » · « Thread »
From Continuum VMBuild Server <contin...@apache.org>
Subject [continuum] BUILD FAILURE: Commons Codec
Date Mon, 07 Jan 2008 03:35:03 GMT
Online report : http://vmbuild.apache.org/continuum/buildResult.action?buildId=35291&projectId=159

Build statistics:
  State: Failed
  Previous State: Failed
  Started at: Sun 6 Jan 2008 19:34:33 -0800
  Finished at: Sun 6 Jan 2008 19:34:49 -0800
  Total time: 15s
  Build Trigger: Schedule
  Build Number: 6
  Exit code: 1
  Building machine hostname: vmbuild.apache.org
  Operating system : Linux(unknown)
  Java Home version : 
          java version "1.4.2_15"
          Java(TM) 2 Runtime Environment, Standard Edition (build 1.4.2_15-b02)
          Java HotSpot(TM) Client VM (build 1.4.2_15-b02, mixed mode)
        
  Builder version :
          Maven version: 2.0.7
          Java version: 1.4.2_15
          OS name: "linux" version: "2.6.20-16-server" arch: "i386"
    
****************************************************************************
SCM Changes:
****************************************************************************
Changed: niallp @ Sun 6 Jan 2008 19:15:46 -0800
Comment: Upgrade to commons-parent version 6 release
Files changed:
  /commons/proper/beanutils/trunk/pom.xml ( 609497 )
  /commons/proper/betwixt/trunk/pom.xml ( 609497 )
  /commons/proper/chain/trunk/pom.xml ( 609497 )
  /commons/proper/cli/trunk/pom.xml ( 609497 )
  /commons/proper/codec/trunk/pom.xml ( 609497 )
  /commons/proper/collections/trunk/pom.xml ( 609497 )
  /commons/proper/commons-sandbox-parent/trunk/pom.xml ( 609497 )
  /commons/proper/configuration/trunk/pom.xml ( 609497 )
  /commons/proper/daemon/trunk/pom.xml ( 609497 )
  /commons/proper/dbcp/trunk/pom.xml ( 609497 )
  /commons/proper/dbutils/trunk/pom.xml ( 609497 )
  /commons/proper/digester/trunk/pom.xml ( 609497 )
  /commons/proper/discovery/trunk/pom.xml ( 609497 )
  /commons/proper/el/trunk/pom.xml ( 609497 )
  /commons/proper/email/trunk/pom.xml ( 609497 )
  /commons/proper/fileupload/trunk/pom.xml ( 609497 )
  /commons/proper/io/trunk/pom.xml ( 609497 )
  /commons/proper/jci/trunk/pom.xml ( 609497 )
  /commons/proper/jexl/trunk/pom.xml ( 609497 )
  /commons/proper/jxpath/trunk/pom.xml ( 609497 )
  /commons/proper/lang/trunk/pom.xml ( 609497 )
  /commons/proper/launcher/trunk/pom.xml ( 609497 )
  /commons/proper/logging/trunk/pom.xml ( 609497 )
  /commons/proper/math/trunk/pom.xml ( 609497 )
  /commons/proper/modeler/trunk/pom.xml ( 609497 )
  /commons/proper/net/trunk/pom.xml ( 609497 )
  /commons/proper/pool/trunk/pom.xml ( 609497 )
  /commons/proper/primitives/trunk/pom.xml ( 609497 )
  /commons/proper/proxy/trunk/pom.xml ( 609497 )
  /commons/proper/scxml/trunk/pom.xml ( 609497 )
  /commons/proper/transaction/trunk/pom.xml ( 609497 )
  /commons/proper/validator/trunk/pom.xml ( 609497 )
  /commons/proper/vfs/trunk/pom.xml ( 609497 )

****************************************************************************
Dependencies Changes:
****************************************************************************
No dependencies changed


****************************************************************************
Build Defintion:
****************************************************************************
POM filename: pom.xml
Goals: clean deploy   
Arguments: --batch-mode -DaltDeploymentRepository=vmbuild.repo::default::file://localhost/home/continuum/data/commons
-Pci
Build Fresh: false
Always Build: false
Default Build Definition: true
Schedule: COMMONS_SCHEDULE
Profile Name: Java 1.4
Description: 


****************************************************************************
Test Summary:
****************************************************************************
Tests: 192
Failures: 1
Total time: 698

****************************************************************************
Output:
****************************************************************************
[INFO] Scanning for projects...
[INFO] ----------------------------------------------------------------------------
[INFO] Building Commons Codec
[INFO]    task-segment: [clean, deploy]
[INFO] ----------------------------------------------------------------------------
[INFO] [clean:clean]
[INFO] Deleting directory /home/continuum/data/working-directory/159/target
[INFO] Deleting directory /home/continuum/data/working-directory/159/target/classes
[INFO] Deleting directory /home/continuum/data/working-directory/159/target/test-classes
[INFO] Deleting directory /home/continuum/data/working-directory/159/target/site
[INFO] [resources:resources]
[INFO] Using default encoding to copy filtered resources.
[INFO] [compiler:compile]
[INFO] Compiling 24 source files to /home/continuum/data/working-directory/159/target/classes
[INFO] [resources:testResources]
[INFO] Using default encoding to copy filtered resources.
[INFO] [compiler:testCompile]
[INFO] Compiling 17 source files to /home/continuum/data/working-directory/159/target/test-classes
[INFO] [surefire:test]
[INFO] Surefire report directory: /home/continuum/data/working-directory/159/target/surefire-reports

-------------------------------------------------------
 T E S T S
-------------------------------------------------------
Running org.apache.commons.codec.net.URLCodecTest
Tests run: 16, Failures: 0, Errors: 0, Skipped: 0, Time elapsed: 0.159 sec
Running org.apache.commons.codec.language.MetaphoneTest
Tests run: 33, Failures: 1, Errors: 0, Skipped: 0, Time elapsed: 0.104 sec <<< FAILURE!
Running org.apache.commons.codec.net.QuotedPrintableCodecTest
Tests run: 15, Failures: 0, Errors: 0, Skipped: 0, Time elapsed: 0.021 sec
Running org.apache.commons.codec.net.RFC1522CodecTest
Tests run: 2, Failures: 0, Errors: 0, Skipped: 0, Time elapsed: 0.013 sec
Running org.apache.commons.codec.net.QCodecTest
Tests run: 12, Failures: 0, Errors: 0, Skipped: 0, Time elapsed: 0.02 sec
Running org.apache.commons.codec.binary.HexTest
Tests run: 12, Failures: 0, Errors: 0, Skipped: 0, Time elapsed: 0.045 sec
Running org.apache.commons.codec.language.RefinedSoundexTest
Tests run: 6, Failures: 0, Errors: 0, Skipped: 0, Time elapsed: 0.01 sec
Running org.apache.commons.codec.binary.Base64Test
Tests run: 24, Failures: 0, Errors: 0, Skipped: 0, Time elapsed: 0.072 sec
Running org.apache.commons.codec.digest.DigestUtilsTest
Tests run: 8, Failures: 0, Errors: 0, Skipped: 0, Time elapsed: 0.158 sec
Running org.apache.commons.codec.StringEncoderComparatorTest
Tests run: 4, Failures: 0, Errors: 0, Skipped: 0, Time elapsed: 0.017 sec
Running org.apache.commons.codec.language.SoundexTest
Tests run: 25, Failures: 0, Errors: 0, Skipped: 0, Time elapsed: 0.028 sec
Running org.apache.commons.codec.language.DoubleMetaphoneTest
Tests run: 13, Failures: 0, Errors: 0, Skipped: 0, Time elapsed: 0.071 sec
Running org.apache.commons.codec.net.BCodecTest
Tests run: 9, Failures: 0, Errors: 0, Skipped: 0, Time elapsed: 0.013 sec
Running org.apache.commons.codec.binary.BinaryCodecTest
Tests run: 13, Failures: 0, Errors: 0, Skipped: 0, Time elapsed: 0.017 sec

Results :

Failed tests: 
  testWhy(org.apache.commons.codec.language.MetaphoneTest)

Tests run: 192, Failures: 1, Errors: 0, Skipped: 0

[INFO] ------------------------------------------------------------------------
[ERROR] BUILD FAILURE
[INFO] ------------------------------------------------------------------------
[INFO] There are test failures.
[INFO] ------------------------------------------------------------------------
[INFO] For more information, run Maven with the -e switch
[INFO] ------------------------------------------------------------------------
[INFO] Total time: 8 seconds
[INFO] Finished at: Sun Jan 06 19:34:49 PST 2008
[INFO] Final Memory: 6M/17M
[INFO] ------------------------------------------------------------------------

****************************************************************************



---------------------------------------------------------------------
To unsubscribe, e-mail: dev-unsubscribe@commons.apache.org
For additional commands, e-mail: dev-help@commons.apache.org


Mime
View raw message