commons-dev mailing list archives

Site index · List index
Message view « Date » · « Thread »
Top « Date » · « Thread »
From Continuum VMBuild Server <contin...@apache.org>
Subject [continuum] BUILD FAILURE: Commons VFS
Date Fri, 25 Jan 2008 09:36:15 GMT
Online report : http://vmbuild.apache.org/continuum/buildResult.action?buildId=41590&projectId=171

Build statistics:
  State: Failed
  Previous State: Failed
  Started at: Fri 25 Jan 2008 01:35:23 -0800
  Finished at: Fri 25 Jan 2008 01:36:02 -0800
  Total time: 38s
  Build Trigger: Schedule
  Build Number: 0
  Exit code: 1
  Building machine hostname: vmbuild.apache.org
  Operating system : Linux(unknown)
  Java Home version : 
          java version "1.4.2_15"
          Java(TM) 2 Runtime Environment, Standard Edition (build 1.4.2_15-b02)
          Java HotSpot(TM) Client VM (build 1.4.2_15-b02, mixed mode)
        
  Builder version :
          Maven version: 2.0.7
          Java version: 1.4.2_15
          OS name: "linux" version: "2.6.20-16-server" arch: "i386"
    
****************************************************************************
SCM Changes:
****************************************************************************
Changed: niallp @ Fri 25 Jan 2008 00:54:17 -0800
Comment: Update download page to point to latest release
Files changed:
  /commons/proper/vfs/trunk/xdocs/download.xml ( 615150 )

Changed: niallp @ Fri 25 Jan 2008 00:56:19 -0800
Comment: Add license headers
Files changed:
  /commons/proper/vfs/trunk/checkstyle.properties ( 615151 )
  /commons/proper/vfs/trunk/core/src/main/java/org/apache/commons/vfs/provider/http/ThreadLocalHttpConnectionManager.java
( 615151 )
  /commons/proper/vfs/trunk/doap_vfs.rdf ( 615151 )
  /commons/proper/vfs/trunk/gump.xml ( 615151 )
  /commons/proper/vfs/trunk/sandbox/build.xml ( 615151 )
  /commons/proper/vfs/trunk/sandbox/src/main/java/org/apache/commons/vfs/provider/smb/package.html
( 615151 )
  /commons/proper/vfs/trunk/sandbox/src/main/java/org/apache/commons/vfs/provider/webdav/package.html
( 615151 )

Changed: niallp @ Fri 25 Jan 2008 00:57:11 -0800
Comment: Add m2 site navigation
Files changed:
  /commons/proper/vfs/trunk/src ( 615152 )
  /commons/proper/vfs/trunk/src/site ( 615152 )
  /commons/proper/vfs/trunk/src/site/resources ( 615152 )
  /commons/proper/vfs/trunk/src/site/resources/images (from /commons/proper/vfs/trunk/xdocs/images:615143)
( 615152 )
  /commons/proper/vfs/trunk/src/site/site.xml ( 615152 )

****************************************************************************
Dependencies Changes:
****************************************************************************
No dependencies changed


****************************************************************************
Build Defintion:
****************************************************************************
POM filename: pom.xml
Goals: clean deploy   
Arguments: --batch-mode -DaltDeploymentRepository=vmbuild.repo::default::file://localhost/home/continuum/data/commons
-Pci
Build Fresh: false
Always Build: false
Default Build Definition: true
Schedule: COMMONS_SCHEDULE
Profile Name: Java 1.4
Description: 


****************************************************************************
Test Summary:
****************************************************************************
Tests: 7
Failures: 1
Total time: 378

****************************************************************************
Output:
****************************************************************************
[INFO] Scanning for projects...
[INFO] Reactor build order: 
[INFO]   Commons VFS
[INFO]   core
[INFO]   examples
[INFO]   sandbox
[INFO] ----------------------------------------------------------------------------
[INFO] Building Commons VFS
[INFO]    task-segment: [clean, deploy]
[INFO] ----------------------------------------------------------------------------
[INFO] [clean:clean]
[INFO] Deleting directory /home/continuum/data/working-directory/171/target
[INFO] Deleting directory /home/continuum/data/working-directory/171/target/classes
[INFO] Deleting directory /home/continuum/data/working-directory/171/target/test-classes
[INFO] Deleting directory /home/continuum/data/working-directory/171/target/site
[INFO] [antrun:run {execution: javadoc.resources}]
[INFO] Executing tasks
     [copy] Copying 2 files to /home/continuum/data/working-directory/171/target/apidocs/META-INF
[INFO] Executed tasks
[INFO] [site:attach-descriptor]
[WARNING] Unable to load parent project from repository: Could not find the model file '/home/continuum/data/working-directory/171/../pom.xml'.
for project unknown
[INFO] [install:install]
[INFO] Installing /home/continuum/data/working-directory/171/pom.xml to /home/continuum/.m2/repository/org/apache/commons/commons-vfs-project/1.1-SNAPSHOT/commons-vfs-project-1.1-SNAPSHOT.pom
[INFO] [deploy:deploy]
altDeploymentRepository = vmbuild.repo::default::file://localhost/home/continuum/data/commons
[INFO] Using alternate deployment repository vmbuild.repo::default::file://localhost/home/continuum/data/commons
[INFO] Retrieving previous build number from vmbuild.repo
Uploading: file://localhost/home/continuum/data/commons/org/apache/commons/commons-vfs-project/1.1-SNAPSHOT/commons-vfs-project-1.1-SNAPSHOT.pom
4K uploaded
[INFO] Retrieving previous metadata from vmbuild.repo
[INFO] Uploading site descriptor for commons-vfs-project 1.1-SNAPSHOT site.xml
[INFO] Retrieving previous metadata from vmbuild.repo
[INFO] Uploading repository metadata for: 'artifact org.apache.commons:commons-vfs-project'
[INFO] Retrieving previous metadata from vmbuild.repo
[INFO] Uploading repository metadata for: 'snapshot org.apache.commons:commons-vfs-project:1.1-SNAPSHOT'
[INFO] ----------------------------------------------------------------------------
[INFO] Building core
[INFO]    task-segment: [clean, deploy]
[INFO] ----------------------------------------------------------------------------
[INFO] [clean:clean]
[INFO] Deleting directory /home/continuum/data/working-directory/171/core/target
[INFO] Deleting directory /home/continuum/data/working-directory/171/core/target/classes
[INFO] Deleting directory /home/continuum/data/working-directory/171/core/target/test-classes
[INFO] Deleting directory /home/continuum/data/working-directory/171/core/target/site
[INFO] [antrun:run {execution: javadoc.resources}]
[INFO] Executing tasks
[INFO] Executed tasks
[INFO] [resources:resources]
[INFO] Using default encoding to copy filtered resources.
[INFO] [compiler:compile]
[INFO] Compiling 219 source files to /home/continuum/data/working-directory/171/core/target/classes
[INFO] [resources:testResources]
[INFO] Using default encoding to copy filtered resources.
[INFO] [compiler:testCompile]
[INFO] Compiling 58 source files to /home/continuum/data/working-directory/171/core/target/test-classes
[INFO] [surefire:test]
[INFO] Surefire report directory: /home/continuum/data/working-directory/171/core/target/surefire-reports

-------------------------------------------------------
 T E S T S
-------------------------------------------------------
Running org.apache.commons.vfs.provider.http.test.HttpProviderTestCase
Tests run: 0, Failures: 0, Errors: 0, Skipped: 0, Time elapsed: 0.021 sec
Running org.apache.commons.vfs.provider.tar.test.TarProviderTestCase
Tests run: 0, Failures: 0, Errors: 0, Skipped: 0, Time elapsed: 0.008 sec
Running org.apache.commons.vfs.provider.jar.test.JarProviderTestCase
Tests run: 0, Failures: 0, Errors: 0, Skipped: 0, Time elapsed: 0.007 sec
Running org.apache.commons.vfs.provider.test.VirtualProviderTestCase
Tests run: 0, Failures: 0, Errors: 0, Skipped: 0, Time elapsed: 0.002 sec
Running org.apache.commons.vfs.provider.tar.test.TgzProviderTestCase
Tests run: 0, Failures: 0, Errors: 0, Skipped: 0, Time elapsed: 0.006 sec
Running org.apache.commons.vfs.provider.ram.test.CustomRamProviderTest
Tests run: 2, Failures: 0, Errors: 0, Skipped: 0, Time elapsed: 0.113 sec
Running org.apache.commons.vfs.provider.url.test.UrlProviderTestCase
Tests run: 0, Failures: 0, Errors: 0, Skipped: 0, Time elapsed: 0.006 sec
Running org.apache.commons.vfs.provider.local.test.LocalProviderTestCase
Tests run: 0, Failures: 0, Errors: 0, Skipped: 0, Time elapsed: 0.003 sec
Running org.apache.commons.vfs.provider.ram.test.RamProviderTestCase
Tests run: 0, Failures: 0, Errors: 0, Skipped: 0, Time elapsed: 0.021 sec
Running org.apache.commons.vfs.provider.zip.test.ZipProviderTestCase
Tests run: 0, Failures: 0, Errors: 0, Skipped: 0, Time elapsed: 0.011 sec
Running org.apache.commons.vfs.provider.jar.test.NestedJarTestCase
Tests run: 0, Failures: 0, Errors: 0, Skipped: 0, Time elapsed: 0.004 sec
Running org.apache.commons.vfs.RunTest
Tests run: 0, Failures: 0, Errors: 0, Skipped: 0, Time elapsed: 0.01 sec
Running org.apache.commons.vfs.provider.tar.test.NestedTarTestCase
Tests run: 0, Failures: 0, Errors: 0, Skipped: 0, Time elapsed: 0.009 sec
Running org.apache.commons.vfs.provider.tar.test.NestedTgzTestCase
Tests run: 0, Failures: 0, Errors: 0, Skipped: 0, Time elapsed: 0.021 sec
Running org.apache.commons.vfs.cache.NullFilesCacheTestCase
Tests run: 0, Failures: 0, Errors: 0, Skipped: 0, Time elapsed: 0.009 sec
Running org.apache.commons.vfs.provider.test.GenericFileNameTestCase
Tests run: 2, Failures: 0, Errors: 0, Skipped: 0, Time elapsed: 0.036 sec
Running org.apache.commons.vfs.provider.sftp.test.SftpProviderTestCase
Tests run: 0, Failures: 0, Errors: 0, Skipped: 0, Time elapsed: 0.002 sec
Running org.apache.commons.vfs.provider.res.test.ResourceProviderTestCase
Tests run: 0, Failures: 0, Errors: 0, Skipped: 0, Time elapsed: 0.002 sec
Running org.apache.commons.vfs.util.DelegatingFileSystemOptionsBuilderTest
Jan 25, 2008 1:36:02 AM org.apache.commons.vfs.VfsLog info
INFO: Using "/tmp/vfs_cache" as temporary files store.
Jan 25, 2008 1:36:02 AM org.apache.commons.vfs.VfsLog info
INFO: Using "/tmp/vfs_cache" as temporary files store.
Tests run: 2, Failures: 0, Errors: 0, Skipped: 0, Time elapsed: 0.19 sec
Running org.apache.commons.vfs.provider.url.test.UrlHttpProviderTestCase
Tests run: 0, Failures: 0, Errors: 0, Skipped: 0, Time elapsed: 0.004 sec
Running org.apache.commons.vfs.provider.tar.test.NestedTbz2TestCase
Tests run: 0, Failures: 0, Errors: 0, Skipped: 0, Time elapsed: 0.002 sec
Running org.apache.commons.vfs.provider.zip.test.NestedZipTestCase
Tests run: 0, Failures: 0, Errors: 0, Skipped: 0, Time elapsed: 0.004 sec
Running org.apache.commons.vfs.provider.tar.test.Tbz2ProviderTestCase
Tests run: 0, Failures: 0, Errors: 0, Skipped: 0, Time elapsed: 0.002 sec
Running org.apache.commons.vfs.cache.LRUFilesCacheTestCase
Tests run: 0, Failures: 0, Errors: 0, Skipped: 0, Time elapsed: 0.002 sec
Running org.apache.commons.vfs.test.FileSystemManagerFactoryTestCase
Jan 25, 2008 1:36:02 AM org.apache.commons.vfs.VfsLog info
INFO: Using "/tmp/vfs_cache" as temporary files store.
Tests run: 1, Failures: 1, Errors: 0, Skipped: 0, Time elapsed: 0.031 sec <<< FAILURE!
Running org.apache.commons.vfs.provider.ftp.test.FtpProviderTestCase
Tests run: 0, Failures: 0, Errors: 0, Skipped: 0, Time elapsed: 0.004 sec
Running org.apache.commons.vfs.provider.temp.test.TemporaryProviderTestCase
Tests run: 0, Failures: 0, Errors: 0, Skipped: 0, Time elapsed: 0.002 sec
Running org.apache.commons.vfs.provider.url.test.UrlProviderHttpTestCase
Tests run: 0, Failures: 0, Errors: 0, Skipped: 0, Time elapsed: 0.007 sec

Results :

Failed tests: 
  testDefaultInstance(org.apache.commons.vfs.test.FileSystemManagerFactoryTestCase)

Tests run: 7, Failures: 1, Errors: 0, Skipped: 0

[INFO] ------------------------------------------------------------------------
[ERROR] BUILD FAILURE
[INFO] ------------------------------------------------------------------------
[INFO] There are test failures.
[INFO] ------------------------------------------------------------------------
[INFO] For more information, run Maven with the -e switch
[INFO] ------------------------------------------------------------------------
[INFO] Total time: 24 seconds
[INFO] Finished at: Fri Jan 25 01:36:02 PST 2008
[INFO] Final Memory: 10M/27M
[INFO] ------------------------------------------------------------------------

****************************************************************************



---------------------------------------------------------------------
To unsubscribe, e-mail: dev-unsubscribe@commons.apache.org
For additional commands, e-mail: dev-help@commons.apache.org


Mime
View raw message