commons-dev mailing list archives

Site index · List index
Message view « Date » · « Thread »
Top « Date » · « Thread »
From Continuum VMBuild Server <contin...@apache.org>
Subject [continuum] BUILD FAILURE: Commons Exec (Sandbox)
Date Mon, 03 Dec 2007 02:38:59 GMT
Online report : http://vmbuild.apache.org/continuum/buildResult.action?buildId=24840&projectId=178

Build statistics:
  State: Failed
  Previous State: Ok
  Started at: Sun 2 Dec 2007 18:37:58 -0800
  Finished at: Sun 2 Dec 2007 18:38:53 -0800
  Total time: 54s
  Build Trigger: Schedule
  Build Number: 7
  Exit code: 1
  Building machine hostname: vmbuild.apache.org
  Operating system : Linux(unknown)
  Java Home version : 
          java version "1.4.2_15"
          Java(TM) 2 Runtime Environment, Standard Edition (build 1.4.2_15-b02)
          Java HotSpot(TM) Client VM (build 1.4.2_15-b02, mixed mode)
        
  Builder version :
          Maven version: 2.0.7
          Java version: 1.4.2_15
          OS name: "linux" version: "2.6.20-16-server" arch: "i386"
    
****************************************************************************
SCM Changes:
****************************************************************************
Changed: sgoeschl @ Thu 29 Nov 2007 15:20:34 -0800
Comment: SANDBOX-203 Adding support for setting custom exit values - the standard implementation
throws an exception otherwise
Files changed:
  /commons/sandbox/exec/trunk/src/main/java/org/apache/commons/exec/DefaultExecutor.java (
599622 )
  /commons/sandbox/exec/trunk/src/main/java/org/apache/commons/exec/Executor.java ( 599622
)

Changed: sgoeschl @ Thu 29 Nov 2007 15:24:30 -0800
Comment: SANDBOX-204 Cleaning up the code, adding more regression tests, fixing broken Cobertura
coverage report, fixing javadocs
Files changed:
  /commons/sandbox/exec/trunk/pom.xml ( 599627 )
  /commons/sandbox/exec/trunk/src/main/java/org/apache/commons/exec/CommandLine.java ( 599627
)
  /commons/sandbox/exec/trunk/src/main/java/org/apache/commons/exec/ExecuteWatchdog.java (
599627 )
  /commons/sandbox/exec/trunk/src/main/java/org/apache/commons/exec/LogOutputStream.java (
599627 )
  /commons/sandbox/exec/trunk/src/main/java/org/apache/commons/exec/LogStreamHandler.java
( 599627 )
  /commons/sandbox/exec/trunk/src/main/java/org/apache/commons/exec/StreamPumper.java ( 599627
)
  /commons/sandbox/exec/trunk/src/main/java/org/apache/commons/exec/launcher/CommandLauncher.java
( 599627 )
  /commons/sandbox/exec/trunk/src/main/java/org/apache/commons/exec/launcher/VmsCommandLauncher.java
( 599627 )
  /commons/sandbox/exec/trunk/src/test/java/org/apache/commons/exec/CommandLineTest.java (
599627 )
  /commons/sandbox/exec/trunk/src/test/java/org/apache/commons/exec/DefaultExecutorTest.java
( 599627 )
  /commons/sandbox/exec/trunk/src/test/java/org/apache/commons/exec/environment/EnvironmentUtilTest.java
( 599627 )

Changed: sgoeschl @ Fri 30 Nov 2007 01:26:36 -0800
Comment: SANDBOX-204 adding missing test script for regression test
Files changed:
  /commons/sandbox/exec/trunk/src/test/scripts/forever.sh ( 599752 )

Changed: sgoeschl @ Fri 30 Nov 2007 09:33:25 -0800
Comment: Add
Files changed:
  /commons/sandbox/exec/trunk/pom.xml ( 599881 )

Changed: sgoeschl @ Fri 30 Nov 2007 10:14:35 -0800
Comment: Using the ViewVC SVN URL for the changelog report
Files changed:
  /commons/sandbox/exec/trunk/pom.xml ( 599888 )

****************************************************************************
Dependencies Changes:
****************************************************************************
No dependencies changed


****************************************************************************
Build Defintion:
****************************************************************************
POM filename: pom.xml
Goals: clean deploy   
Arguments: --batch-mode -DaltDeploymentRepository=vmbuild.repo::default::file://localhost/home/continuum/data/commons
-Pci
Build Fresh: false
Always Build: false
Default Build Definition: true
Schedule: COMMONS_SCHEDULE
Profile Name: Java 1.4
Description: 


****************************************************************************
Test Summary:
****************************************************************************
Tests: 44
Failures: 1
Total time: 43515

****************************************************************************
Output:
****************************************************************************
[INFO] Scanning for projects...
[INFO] ----------------------------------------------------------------------------
[INFO] Building Commons Exec (Sandbox)
[INFO]    task-segment: [clean, deploy]
[INFO] ----------------------------------------------------------------------------
[INFO] [clean:clean]
[INFO] Deleting directory /home/continuum/data/working-directory/178/target
[INFO] Deleting directory /home/continuum/data/working-directory/178/target/classes
[INFO] Deleting directory /home/continuum/data/working-directory/178/target/test-classes
[INFO] Deleting directory /home/continuum/data/working-directory/178/target/site
[INFO] [resources:resources]
[INFO] Using default encoding to copy filtered resources.
[INFO] [compiler:compile]
[INFO] Compiling 27 source files to /home/continuum/data/working-directory/178/target/classes
[INFO] [resources:testResources]
[INFO] Using default encoding to copy filtered resources.
[INFO] [compiler:testCompile]
[INFO] Compiling 6 source files to /home/continuum/data/working-directory/178/target/test-classes
[INFO] [surefire:test]
[INFO] Surefire report directory: /home/continuum/data/working-directory/178/target/surefire-reports

-------------------------------------------------------
 T E S T S
-------------------------------------------------------
Running org.apache.commons.exec.environment.EnvironmentUtilTest
Tests run: 2, Failures: 0, Errors: 0, Skipped: 0, Time elapsed: 0.098 sec
Running org.apache.commons.exec.CommandLineTest
Tests run: 21, Failures: 0, Errors: 0, Skipped: 0, Time elapsed: 0.03 sec
Running org.apache.commons.exec.TestUtilTest
Tests run: 7, Failures: 0, Errors: 0, Skipped: 0, Time elapsed: 0.018 sec
Running org.apache.commons.exec.DefaultExecutorTest
Tests run: 14, Failures: 1, Errors: 0, Skipped: 0, Time elapsed: 43.409 sec <<< FAILURE!

Results :

Failed tests: 
  testExecuteWatchdog(org.apache.commons.exec.DefaultExecutorTest)

Tests run: 44, Failures: 1, Errors: 0, Skipped: 0

[INFO] ------------------------------------------------------------------------
[ERROR] BUILD FAILURE
[INFO] ------------------------------------------------------------------------
[INFO] There are test failures.
[INFO] ------------------------------------------------------------------------
[INFO] For more information, run Maven with the -e switch
[INFO] ------------------------------------------------------------------------
[INFO] Total time: 50 seconds
[INFO] Finished at: Sun Dec 02 18:38:53 PST 2007
[INFO] Final Memory: 5M/13M
[INFO] ------------------------------------------------------------------------

****************************************************************************



---------------------------------------------------------------------
To unsubscribe, e-mail: dev-unsubscribe@commons.apache.org
For additional commands, e-mail: dev-help@commons.apache.org


Mime
View raw message