commons-dev mailing list archives

Site index · List index
Message view « Date » · « Thread »
Top « Date » · « Thread »
From Continuum VMBuild Server <contin...@apache.org>
Subject [continuum] BUILD FAILURE: Commons FileUpload
Date Sat, 13 Oct 2007 02:33:58 GMT
Online report : http://vmbuild.apache.org/continuum/buildResult.action?buildId=12831&projectId=166

Build statistics:
  State: Failed
  Previous State: Failed
  Started at: Fri 12 Oct 2007 19:33:30 -0700
  Finished at: Fri 12 Oct 2007 19:33:51 -0700
  Total time: 21s
  Build Trigger: Schedule
  Build Number: 0
  Exit code: 1
  Building machine hostname: vmbuild.apache.org
  Operating system : Linux(unknown)
  Java Home version : 
          java version "1.4.2_15"
          Java(TM) 2 Runtime Environment, Standard Edition (build 1.4.2_15-b02)
          Java HotSpot(TM) Client VM (build 1.4.2_15-b02, mixed mode)
        
  Builder version :
          Maven version: 2.0.7
          Java version: 1.4.2_15
          OS name: "linux" version: "2.6.20-16-server" arch: "i386"
    
****************************************************************************
SCM Changes:
****************************************************************************
No files changed

****************************************************************************
Dependencies Changes:
****************************************************************************
commons-io:commons-io:1.4-SNAPSHOT


****************************************************************************
Build Defintion:
****************************************************************************
POM filename: pom.xml
Goals: clean deploy   
Arguments: --batch-mode -DaltDeploymentRepository=vmbuild.repo::default::file://localhost/home/continuum/data/commons
-Pci
Build Fresh: false
Always Build: false
Default Build Definition: true
Schedule: COMMONS_SCHEDULE
Profile Name: Java 1.4
Description: 


****************************************************************************
Test Summary:
****************************************************************************
Tests: 31
Failures: 1
Total time: 5739

****************************************************************************
Output:
****************************************************************************
[INFO] Scanning for projects...
[INFO] ----------------------------------------------------------------------------
[INFO] Building Commons FileUpload
[INFO]    task-segment: [clean, deploy]
[INFO] ----------------------------------------------------------------------------
[INFO] [clean:clean]
[INFO] Deleting directory /home/continuum/data/working-directory/166/target
[INFO] Deleting directory /home/continuum/data/working-directory/166/target/classes
[INFO] Deleting directory /home/continuum/data/working-directory/166/target/test-classes
[INFO] Deleting directory /home/continuum/data/working-directory/166/target/site
[INFO] [resources:resources]
[INFO] Using default encoding to copy filtered resources.
[INFO] [compiler:compile]
[INFO] Compiling 27 source files to /home/continuum/data/working-directory/166/target/classes
[INFO] [resources:testResources]
[INFO] Using default encoding to copy filtered resources.
[INFO] [compiler:testCompile]
[INFO] Compiling 14 source files to /home/continuum/data/working-directory/166/target/test-classes
[INFO] [surefire:test]
[INFO] Surefire report directory: /home/continuum/data/working-directory/166/target/surefire-reports

-------------------------------------------------------
 T E S T S
-------------------------------------------------------
Running org.apache.commons.fileupload.DiskFileItemSerializeTest
Tests run: 3, Failures: 1, Errors: 0, Skipped: 0, Time elapsed: 0.157 sec <<< FAILURE!
Running org.apache.commons.fileupload.MultipartStreamTest
Tests run: 2, Failures: 0, Errors: 0, Skipped: 0, Time elapsed: 0.015 sec
Running org.apache.commons.fileupload.DefaultFileItemTest
Tests run: 6, Failures: 0, Errors: 0, Skipped: 0, Time elapsed: 0.035 sec
Running org.apache.commons.fileupload.ParameterParserTest
Tests run: 4, Failures: 0, Errors: 0, Skipped: 0, Time elapsed: 0.008 sec
Running org.apache.commons.fileupload.SizesTest
Tests run: 2, Failures: 0, Errors: 0, Skipped: 0, Time elapsed: 1.715 sec
Running org.apache.commons.fileupload.FileItemHeadersTest
Tests run: 1, Failures: 0, Errors: 0, Skipped: 0, Time elapsed: 0.004 sec
Running org.apache.commons.fileupload.ProgressListenerTest
Tests run: 1, Failures: 0, Errors: 0, Skipped: 0, Time elapsed: 1.575 sec
Running org.apache.commons.fileupload.ServletFileUploadTest
Tests run: 8, Failures: 0, Errors: 0, Skipped: 0, Time elapsed: 0.028 sec
Running org.apache.commons.fileupload.StreamingTest
Tests run: 4, Failures: 0, Errors: 0, Skipped: 0, Time elapsed: 2.245 sec

Results :

Failed tests: 
  testAboveThreshold(org.apache.commons.fileupload.DiskFileItemSerializeTest)

Tests run: 31, Failures: 1, Errors: 0, Skipped: 0

[INFO] ------------------------------------------------------------------------
[ERROR] BUILD FAILURE
[INFO] ------------------------------------------------------------------------
[INFO] There are test failures.
[INFO] ------------------------------------------------------------------------
[INFO] For more information, run Maven with the -e switch
[INFO] ------------------------------------------------------------------------
[INFO] Total time: 12 seconds
[INFO] Finished at: Fri Oct 12 19:33:51 PDT 2007
[INFO] Final Memory: 6M/13M
[INFO] ------------------------------------------------------------------------

****************************************************************************



---------------------------------------------------------------------
To unsubscribe, e-mail: dev-unsubscribe@commons.apache.org
For additional commands, e-mail: dev-help@commons.apache.org


Mime
View raw message