commons-dev mailing list archives

Site index · List index
Message view « Date » · « Thread »
Top « Date » · « Thread »
From "Continuum@vmbuild" <...@commons.apache.org>
Subject [continuum] BUILD FAILURE: Commons Proxy (Sandbox)
Date Fri, 28 Sep 2007 11:34:11 GMT
Online report : http://vmbuild.apache.org/continuum/buildResult.action?buildId=8609&projectId=188

Build statistics:
  State: Failed
  Previous State: Ok
  Started at: Fri 28 Sep 2007 04:33:21 -0700
  Finished at: Fri 28 Sep 2007 04:34:00 -0700
  Total time: 39s
  Build Trigger: Schedule
  Build Number: 6
  Exit code: 1
  Building machine hostname: vmbuild
  Operating system : Linux(unknown)
  Java Home version : 
          java version "1.4.2_15"
          Java(TM) 2 Runtime Environment, Standard Edition (build 1.4.2_15-b02)
          Java HotSpot(TM) Client VM (build 1.4.2_15-b02, mixed mode)
        
  Builder version :
          Maven version: 2.0.7
          Java version: 1.4.2_15
          OS name: "linux" version: "2.6.20-16-server" arch: "i386"
    
****************************************************************************
SCM Changes:
****************************************************************************
Changed: jcarman @ Fri 28 Sep 2007 04:09:25 -0700
Comment: Javassist Has Moved!
Files changed:
  /commons/sandbox/proxy/trunk/pom.xml ( 580298 )

****************************************************************************
Dependencies Changes:
****************************************************************************
No dependencies changed


****************************************************************************
Build Defintion:
****************************************************************************
POM filename: pom.xml
Goals: clean deploy   
Arguments: --batch-mode -DaltDeploymentRepository=vmbuild.repo::default::file://localhost/home/continuum/data/commons
Build Fresh: false
Always Build: false
Default Build Definition: true
Schedule: COMMONS_SCHEDULE
Profile Name: Java 1.4
Description: 


****************************************************************************
Test Summary:
****************************************************************************
Tests: 0
Failures: 0
Total time: 0

****************************************************************************
Output:
****************************************************************************
[INFO] Scanning for projects...
[INFO] ----------------------------------------------------------------------------
[INFO] Building Commons Proxy (Sandbox)
[INFO]    task-segment: [clean, deploy]
[INFO] ----------------------------------------------------------------------------
[INFO] [clean:clean]
[INFO] Deleting directory /home/continuum/data/working-directory/188/target
[INFO] Deleting directory /home/continuum/data/working-directory/188/target/classes
[INFO] Deleting directory /home/continuum/data/working-directory/188/target/test-classes
[INFO] Deleting directory /home/continuum/data/working-directory/188/target/site
[INFO] [resources:resources]
[INFO] Using default encoding to copy filtered resources.
[INFO] [compiler:compile]
[INFO] No sources to compile
[INFO] [resources:testResources]
[INFO] Using default encoding to copy filtered resources.
[INFO] [compiler:testCompile]
[INFO] Compiling 45 source files to /home/continuum/data/working-directory/188/target/test-classes
[INFO] ------------------------------------------------------------------------
[ERROR] BUILD FAILURE
[INFO] ------------------------------------------------------------------------
[INFO] Compilation failure

/home/continuum/data/working-directory/188/src/test/java/org/apache/commons/proxy/invoker/TestNullInvoker.java:[19,32]
cannot resolve symbol
symbol  : class ProxyUtils 
location: package proxy

/home/continuum/data/working-directory/188/src/test/java/org/apache/commons/proxy/invoker/TestNullInvoker.java:[20,46]
cannot resolve symbol
symbol  : class CglibProxyFactory 
location: package cglib

/home/continuum/data/working-directory/188/src/test/java/org/apache/commons/proxy/TestProxyUtils.java:[20,50]
cannot resolve symbol
symbol  : class JavassistProxyFactory 
location: package javassist

/home/continuum/data/working-directory/188/src/test/java/org/apache/commons/proxy/factory/AbstractSubclassingProxyFactoryTestCase.java:[19,32]
cannot resolve symbol
symbol  : class ProxyFactory 
location: package proxy

/home/continuum/data/working-directory/188/src/test/java/org/apache/commons/proxy/factory/AbstractSubclassingProxyFactoryTestCase.java:[20,42]
cannot resolve symbol
symbol  : class ProxyFactoryException 
location: package exception

/home/continuum/data/working-directory/188/src/test/java/org/apache/commons/proxy/factory/AbstractSubclassingProxyFactoryTestCase.java:[21,40]
cannot resolve symbol
symbol  : class NullInvoker 
location: package invoker

/home/continuum/data/working-directory/188/src/test/java/org/apache/commons/proxy/factory/AbstractSubclassingProxyFactoryTestCase.java:[22,41]
cannot resolve symbol
symbol  : class ConstantProvider 
location: package provider

/home/continuum/data/working-directory/188/src/test/java/org/apache/commons/proxy/factory/AbstractProxyFactoryTestCase.java:[18,32]
cannot resolve symbol
symbol  : class Invocation 
location: package proxy

/home/continuum/data/working-directory/188/src/test/java/org/apache/commons/proxy/factory/AbstractProxyFactoryTestCase.java:[19,32]
cannot resolve symbol
symbol  : class Interceptor 
location: package proxy

/home/continuum/data/working-directory/188/src/test/java/org/apache/commons/proxy/factory/AbstractProxyFactoryTestCase.java:[20,32]
cannot resolve symbol
symbol  : class Invoker 
location: package proxy

/home/continuum/data/working-directory/188/src/test/java/org/apache/commons/proxy/factory/AbstractProxyFactoryTestCase.java:[21,32]
cannot resolve symbol
symbol  : class ObjectProvider 
location: package proxy

/home/continuum/data/working-directory/188/src/test/java/org/apache/commons/proxy/factory/AbstractProxyFactoryTestCase.java:[22,32]
cannot resolve symbol
symbol  : class ProxyFactory 
location: package proxy

/home/continuum/data/working-directory/188/src/test/java/org/apache/commons/proxy/factory/AbstractProxyFactoryTestCase.java:[23,41]
cannot resolve symbol
symbol  : class ProviderUtils 
location: package provider

/home/continuum/data/working-directory/188/src/test/java/org/apache/commons/proxy/factory/AbstractSubclassingProxyFactoryTestCase.java:[33,55]
cannot resolve symbol
symbol  : class ProxyFactory 
location: class org.apache.commons.proxy.factory.AbstractSubclassingProxyFactoryTestCase

/home/continuum/data/working-directory/188/src/test/java/org/apache/commons/proxy/factory/AbstractProxyFactoryTestCase.java:[44,20]
cannot resolve symbol
symbol  : class ProxyFactory 
location: class org.apache.commons.proxy.factory.AbstractProxyFactoryTestCase

/home/continuum/data/working-directory/188/src/test/java/org/apache/commons/proxy/factory/AbstractProxyFactoryTestCase.java:[47,44]
cannot resolve symbol
symbol  : class ProxyFactory 
location: class org.apache.commons.proxy.factory.AbstractProxyFactoryTestCase

/home/continuum/data/working-directory/188/src/test/java/org/apache/commons/proxy/factory/AbstractProxyFactoryTestCase.java:[114,12]
cannot resolve symbol
symbol  : class ObjectProvider 
location: class org.apache.commons.proxy.factory.AbstractProxyFactoryTestCase

/home/continuum/data/working-directory/188/src/test/java/org/apache/commons/proxy/interceptor/TestLoggingInterceptor.java:[20,46]
cannot resolve symbol
symbol  : class CglibProxyFactory 
location: package cglib

/home/continuum/data/working-directory/188/src/test/java/org/apache/commons/proxy/factory/util/TestMethodSignature.java:[21,45]
cannot resolve symbol
symbol  : class MethodSignature 
location: package util

/home/continuum/data/working-directory/188/src/test/java/org/apache/commons/proxy/util/SuffixInterceptor.java:[18,32]
cannot resolve symbol
symbol  : class Invocation 
location: package proxy

/home/continuum/data/working-directory/188/src/test/java/org/apache/commons/proxy/util/SuffixInterceptor.java:[19,32]
cannot resolve symbol
symbol  : class Interceptor 
location: package proxy

/home/continuum/data/working-directory/188/src/test/java/org/apache/commons/proxy/util/SuffixInterceptor.java:[25,42]
cannot resolve symbol
symbol  : class Interceptor 
location: class org.apache.commons.proxy.util.SuffixInterceptor

/home/continuum/data/working-directory/188/src/test/java/org/apache/commons/proxy/util/SuffixInterceptor.java:[34,29]
cannot resolve symbol
symbol  : class Invocation 
location: class org.apache.commons.proxy.util.SuffixInterceptor

/home/continuum/data/working-directory/188/src/test/java/org/apache/commons/proxy/provider/cache/AbstractCacheTestCase.java:[31,23]
cannot resolve symbol
symbol  : class Cache 
location: class org.apache.commons.proxy.provider.cache.AbstractCacheTestCase

/home/continuum/data/working-directory/188/src/test/java/org/apache/commons/proxy/provider/cache/AbstractCacheTestCase.java:[61,56]
cannot resolve symbol
symbol  : class CacheEvictionListener 
location: class org.apache.commons.proxy.provider.cache.AbstractCacheTestCase.CacheEvictionTester

/home/continuum/data/working-directory/188/src/test/java/org/apache/commons/proxy/provider/cache/AbstractCacheTestCase.java:[63,16]
cannot resolve symbol
symbol  : class CacheEvictionEvent 
location: class org.apache.commons.proxy.provider.cache.AbstractCacheTestCase.CacheEvictionTester

/home/continuum/data/working-directory/188/src/test/java/org/apache/commons/proxy/provider/cache/AbstractCacheTestCase.java:[65,35]
cannot resolve symbol
symbol  : class CacheEvictionEvent 
location: class org.apache.commons.proxy.provider.cache.AbstractCacheTestCase.CacheEvictionTester

/home/continuum/data/working-directory/188/src/test/java/org/apache/commons/proxy/provider/TestHessianProvider.java:[20,42]
cannot resolve symbol
symbol  : class ObjectProviderException 
location: package exception

/home/continuum/data/working-directory/188/src/test/java/org/apache/commons/proxy/provider/cache/TestThreadLocalCache.java:[20,14]
cannot resolve symbol
symbol  : class Cache 
location: class org.apache.commons.proxy.provider.cache.TestThreadLocalCache

/home/continuum/data/working-directory/188/src/test/java/org/apache/commons/proxy/interceptor/TestMethodInterceptorAdapter.java:[22,32]
cannot resolve symbol
symbol  : class ProxyUtils 
location: package proxy

/home/continuum/data/working-directory/188/src/test/java/org/apache/commons/proxy/interceptor/TestMethodInterceptorAdapter.java:[23,50]
cannot resolve symbol
symbol  : class JavassistProxyFactory 
location: package javassist

/home/continuum/data/working-directory/188/src/test/java/org/apache/commons/proxy/interceptor/TestInterceptorChain.java:[19,32]
cannot resolve symbol
symbol  : class Interceptor 
location: package proxy

/home/continuum/data/working-directory/188/src/test/java/org/apache/commons/proxy/interceptor/TestInterceptorChain.java:[20,46]
cannot resolve symbol
symbol  : class CglibProxyFactory 
location: package cglib

/home/continuum/data/working-directory/188/src/test/java/org/apache/commons/proxy/interceptor/filter/TestPatternFilter.java:[22,44]
cannot resolve symbol
symbol  : class MethodFilter 
location: package interceptor

/home/continuum/data/working-directory/188/src/test/java/org/apache/commons/proxy/provider/TestRmiProvider.java:[19,42]
cannot resolve symbol
symbol  : class ObjectProviderException 
location: package exception

/home/continuum/data/working-directory/188/src/test/java/org/apache/commons/proxy/factory/AbstractProxyFactoryTestCase.java:[247,62]
cannot resolve symbol
symbol  : class Interceptor 
location: class org.apache.commons.proxy.factory.AbstractProxyFactoryTestCase.ChangeArgumentInterceptor

/home/continuum/data/working-directory/188/src/test/java/org/apache/commons/proxy/factory/AbstractProxyFactoryTestCase.java:[249,33]
cannot resolve symbol
symbol  : class Invocation 
location: class org.apache.commons.proxy.factory.AbstractProxyFactoryTestCase.ChangeArgumentInterceptor

/home/continuum/data/working-directory/188/src/test/java/org/apache/commons/proxy/factory/AbstractProxyFactoryTestCase.java:[256,60]
cannot resolve symbol
symbol  : class Interceptor 
location: class org.apache.commons.proxy.factory.AbstractProxyFactoryTestCase.NoOpMethodInterceptor

/home/continuum/data/working-directory/188/src/test/java/org/apache/commons/proxy/factory/AbstractProxyFactoryTestCase.java:[258,33]
cannot resolve symbol
symbol  : class Invocation 
location: class org.apache.commons.proxy.factory.AbstractProxyFactoryTestCase.NoOpMethodInterceptor

/home/continuum/data/working-directory/188/src/test/java/org/apache/commons/proxy/factory/AbstractProxyFactoryTestCase.java:[264,50]
cannot resolve symbol
symbol  : class Invoker 
location: class org.apache.commons.proxy.factory.AbstractProxyFactoryTestCase.InvokerTester

/home/continuum/data/working-directory/188/src/test/java/org/apache/commons/proxy/factory/AbstractProxyFactoryTestCase.java:[279,54]
cannot resolve symbol
symbol  : class Interceptor 
location: class org.apache.commons.proxy.factory.AbstractProxyFactoryTestCase.InterceptorTester

/home/continuum/data/working-directory/188/src/test/java/org/apache/commons/proxy/factory/AbstractProxyFactoryTestCase.java:[286,33]
cannot resolve symbol
symbol  : class Invocation 
location: class org.apache.commons.proxy.factory.AbstractProxyFactoryTestCase.InterceptorTester

/home/continuum/data/working-directory/188/src/test/java/org/apache/commons/proxy/provider/TestCachedProvider.java:[19,47]
cannot resolve symbol
symbol  : class SimpleCache 
location: package cache

/home/continuum/data/working-directory/188/src/test/java/org/apache/commons/proxy/provider/TestCachedProvider.java:[20,47]
cannot resolve symbol
symbol  : class ThreadLocalCache 
location: package cache

/home/continuum/data/working-directory/188/src/test/java/org/apache/commons/proxy/provider/TestCachedProvider.java:[21,47]
cannot resolve symbol
symbol  : class CacheEvictionListener 
location: package cache

/home/continuum/data/working-directory/188/src/test/java/org/apache/commons/proxy/provider/TestCachedProvider.java:[22,47]
cannot resolve symbol
symbol  : class CacheEvictionEvent 
location: package cache

/home/continuum/data/working-directory/188/src/test/java/org/apache/commons/proxy/provider/TestCachedProvider.java:[87,56]
cannot resolve symbol
symbol  : class CacheEvictionListener 
location: class org.apache.commons.proxy.provider.TestCachedProvider.CacheEvictionTester

/home/continuum/data/working-directory/188/src/test/java/org/apache/commons/proxy/provider/TestCachedProvider.java:[89,16]
cannot resolve symbol
symbol  : class CacheEvictionEvent 
location: class org.apache.commons.proxy.provider.TestCachedProvider.CacheEvictionTester

/home/continuum/data/working-directory/188/src/test/java/org/apache/commons/proxy/provider/TestCachedProvider.java:[91,35]
cannot resolve symbol
symbol  : class CacheEvictionEvent 
location: class org.apache.commons.proxy.provider.TestCachedProvider.CacheEvictionTester

/home/continuum/data/working-directory/188/src/test/java/org/apache/commons/proxy/interceptor/TestExecutorInterceptor.java:[20,46]
cannot resolve symbol
symbol  : class CglibProxyFactory 
location: package cglib

/home/continuum/data/working-directory/188/src/test/java/org/apache/commons/proxy/invoker/TestXmlRpcInvoker.java:[25,42]
cannot resolve symbol
symbol  : class InvokerException 
location: package exception

/home/continuum/data/working-directory/188/src/test/java/org/apache/commons/proxy/invoker/TestXmlRpcInvoker.java:[26,46]
cannot resolve symbol
symbol  : class CglibProxyFactory 
location: package cglib

/home/continuum/data/working-directory/188/src/test/java/org/apache/commons/proxy/provider/TestBeanProvider.java:[19,42]
cannot resolve symbol
symbol  : class ObjectProviderException 
location: package exception

/home/continuum/data/working-directory/188/src/test/java/org/apache/commons/proxy/provider/CountingProvider.java:[18,32]
cannot resolve symbol
symbol  : class ObjectProvider 
location: package proxy

/home/continuum/data/working-directory/188/src/test/java/org/apache/commons/proxy/provider/CountingProvider.java:[24,38]
cannot resolve symbol
symbol  : class ProviderDecorator 
location: class org.apache.commons.proxy.provider.CountingProvider

/home/continuum/data/working-directory/188/src/test/java/org/apache/commons/proxy/provider/CountingProvider.java:[28,29]
cannot resolve symbol
symbol  : class ObjectProvider 
location: class org.apache.commons.proxy.provider.CountingProvider

/home/continuum/data/working-directory/188/src/test/java/org/apache/commons/proxy/provider/cache/TestSimpleCache.java:[20,14]
cannot resolve symbol
symbol  : class Cache 
location: class org.apache.commons.proxy.provider.cache.TestSimpleCache

/home/continuum/data/working-directory/188/src/test/java/org/apache/commons/proxy/provider/TestBurlapProvider.java:[20,42]
cannot resolve symbol
symbol  : class ObjectProviderException 
location: package exception

/home/continuum/data/working-directory/188/src/test/java/org/apache/commons/proxy/invoker/TestInvocationHandlerAdapter.java:[19,50]
cannot resolve symbol
symbol  : class JavassistProxyFactory 
location: package javassist

/home/continuum/data/working-directory/188/src/test/java/org/apache/commons/proxy/provider/TestCloningProvider.java:[20,42]
cannot resolve symbol
symbol  : class ObjectProviderException 
location: package exception

/home/continuum/data/working-directory/188/src/test/java/org/apache/commons/proxy/provider/TestPooledProvider.java:[21,32]
cannot resolve symbol
symbol  : class ObjectProvider 
location: package proxy

/home/continuum/data/working-directory/188/src/test/java/org/apache/commons/proxy/provider/TestPooledProvider.java:[22,42]
cannot resolve symbol
symbol  : class ObjectProviderException 
location: package exception

/home/continuum/data/working-directory/188/src/test/java/org/apache/commons/proxy/provider/TestPooledProvider.java:[23,50]
cannot resolve symbol
symbol  : class JavassistProxyFactory 
location: package javassist

/home/continuum/data/working-directory/188/src/test/java/org/apache/commons/proxy/provider/TestPooledProvider.java:[24,47]
cannot resolve symbol
symbol  : class SimpleCache 
location: package cache

/home/continuum/data/working-directory/188/src/test/java/org/apache/commons/proxy/provider/TestPooledProvider.java:[25,47]
cannot resolve symbol
symbol  : class ThreadLocalCache 
location: package cache

/home/continuum/data/working-directory/188/src/test/java/org/apache/commons/proxy/provider/TestPooledProvider.java:[105,47]
cannot resolve symbol
symbol  : class ObjectProvider 
location: class org.apache.commons.proxy.provider.TestPooledProvider.ExceptionProvider

/home/continuum/data/working-directory/188/src/test/java/org/apache/commons/proxy/interceptor/TestFilteredInterceptor.java:[21,46]
cannot resolve symbol
symbol  : class CglibProxyFactory 
location: package cglib

/home/continuum/data/working-directory/188/src/test/java/org/apache/commons/proxy/interceptor/TestFilteredInterceptor.java:[22,51]
cannot resolve symbol
symbol  : class SimpleFilter 
location: package filter

/home/continuum/data/working-directory/188/src/test/java/org/apache/commons/proxy/interceptor/TestFilteredInterceptor.java:[23,32]
cannot resolve symbol
symbol  : class Interceptor 
location: package proxy

/home/continuum/data/working-directory/188/src/test/java/org/apache/commons/proxy/provider/TestConstantProvider.java:[29,14]
cannot resolve symbol
symbol  : class ConstantProvider 
location: class org.apache.commons.proxy.provider.TestConstantProvider

/home/continuum/data/working-directory/188/src/test/java/org/apache/commons/proxy/provider/TestConstantProvider.java:[29,46]
cannot resolve symbol
symbol  : class ConstantProvider 
location: class org.apache.commons.proxy.provider.TestConstantProvider

/home/continuum/data/working-directory/188/src/test/java/org/apache/commons/proxy/invoker/TestNullInvoker.java:[26,73]
cannot resolve symbol
symbol  : class CglibProxyFactory 
location: class org.apache.commons.proxy.invoker.TestNullInvoker

/home/continuum/data/working-directory/188/src/test/java/org/apache/commons/proxy/invoker/TestNullInvoker.java:[26,40]
cannot resolve symbol
symbol  : variable ProxyUtils 
location: class org.apache.commons.proxy.invoker.TestNullInvoker

/home/continuum/data/working-directory/188/src/test/java/org/apache/commons/proxy/TestProxyUtils.java:[47,39]
cannot resolve symbol
symbol  : class JavassistProxyFactory 
location: class org.apache.commons.proxy.TestProxyUtils

/home/continuum/data/working-directory/188/src/test/java/org/apache/commons/proxy/TestProxyUtils.java:[46,39]
cannot resolve symbol
symbol  : variable ProxyUtils 
location: class org.apache.commons.proxy.TestProxyUtils

/home/continuum/data/working-directory/188/src/test/java/org/apache/commons/proxy/TestProxyUtils.java:[55,72]
cannot resolve symbol
symbol  : class JavassistProxyFactory 
location: class org.apache.commons.proxy.TestProxyUtils

/home/continuum/data/working-directory/188/src/test/java/org/apache/commons/proxy/TestProxyUtils.java:[55,39]
cannot resolve symbol
symbol  : variable ProxyUtils 
location: class org.apache.commons.proxy.TestProxyUtils

/home/continuum/data/working-directory/188/src/test/java/org/apache/commons/proxy/TestProxyUtils.java:[65,20]
cannot resolve symbol
symbol  : variable ProxyUtils 
location: class org.apache.commons.proxy.TestProxyUtils

/home/continuum/data/working-directory/188/src/test/java/org/apache/commons/proxy/TestProxyUtils.java:[66,123]
cannot resolve symbol
symbol  : variable ProxyUtils 
location: class org.apache.commons.proxy.TestProxyUtils

/home/continuum/data/working-directory/188/src/test/java/org/apache/commons/proxy/TestProxyUtils.java:[71,44]
cannot resolve symbol
symbol  : variable ProxyUtils 
location: class org.apache.commons.proxy.TestProxyUtils

/home/continuum/data/working-directory/188/src/test/java/org/apache/commons/proxy/TestProxyUtils.java:[72,46]
cannot resolve symbol
symbol  : variable ProxyUtils 
location: class org.apache.commons.proxy.TestProxyUtils

/home/continuum/data/working-directory/188/src/test/java/org/apache/commons/proxy/TestProxyUtils.java:[73,48]
cannot resolve symbol
symbol  : variable ProxyUtils 
location: class org.apache.commons.proxy.TestProxyUtils

/home/continuum/data/working-directory/188/src/test/java/org/apache/commons/proxy/TestProxyUtils.java:[74,29]
cannot resolve symbol
symbol  : variable ProxyUtils 
location: class org.apache.commons.proxy.TestProxyUtils

/home/continuum/data/working-directory/188/src/test/java/org/apache/commons/proxy/TestProxyUtils.java:[75,31]
cannot resolve symbol
symbol  : variable ProxyUtils 
location: class org.apache.commons.proxy.TestProxyUtils

/home/continuum/data/working-directory/188/src/test/java/org/apache/commons/proxy/TestProxyUtils.java:[76,30]
cannot resolve symbol
symbol  : variable ProxyUtils 
location: class org.apache.commons.proxy.TestProxyUtils

/home/continuum/data/working-directory/188/src/test/java/org/apache/commons/proxy/TestProxyUtils.java:[77,32]
cannot resolve symbol
symbol  : variable ProxyUtils 
location: class org.apache.commons.proxy.TestProxyUtils

/home/continuum/data/working-directory/188/src/test/java/org/apache/commons/proxy/TestProxyUtils.java:[78,31]
cannot resolve symbol
symbol  : variable ProxyUtils 
location: class org.apache.commons.proxy.TestProxyUtils

/home/continuum/data/working-directory/188/src/test/java/org/apache/commons/proxy/TestProxyUtils.java:[79,30]
cannot resolve symbol
symbol  : variable ProxyUtils 
location: class org.apache.commons.proxy.TestProxyUtils

/home/continuum/data/working-directory/188/src/test/java/org/apache/commons/proxy/TestProxyUtils.java:[80,30]
cannot resolve symbol
symbol  : variable ProxyUtils 
location: class org.apache.commons.proxy.TestProxyUtils

/home/continuum/data/working-directory/188/src/test/java/org/apache/commons/proxy/TestProxyUtils.java:[81,33]
cannot resolve symbol
symbol  : variable ProxyUtils 
location: class org.apache.commons.proxy.TestProxyUtils

/home/continuum/data/working-directory/188/src/test/java/org/apache/commons/proxy/factory/AbstractProxyFactoryTestCase.java:[60,74]
cannot resolve symbol
symbol  : variable ProviderUtils 
location: class org.apache.commons.proxy.factory.AbstractProxyFactoryTestCase

/home/continuum/data/working-directory/188/src/test/java/org/apache/commons/proxy/factory/AbstractProxyFactoryTestCase.java:[116,48]
cannot resolve symbol
symbol  : variable ProviderUtils 
location: class org.apache.commons.proxy.factory.AbstractProxyFactoryTestCase

/home/continuum/data/working-directory/188/src/test/java/org/apache/commons/proxy/factory/AbstractProxyFactoryTestCase.java:[116,15]
cannot resolve symbol
symbol  : variable ProviderUtils 
location: class org.apache.commons.proxy.factory.AbstractProxyFactoryTestCase

/home/continuum/data/working-directory/188/src/test/java/org/apache/commons/proxy/factory/AbstractProxyFactoryTestCase.java:[166,67]
cannot resolve symbol
symbol  : variable ProviderUtils 
location: class org.apache.commons.proxy.factory.AbstractProxyFactoryTestCase

/home/continuum/data/working-directory/188/src/test/java/org/apache/commons/proxy/factory/AbstractProxyFactoryTestCase.java:[167,67]
cannot resolve symbol
symbol  : variable ProviderUtils 
location: class org.apache.commons.proxy.factory.AbstractProxyFactoryTestCase

/home/continuum/data/working-directory/188/src/test/java/org/apache/commons/proxy/factory/AbstractProxyFactoryTestCase.java:[180,66]
cannot resolve symbol
symbol  : variable ProviderUtils 
location: class org.apache.commons.proxy.factory.AbstractProxyFactoryTestCase

/home/continuum/data/working-directory/188/src/test/java/org/apache/commons/proxy/factory/AbstractProxyFactoryTestCase.java:[193,66]
cannot resolve symbol
symbol  : variable ProviderUtils 
location: class org.apache.commons.proxy.factory.AbstractProxyFactoryTestCase

/home/continuum/data/working-directory/188/src/test/java/org/apache/commons/proxy/factory/AbstractSubclassingProxyFactoryTestCase.java:[40,68]
cannot resolve symbol
symbol  : class ConstantProvider 
location: class org.apache.commons.proxy.factory.AbstractSubclassingProxyFactoryTestCase

/home/continuum/data/working-directory/188/src/test/java/org/apache/commons/proxy/factory/AbstractSubclassingProxyFactoryTestCase.java:[60,43]
cannot resolve symbol
symbol  : class ConstantProvider 
location: class org.apache.commons.proxy.factory.AbstractSubclassingProxyFactoryTestCase

/home/continuum/data/working-directory/188/src/test/java/org/apache/commons/proxy/factory/AbstractSubclassingProxyFactoryTestCase.java:[74,41]
cannot resolve symbol
symbol  : class NullInvoker 
location: class org.apache.commons.proxy.factory.AbstractSubclassingProxyFactoryTestCase


[INFO] ------------------------------------------------------------------------
[INFO] For more information, run Maven with the -e switch
[INFO] ------------------------------------------------------------------------
[INFO] Total time: 24 seconds
[INFO] Finished at: Fri Sep 28 04:34:00 PDT 2007
[INFO] Final Memory: 5M/16M
[INFO] ------------------------------------------------------------------------

****************************************************************************



---------------------------------------------------------------------
To unsubscribe, e-mail: dev-unsubscribe@commons.apache.org
For additional commands, e-mail: dev-help@commons.apache.org


Mime
View raw message