commons-dev mailing list archives

Site index · List index
Message view « Date » · « Thread »
Top « Date » · « Thread »
From "Continuum@vmbuild" <...@commons.apache.org>
Subject [continuum] BUILD FAILURE: Commons Performance (Sandbox)
Date Sat, 08 Sep 2007 04:31:17 GMT
Online report : http://vmbuild.apache.org/continuum/buildResult.action?buildId=4299&projectId=186

Build statistics:
  State: Failed
  Previous State: Ok
  Started at: Fri 7 Sep 2007 21:31:04 -0700
  Finished at: Fri 7 Sep 2007 21:31:15 -0700
  Total time: 10s
  Build Trigger: Schedule
  Build Number: 4
  Exit code: 1
  Building machine hostname: vmbuild
  Operating system : Linux(unknown)
  Java Home version : 
          java version "1.5.0_12"
          Java(TM) 2 Runtime Environment, Standard Edition (build 1.5.0_12-b04)
          Java HotSpot(TM) Client VM (build 1.5.0_12-b04, mixed mode, sharing)
        
  Builder version :
          Maven version: 2.0.7
          Java version: 1.5.0_12
          OS name: "linux" version: "2.6.20-16-server" arch: "i386"
    
****************************************************************************
SCM Changes:
****************************************************************************
Changed: psteitz @ Fri 7 Sep 2007 20:50:42 -0700
Comment: Added some configuration tests.
Files changed:
  /commons/sandbox/performance/trunk/src/java/org/apache/commons/performance/LoadGenerator.java
( 573782 )
  /commons/sandbox/performance/trunk/src/java/org/apache/commons/performance/pool/PoolSoak.java
( 573782 )
  /commons/sandbox/performance/trunk/src/test/org/apache/commons/performance/pool ( 573782
)
  /commons/sandbox/performance/trunk/src/test/org/apache/commons/performance/pool/PoolSoakTest.java
( 573782 )
  /commons/sandbox/performance/trunk/src/test/org/apache/commons/performance/pool/config-abandoned.xml
( 573782 )
  /commons/sandbox/performance/trunk/src/test/org/apache/commons/performance/pool/config-pool.xml
(from /commons/sandbox/performance/trunk/config-pool.xml:566024) ( 573782 )

****************************************************************************
Dependencies Changes:
****************************************************************************
No dependencies changed

****************************************************************************
Test Summary:
****************************************************************************
Tests: 7
Failures: 2
Total time: 307

****************************************************************************
Output:
****************************************************************************
[INFO] Scanning for projects...
[INFO] ----------------------------------------------------------------------------
[INFO] Building Commons Performance (Sandbox)
[INFO]    task-segment: [clean, install]
[INFO] ----------------------------------------------------------------------------
[INFO] [clean:clean]
[INFO] Deleting directory /home/continuum/data/working-directory/186/target
[INFO] Deleting directory /home/continuum/data/working-directory/186/target/classes
[INFO] Deleting directory /home/continuum/data/working-directory/186/target/test-classes
[INFO] Deleting directory /home/continuum/data/working-directory/186/target/site
[INFO] [cobertura:clean {execution: default}]
[INFO] [resources:resources]
[INFO] Using default encoding to copy filtered resources.
[INFO] [compiler:compile]
[INFO] Compiling 11 source files to /home/continuum/data/working-directory/186/target/classes
[INFO] [resources:testResources]
[INFO] Using default encoding to copy filtered resources.
[INFO] [compiler:testCompile]
[INFO] Compiling 2 source files to /home/continuum/data/working-directory/186/target/test-classes
[INFO] [surefire:test]
[INFO] Surefire report directory: /home/continuum/data/working-directory/186/target/surefire-reports

-------------------------------------------------------
 T E S T S
-------------------------------------------------------
Running org.apache.commons.performance.pool.PoolSoakTest
Tests run: 2, Failures: 0, Errors: 2, Skipped: 0, Time elapsed: 0.294 sec <<< FAILURE!
Running org.apache.commons.performance.ClientThreadTest
Tests run: 5, Failures: 0, Errors: 0, Skipped: 0, Time elapsed: 0.036 sec

Results :

Tests in error: 
  testGenericObjectPoolConfig(org.apache.commons.performance.pool.PoolSoakTest)
  testAbandonedObjectPoolConfig(org.apache.commons.performance.pool.PoolSoakTest)

Tests run: 7, Failures: 0, Errors: 2, Skipped: 0

[INFO] ------------------------------------------------------------------------
[ERROR] BUILD FAILURE
[INFO] ------------------------------------------------------------------------
[INFO] There are test failures.
[INFO] ------------------------------------------------------------------------
[INFO] For more information, run Maven with the -e switch
[INFO] ------------------------------------------------------------------------
[INFO] Total time: 8 seconds
[INFO] Finished at: Fri Sep 07 21:31:15 PDT 2007
[INFO] Final Memory: 7M/14M
[INFO] ------------------------------------------------------------------------

****************************************************************************



---------------------------------------------------------------------
To unsubscribe, e-mail: dev-unsubscribe@commons.apache.org
For additional commands, e-mail: dev-help@commons.apache.org


Mime
View raw message