commons-dev mailing list archives

Site index · List index
Message view « Date » · « Thread »
Top « Date » · « Thread »
From "Continuum@vmbuild" <...@commons.apache.org>
Subject [continuum] BUILD FAILURE: Commons Compress (Sandbox)
Date Sat, 15 Sep 2007 00:44:10 GMT
Online report : http://vmbuild.apache.org/continuum/buildResult.action?buildId=5949&projectId=176

Build statistics:
  State: Failed
  Previous State: Error
  Started at: Fri 14 Sep 2007 17:43:50 -0700
  Finished at: Fri 14 Sep 2007 17:44:08 -0700
  Total time: 17s
  Build Trigger: Forced
  Build Number: 0
  Exit code: 1
  Building machine hostname: vmbuild
  Operating system : Linux(unknown)
  Java Home version : 
          java version "1.4.2_15"
          Java(TM) 2 Runtime Environment, Standard Edition (build 1.4.2_15-b02)
          Java HotSpot(TM) Client VM (build 1.4.2_15-b02, mixed mode)
        
  Builder version :
          Maven version: 2.0.7
          Java version: 1.4.2_15
          OS name: "linux" version: "2.6.20-16-server" arch: "i386"
    
****************************************************************************
SCM Changes:
****************************************************************************
No files changed

****************************************************************************
Dependencies Changes:
****************************************************************************
org.apache.commons:commons-sandbox-parent:3-SNAPSHOT

****************************************************************************
Test Summary:
****************************************************************************
Tests: 26
Failures: 3
Total time: 8048

****************************************************************************
Output:
****************************************************************************
[INFO] Scanning for projects...
[INFO] ----------------------------------------------------------------------------
[INFO] Building Commons Compress (Sandbox)
[INFO]    task-segment: [clean, deploy]
[INFO] ----------------------------------------------------------------------------
[INFO] [clean:clean]
[INFO] Deleting directory /home/continuum/data/working-directory/176/target
[INFO] Deleting directory /home/continuum/data/working-directory/176/target/classes
[INFO] Deleting directory /home/continuum/data/working-directory/176/target/test-classes
[INFO] Deleting directory /home/continuum/data/working-directory/176/target/site
[INFO] [cobertura:clean {execution: default}]
[INFO] [resources:resources]
[INFO] Using default encoding to copy filtered resources.
[INFO] [compiler:compile]
[INFO] Compiling 34 source files to /home/continuum/data/working-directory/176/target/classes
[INFO] [resources:testResources]
[INFO] Using default encoding to copy filtered resources.
[INFO] [compiler:testCompile]
[INFO] Compiling 9 source files to /home/continuum/data/working-directory/176/target/test-classes
[INFO] [surefire:test]
[INFO] Surefire report directory: /home/continuum/data/working-directory/176/target/surefire-reports

-------------------------------------------------------
 T E S T S
-------------------------------------------------------
Running org.apache.commons.compress.archivers.tar.TarTestCase
count = 134
ch2 = 51
ch = 49
Tests run: 4, Failures: 3, Errors: 0, Skipped: 0, Time elapsed: 0.095 sec <<< FAILURE!
Running org.apache.commons.compress.archivers.zip.AsiExtraFieldTestCase
Tests run: 7, Failures: 0, Errors: 0, Skipped: 0, Time elapsed: 0.016 sec
Running org.apache.commons.compress.archivers.zip.ExtraFieldUtilsTestCase
Tests run: 2, Failures: 0, Errors: 0, Skipped: 0, Time elapsed: 0.009 sec
Running org.apache.commons.compress.archivers.zip.ZipEntryTestCase
Tests run: 1, Failures: 0, Errors: 0, Skipped: 0, Time elapsed: 0.009 sec
Running org.apache.commons.compress.compressors.bzip2.BzipTestCase
Tests run: 3, Failures: 0, Errors: 0, Skipped: 0, Time elapsed: 7.941 sec
Running org.apache.commons.compress.CompressUtilsTest
Tests run: 1, Failures: 0, Errors: 0, Skipped: 0, Time elapsed: 0.004 sec
Running org.apache.commons.compress.archivers.zip.ZipLongTestCase
Tests run: 4, Failures: 0, Errors: 0, Skipped: 0, Time elapsed: 0.007 sec
Running org.apache.commons.compress.archivers.zip.ZipShortTestCase
Tests run: 4, Failures: 0, Errors: 0, Skipped: 0, Time elapsed: 0.009 sec

Results :

Failed tests: 
  testReadPosixTar(org.apache.commons.compress.archivers.tar.TarTestCase)
  testReadGnuTar(org.apache.commons.compress.archivers.tar.TarTestCase)
  testWritePosixTar(org.apache.commons.compress.archivers.tar.TarTestCase)

Tests run: 26, Failures: 3, Errors: 0, Skipped: 0

[INFO] ------------------------------------------------------------------------
[ERROR] BUILD FAILURE
[INFO] ------------------------------------------------------------------------
[INFO] There are test failures.
[INFO] ------------------------------------------------------------------------
[INFO] For more information, run Maven with the -e switch
[INFO] ------------------------------------------------------------------------
[INFO] Total time: 16 seconds
[INFO] Finished at: Fri Sep 14 17:44:08 PDT 2007
[INFO] Final Memory: 7M/15M
[INFO] ------------------------------------------------------------------------

****************************************************************************



---------------------------------------------------------------------
To unsubscribe, e-mail: dev-unsubscribe@commons.apache.org
For additional commands, e-mail: dev-help@commons.apache.org


Mime
View raw message