commons-dev mailing list archives

Site index · List index
Message view « Date » · « Thread »
Top « Date » · « Thread »
From "Brett Porter" <brett.por...@gmail.com>
Subject Re: [continuum] BUILD FAILURE: FileUpload
Date Thu, 23 Aug 2007 14:25:48 GMT
Yep - there are already continuum generated files in there.

On 24/08/07, Henri Yandell <flamefew@gmail.com> wrote:
> Anyone know if Continuum has rw access to java.io.tmpdir? Presumably /tmp/ ?
>
> On 8/22/07, Continuum@vmbuild <dev@commons.apache.org> wrote:
> > Online report : http://vmbuild1.apache.org/continuum/buildResult.action?buildId=2066&projectId=166
> >
> > Build statistics:
> >   State: Failed
> >   Previous Build: No previous build.
> >   Started at: Wed 22 Aug 2007 05:57:18 -0700
> >   Finished at: Wed 22 Aug 2007 05:57:37 -0700
> >   Total time: 18s
> >   Build Trigger: Forced
> >   Build Number: 0
> >   Exit code: 1
> >   Building machine hostname: vmbuild
> >   Operating system : Linux(unknown)
> >   Java Home version :
> >           java version "1.4.2_15"
> >           Java(TM) 2 Runtime Environment, Standard Edition (build 1.4.2_15-b02)
> >           Java HotSpot(TM) Client VM (build 1.4.2_15-b02, mixed mode)
> >
> >   Builder version :
> >           Maven version: 2.0.7
> >           Java version: 1.4.2_15
> >           OS name: "linux" version: "2.6.20-16-server" arch: "i386"
> >
> > ****************************************************************************
> > SCM Changes:
> > ****************************************************************************
> > No files changed
> >
> > ****************************************************************************
> > Dependencies Changes:
> > ****************************************************************************
> > No dependencies changed
> >
> > ****************************************************************************
> > Test Summary:
> > ****************************************************************************
> > Tests: 57
> > Failures: 6
> > Total time: 9136
> >
> > ****************************************************************************
> > Output:
> > ****************************************************************************
> > [INFO] Scanning for projects...
> > [INFO] ----------------------------------------------------------------------------
> > [INFO] Building FileUpload
> > [INFO]    task-segment: [clean, install]
> > [INFO] ----------------------------------------------------------------------------
> > [INFO] [clean:clean]
> > [INFO] Deleting directory /home/continuum/data/working-directory/166/target
> > [INFO] Deleting directory /home/continuum/data/working-directory/166/target/classes
> > [INFO] Deleting directory /home/continuum/data/working-directory/166/target/test-classes
> > [INFO] Deleting directory /home/continuum/data/working-directory/166/target/site
> > [INFO] [resources:resources]
> > [INFO] Using default encoding to copy filtered resources.
> > [INFO] snapshot commons-io:commons-io:1.4-SNAPSHOT: checking for updates from apache.snapshots
> > [INFO] [compiler:compile]
> > [INFO] Compiling 27 source files to /home/continuum/data/working-directory/166/target/classes
> > [INFO] [resources:testResources]
> > [INFO] Using default encoding to copy filtered resources.
> > [INFO] [compiler:testCompile]
> > [INFO] Compiling 15 source files to /home/continuum/data/working-directory/166/target/test-classes
> > [INFO] [surefire:test]
> > [INFO] Surefire report directory: /home/continuum/data/working-directory/166/target/surefire-reports
> >
> > -------------------------------------------------------
> >  T E S T S
> > -------------------------------------------------------
> > Running org.apache.commons.fileupload.DiskFileItemSerializeTest
> > Tests run: 3, Failures: 3, Errors: 0, Skipped: 0, Time elapsed: 0.12 sec <<<
FAILURE!
> > Running org.apache.commons.fileupload.MultipartStreamTest
> > Tests run: 2, Failures: 0, Errors: 0, Skipped: 0, Time elapsed: 0.017 sec
> > Running org.apache.commons.fileupload.DefaultFileItemTest
> > Tests run: 6, Failures: 0, Errors: 0, Skipped: 0, Time elapsed: 0.039 sec
> > Running org.apache.commons.fileupload.ParameterParserTest
> > Tests run: 3, Failures: 0, Errors: 0, Skipped: 0, Time elapsed: 0.009 sec
> > Running org.apache.commons.fileupload.SizesTest
> > Tests run: 2, Failures: 0, Errors: 0, Skipped: 0, Time elapsed: 2.226 sec
> > Running org.apache.commons.fileupload.FileItemHeadersTest
> > Tests run: 1, Failures: 0, Errors: 0, Skipped: 0, Time elapsed: 0.006 sec
> > Running org.apache.commons.fileupload.ProgressListenerTest
> > Tests run: 1, Failures: 0, Errors: 0, Skipped: 0, Time elapsed: 1.485 sec
> > Running org.apache.commons.fileupload.ServletFileUploadTest
> > Tests run: 8, Failures: 0, Errors: 0, Skipped: 0, Time elapsed: 0.011 sec
> > Running org.apache.commons.fileupload.StreamingTest
> > Tests run: 4, Failures: 0, Errors: 0, Skipped: 0, Time elapsed: 2.142 sec
> > Running org.apache.commons.fileupload.TestAll
> > Tests run: 27, Failures: 3, Errors: 0, Skipped: 0, Time elapsed: 3.135 sec <<<
FAILURE!
> >
> > Results :
> >
> > Failed tests:
> >   testBelowThreshold(org.apache.commons.fileupload.DiskFileItemSerializeTest)
> >   testThreshold(org.apache.commons.fileupload.DiskFileItemSerializeTest)
> >   testAboveThreshold(org.apache.commons.fileupload.DiskFileItemSerializeTest)
> >   testBelowThreshold(org.apache.commons.fileupload.DiskFileItemSerializeTest)
> >   testThreshold(org.apache.commons.fileupload.DiskFileItemSerializeTest)
> >   testAboveThreshold(org.apache.commons.fileupload.DiskFileItemSerializeTest)
> >
> > Tests run: 57, Failures: 6, Errors: 0, Skipped: 0
> >
> > [INFO] ------------------------------------------------------------------------
> > [ERROR] BUILD FAILURE
> > [INFO] ------------------------------------------------------------------------
> > [INFO] There are test failures.
> > [INFO] ------------------------------------------------------------------------
> > [INFO] For more information, run Maven with the -e switch
> > [INFO] ------------------------------------------------------------------------
> > [INFO] Total time: 15 seconds
> > [INFO] Finished at: Wed Aug 22 05:57:36 PDT 2007
> > [INFO] Final Memory: 6M/15M
> > [INFO] ------------------------------------------------------------------------
> >
> > ****************************************************************************
> >
> >
> >
> > ---------------------------------------------------------------------
> > To unsubscribe, e-mail: dev-unsubscribe@commons.apache.org
> > For additional commands, e-mail: dev-help@commons.apache.org
> >
> >
>
> ---------------------------------------------------------------------
> To unsubscribe, e-mail: dev-unsubscribe@commons.apache.org
> For additional commands, e-mail: dev-help@commons.apache.org
>
>


-- 
Brett Porter
Blog: http://www.devzuz.org/blogs/bporter/

---------------------------------------------------------------------
To unsubscribe, e-mail: dev-unsubscribe@commons.apache.org
For additional commands, e-mail: dev-help@commons.apache.org


Mime
View raw message