commons-dev mailing list archives

Site index · List index
Message view « Date » · « Thread »
Top « Date » · « Thread »
From "Continuum@vmbuild" <...@commons.apache.org>
Subject [continuum] BUILD FAILURE: VFS
Date Wed, 22 Aug 2007 13:00:09 GMT
Online report : http://vmbuild1.apache.org/continuum/buildResult.action?buildId=2071&projectId=171

Build statistics:
  State: Failed
  Previous Build: No previous build.
  Started at: Wed 22 Aug 2007 05:59:46 -0700
  Finished at: Wed 22 Aug 2007 06:00:06 -0700
  Total time: 20s
  Build Trigger: Forced
  Build Number: 0
  Exit code: 1
  Building machine hostname: vmbuild
  Operating system : Linux(unknown)
  Java Home version : 
          java version "1.4.2_15"
          Java(TM) 2 Runtime Environment, Standard Edition (build 1.4.2_15-b02)
          Java HotSpot(TM) Client VM (build 1.4.2_15-b02, mixed mode)
        
  Builder version :
          Maven version: 2.0.7
          Java version: 1.4.2_15
          OS name: "linux" version: "2.6.20-16-server" arch: "i386"
    
****************************************************************************
SCM Changes:
****************************************************************************
No files changed

****************************************************************************
Dependencies Changes:
****************************************************************************
No dependencies changed

****************************************************************************
Test Summary:
****************************************************************************
Tests: 7
Failures: 1
Total time: 353

****************************************************************************
Output:
****************************************************************************
[INFO] Scanning for projects...
[INFO] Reactor build order: 
[INFO]   VFS
[INFO]   core
[INFO]   examples
[INFO]   sandbox
[INFO] ----------------------------------------------------------------------------
[INFO] Building VFS
[INFO]    task-segment: [clean, install]
[INFO] ----------------------------------------------------------------------------
[INFO] [clean:clean]
[INFO] Deleting directory /home/continuum/data/working-directory/171/target
[INFO] Deleting directory /home/continuum/data/working-directory/171/target/classes
[INFO] Deleting directory /home/continuum/data/working-directory/171/target/test-classes
[INFO] Deleting directory /home/continuum/data/working-directory/171/target/site
[INFO] [site:attach-descriptor]
[INFO] [install:install]
[INFO] Installing /home/continuum/data/working-directory/171/pom.xml to /home/continuum/.m2/repository/org/apache/commons/commons-vfs-project/1.1-SNAPSHOT/commons-vfs-project-1.1-SNAPSHOT.pom
[INFO] ----------------------------------------------------------------------------
[INFO] Building core
[INFO]    task-segment: [clean, install]
[INFO] ----------------------------------------------------------------------------
[INFO] [clean:clean]
[INFO] Deleting directory /home/continuum/data/working-directory/171/core/target
[INFO] Deleting directory /home/continuum/data/working-directory/171/core/target/classes
[INFO] Deleting directory /home/continuum/data/working-directory/171/core/target/test-classes
[INFO] Deleting directory /home/continuum/data/working-directory/171/core/target/site
[INFO] [resources:resources]
[INFO] Using default encoding to copy filtered resources.
Downloading: http://people.apache.org/repo/m1-snapshot-repository//ant/poms/ant-1.6.2.pom
Downloading: http://repo1.maven.org/maven2/ant/ant/1.6.2/ant-1.6.2.pom
521b downloaded
Downloading: http://people.apache.org/repo/m1-snapshot-repository//commons-net/poms/commons-net-1.4.1.pom
Downloading: http://repo1.maven.org/maven2/commons-net/commons-net/1.4.1/commons-net-1.4.1.pom
4K downloaded
Downloading: http://people.apache.org/repo/m1-snapshot-repository//commons-httpclient/poms/commons-httpclient-2.0.2.pom
Downloading: http://repo1.maven.org/maven2/commons-httpclient/commons-httpclient/2.0.2/commons-httpclient-2.0.2.pom
6K downloaded
Downloading: http://people.apache.org/repo/m1-snapshot-repository//com.jcraft/poms/jsch-0.1.31.pom
Downloading: http://repo1.maven.org/maven2/com/jcraft/jsch/0.1.31/jsch-0.1.31.pom
1004b downloaded
Downloading: http://people.apache.org/repo/m1-snapshot-repository//commons-httpclient/jars/commons-httpclient-2.0.2.jar
Downloading: http://repo1.maven.org/maven2/commons-httpclient/commons-httpclient/2.0.2/commons-httpclient-2.0.2.jar
220K downloaded
Downloading: http://people.apache.org/repo/m1-snapshot-repository//com.jcraft/jars/jsch-0.1.31.jar
Downloading: http://repo1.maven.org/maven2/com/jcraft/jsch/0.1.31/jsch-0.1.31.jar
167K downloaded
Downloading: http://people.apache.org/repo/m1-snapshot-repository//ant/jars/ant-1.6.2.jar
Downloading: http://repo1.maven.org/maven2/ant/ant/1.6.2/ant-1.6.2.jar
976K downloaded
Downloading: http://people.apache.org/repo/m1-snapshot-repository//commons-net/jars/commons-net-1.4.1.jar
Downloading: http://repo1.maven.org/maven2/commons-net/commons-net/1.4.1/commons-net-1.4.1.jar
176K downloaded
[INFO] [compiler:compile]
[INFO] Compiling 219 source files to /home/continuum/data/working-directory/171/core/target/classes
[INFO] [resources:testResources]
[INFO] Using default encoding to copy filtered resources.
[INFO] [compiler:testCompile]
[INFO] Compiling 58 source files to /home/continuum/data/working-directory/171/core/target/test-classes
[INFO] [surefire:test]
[INFO] Surefire report directory: /home/continuum/data/working-directory/171/core/target/surefire-reports

-------------------------------------------------------
 T E S T S
-------------------------------------------------------
Running org.apache.commons.vfs.provider.http.test.HttpProviderTestCase
Tests run: 0, Failures: 0, Errors: 0, Skipped: 0, Time elapsed: 0.019 sec
Running org.apache.commons.vfs.provider.tar.test.TarProviderTestCase
Tests run: 0, Failures: 0, Errors: 0, Skipped: 0, Time elapsed: 0.007 sec
Running org.apache.commons.vfs.provider.jar.test.JarProviderTestCase
Tests run: 0, Failures: 0, Errors: 0, Skipped: 0, Time elapsed: 0.014 sec
Running org.apache.commons.vfs.provider.test.VirtualProviderTestCase
Tests run: 0, Failures: 0, Errors: 0, Skipped: 0, Time elapsed: 0.008 sec
Running org.apache.commons.vfs.provider.tar.test.TgzProviderTestCase
Tests run: 0, Failures: 0, Errors: 0, Skipped: 0, Time elapsed: 0.012 sec
Running org.apache.commons.vfs.provider.ram.test.CustomRamProviderTest
Tests run: 2, Failures: 0, Errors: 0, Skipped: 0, Time elapsed: 0.13 sec
Running org.apache.commons.vfs.provider.url.test.UrlProviderTestCase
Tests run: 0, Failures: 0, Errors: 0, Skipped: 0, Time elapsed: 0.006 sec
Running org.apache.commons.vfs.provider.local.test.LocalProviderTestCase
Tests run: 0, Failures: 0, Errors: 0, Skipped: 0, Time elapsed: 0.002 sec
Running org.apache.commons.vfs.provider.ram.test.RamProviderTestCase
Tests run: 0, Failures: 0, Errors: 0, Skipped: 0, Time elapsed: 0.005 sec
Running org.apache.commons.vfs.provider.zip.test.ZipProviderTestCase
Tests run: 0, Failures: 0, Errors: 0, Skipped: 0, Time elapsed: 0.004 sec
Running org.apache.commons.vfs.provider.jar.test.NestedJarTestCase
Tests run: 0, Failures: 0, Errors: 0, Skipped: 0, Time elapsed: 0.002 sec
Running org.apache.commons.vfs.RunTest
Tests run: 0, Failures: 0, Errors: 0, Skipped: 0, Time elapsed: 0.004 sec
Running org.apache.commons.vfs.provider.tar.test.NestedTarTestCase
Tests run: 0, Failures: 0, Errors: 0, Skipped: 0, Time elapsed: 0.003 sec
Running org.apache.commons.vfs.provider.tar.test.NestedTgzTestCase
Tests run: 0, Failures: 0, Errors: 0, Skipped: 0, Time elapsed: 0.008 sec
Running org.apache.commons.vfs.cache.NullFilesCacheTestCase
Tests run: 0, Failures: 0, Errors: 0, Skipped: 0, Time elapsed: 0.004 sec
Running org.apache.commons.vfs.provider.test.GenericFileNameTestCase
Tests run: 2, Failures: 0, Errors: 0, Skipped: 0, Time elapsed: 0.023 sec
Running org.apache.commons.vfs.provider.sftp.test.SftpProviderTestCase
Tests run: 0, Failures: 0, Errors: 0, Skipped: 0, Time elapsed: 0.001 sec
Running org.apache.commons.vfs.provider.res.test.ResourceProviderTestCase
Tests run: 0, Failures: 0, Errors: 0, Skipped: 0, Time elapsed: 0.002 sec
Running org.apache.commons.vfs.util.DelegatingFileSystemOptionsBuilderTest
Aug 22, 2007 6:00:06 AM org.apache.commons.vfs.VfsLog info
INFO: Using "/tmp/vfs_cache" as temporary files store.
Aug 22, 2007 6:00:06 AM org.apache.commons.vfs.VfsLog info
INFO: Using "/tmp/vfs_cache" as temporary files store.
Tests run: 2, Failures: 0, Errors: 0, Skipped: 0, Time elapsed: 0.168 sec
Running org.apache.commons.vfs.provider.url.test.UrlHttpProviderTestCase
Tests run: 0, Failures: 0, Errors: 0, Skipped: 0, Time elapsed: 0.003 sec
Running org.apache.commons.vfs.provider.tar.test.NestedTbz2TestCase
Tests run: 0, Failures: 0, Errors: 0, Skipped: 0, Time elapsed: 0.001 sec
Running org.apache.commons.vfs.provider.zip.test.NestedZipTestCase
Tests run: 0, Failures: 0, Errors: 0, Skipped: 0, Time elapsed: 0.002 sec
Running org.apache.commons.vfs.provider.tar.test.Tbz2ProviderTestCase
Tests run: 0, Failures: 0, Errors: 0, Skipped: 0, Time elapsed: 0.001 sec
Running org.apache.commons.vfs.cache.LRUFilesCacheTestCase
Tests run: 0, Failures: 0, Errors: 0, Skipped: 0, Time elapsed: 0.002 sec
Running org.apache.commons.vfs.test.FileSystemManagerFactoryTestCase
Aug 22, 2007 6:00:06 AM org.apache.commons.vfs.VfsLog info
INFO: Using "/tmp/vfs_cache" as temporary files store.
Tests run: 1, Failures: 1, Errors: 0, Skipped: 0, Time elapsed: 0.03 sec <<< FAILURE!
Running org.apache.commons.vfs.provider.ftp.test.FtpProviderTestCase
Tests run: 0, Failures: 0, Errors: 0, Skipped: 0, Time elapsed: 0.004 sec
Running org.apache.commons.vfs.provider.temp.test.TemporaryProviderTestCase
Tests run: 0, Failures: 0, Errors: 0, Skipped: 0, Time elapsed: 0 sec
Running org.apache.commons.vfs.provider.url.test.UrlProviderHttpTestCase
Tests run: 0, Failures: 0, Errors: 0, Skipped: 0, Time elapsed: 0.008 sec

Results :

Failed tests: 
  testDefaultInstance(org.apache.commons.vfs.test.FileSystemManagerFactoryTestCase)

Tests run: 7, Failures: 1, Errors: 0, Skipped: 0

[INFO] ------------------------------------------------------------------------
[ERROR] BUILD FAILURE
[INFO] ------------------------------------------------------------------------
[INFO] There are test failures.
[INFO] ------------------------------------------------------------------------
[INFO] For more information, run Maven with the -e switch
[INFO] ------------------------------------------------------------------------
[INFO] Total time: 17 seconds
[INFO] Finished at: Wed Aug 22 06:00:06 PDT 2007
[INFO] Final Memory: 8M/24M
[INFO] ------------------------------------------------------------------------

****************************************************************************



---------------------------------------------------------------------
To unsubscribe, e-mail: dev-unsubscribe@commons.apache.org
For additional commands, e-mail: dev-help@commons.apache.org


Mime
View raw message