commons-dev mailing list archives

Site index · List index
Message view « Date » · « Thread »
Top « Date » · « Thread »
From Dennis Lundberg <denn...@apache.org>
Subject Re: [continuum] BUILD FAILURE: Logging
Date Wed, 22 Aug 2007 22:21:29 GMT
This should be fixed now.

Continuum@vmbuild wrote:
> Online report : 
> http://vmbuild1.apache.org/continuum/buildResult.action?buildId=2068&projectId=168 
> 
> 
> Build statistics:
>  State: Failed
>  Previous Build: No previous build.
>  Started at: Wed 22 Aug 2007 05:58:07 -0700
>  Finished at: Wed 22 Aug 2007 05:58:26 -0700
>  Total time: 18s
>  Build Trigger: Forced
>  Build Number: 0
>  Exit code: 1
>  Building machine hostname: vmbuild
>  Operating system : Linux(unknown)
>  Java Home version :          java version "1.4.2_15"
>          Java(TM) 2 Runtime Environment, Standard Edition (build 
> 1.4.2_15-b02)
>          Java HotSpot(TM) Client VM (build 1.4.2_15-b02, mixed mode)
>         Builder version :
>          Maven version: 2.0.7
>          Java version: 1.4.2_15
>          OS name: "linux" version: "2.6.20-16-server" arch: "i386"
>    
> **************************************************************************** 
> 
> SCM Changes:
> **************************************************************************** 
> 
> No files changed
> 
> **************************************************************************** 
> 
> Dependencies Changes:
> **************************************************************************** 
> 
> No dependencies changed
> 
> **************************************************************************** 
> 
> Test Summary:
> **************************************************************************** 
> 
> Tests: 88
> Failures: 6
> Total time: 4238
> 
> **************************************************************************** 
> 
> Output:
> **************************************************************************** 
> 
> [INFO] Scanning for projects...
> [INFO] 
> ---------------------------------------------------------------------------- 
> 
> [INFO] Building Logging
> [INFO]    task-segment: [clean, install]
> [INFO] 
> ---------------------------------------------------------------------------- 
> 
> [INFO] [clean:clean]
> [INFO] Deleting directory /home/continuum/data/working-directory/168/target
> [INFO] Deleting directory 
> /home/continuum/data/working-directory/168/target/classes
> [INFO] Deleting directory 
> /home/continuum/data/working-directory/168/target/test-classes
> [INFO] Deleting directory 
> /home/continuum/data/working-directory/168/target/site
> [INFO] [resources:resources]
> [INFO] Using default encoding to copy filtered resources.
> [INFO] [compiler:compile]
> [INFO] Compiling 14 source files to 
> /home/continuum/data/working-directory/168/target/classes
> [INFO] [resources:testResources]
> [INFO] Using default encoding to copy filtered resources.
> [INFO] [compiler:testCompile]
> [INFO] Compiling 51 source files to 
> /home/continuum/data/working-directory/168/target/test-classes
> [INFO] [surefire:test]
> [INFO] Surefire report directory: 
> /home/continuum/data/working-directory/168/target/surefire-reports
> 
> -------------------------------------------------------
> T E S T S
> -------------------------------------------------------
> Running org.apache.commons.logging.avalon.AvalonLoggerTestCase
> [DEBUG] null
> [DEBUG] null
> [DEBUG] org.apache.commons.logging.impl.AvalonLogger: debug statement
> [DEBUG] org.apache.commons.logging.impl.AvalonLogger: debug statement w/ 
> null exception
> java.lang.RuntimeException
>     at 
> org.apache.commons.logging.AbstractLogTest.testLoggingWithNullParameters(AbstractLogTest.java:49) 
> 
>     at sun.reflect.NativeMethodAccessorImpl.invoke0(Native Method)
>     at 
> sun.reflect.NativeMethodAccessorImpl.invoke(NativeMethodAccessorImpl.java:39) 
> 
>     at 
> sun.reflect.DelegatingMethodAccessorImpl.invoke(DelegatingMethodAccessorImpl.java:25) 
> 
>     at java.lang.reflect.Method.invoke(Method.java:324)
>     at junit.framework.TestCase.runTest(TestCase.java:154)
>     at junit.framework.TestCase.runBare(TestCase.java:127)
>     at junit.framework.TestResult$1.protect(TestResult.java:106)
>     at junit.framework.TestResult.runProtected(TestResult.java:124)
>     at junit.framework.TestResult.run(TestResult.java:109)
>     at junit.framework.TestCase.run(TestCase.java:118)
>     at junit.framework.TestSuite.runTest(TestSuite.java:208)
>     at junit.framework.TestSuite.run(TestSuite.java:203)
>     at junit.framework.TestSuite.runTest(TestSuite.java:208)
>     at junit.framework.TestSuite.run(TestSuite.java:203)
>     at sun.reflect.NativeMethodAccessorImpl.invoke0(Native Method)
>     at 
> sun.reflect.NativeMethodAccessorImpl.invoke(NativeMethodAccessorImpl.java:39) 
> 
>     at 
> sun.reflect.DelegatingMethodAccessorImpl.invoke(DelegatingMethodAccessorImpl.java:25) 
> 
>     at java.lang.reflect.Method.invoke(Method.java:324)
>     at 
> org.apache.maven.surefire.junit.JUnitTestSet.execute(JUnitTestSet.java:213)
>     at 
> org.apache.maven.surefire.suite.AbstractDirectoryTestSuite.executeTestSet(AbstractDirectoryTestSuite.java:138) 
> 
>     at 
> org.apache.maven.surefire.suite.AbstractDirectoryTestSuite.execute(AbstractDirectoryTestSuite.java:125) 
> 
>     at org.apache.maven.surefire.Surefire.run(Surefire.java:132)
>     at sun.reflect.NativeMethodAccessorImpl.invoke0(Native Method)
>     at 
> sun.reflect.NativeMethodAccessorImpl.invoke(NativeMethodAccessorImpl.java:39) 
> 
>     at 
> sun.reflect.DelegatingMethodAccessorImpl.invoke(DelegatingMethodAccessorImpl.java:25) 
> 
>     at java.lang.reflect.Method.invoke(Method.java:324)
>     at 
> org.apache.maven.surefire.booter.SurefireBooter.runSuitesInProcess(SurefireBooter.java:290) 
> 
>     at 
> org.apache.maven.surefire.booter.SurefireBooter.main(SurefireBooter.java:818) 
> 
> [ERROR] null
> [ERROR] null
> [ERROR] org.apache.commons.logging.impl.AvalonLogger: error statement
> [ERROR] org.apache.commons.logging.impl.AvalonLogger: error statement w/ 
> null exception
> java.lang.RuntimeException
>     at 
> org.apache.commons.logging.AbstractLogTest.testLoggingWithNullParameters(AbstractLogTest.java:58) 
> 
>     at sun.reflect.NativeMethodAccessorImpl.invoke0(Native Method)
>     at 
> sun.reflect.NativeMethodAccessorImpl.invoke(NativeMethodAccessorImpl.java:39) 
> 
>     at 
> sun.reflect.DelegatingMethodAccessorImpl.invoke(DelegatingMethodAccessorImpl.java:25) 
> 
>     at java.lang.reflect.Method.invoke(Method.java:324)
>     at junit.framework.TestCase.runTest(TestCase.java:154)
>     at junit.framework.TestCase.runBare(TestCase.java:127)
>     at junit.framework.TestResult$1.protect(TestResult.java:106)
>     at junit.framework.TestResult.runProtected(TestResult.java:124)
>     at junit.framework.TestResult.run(TestResult.java:109)
>     at junit.framework.TestCase.run(TestCase.java:118)
>     at junit.framework.TestSuite.runTest(TestSuite.java:208)
>     at junit.framework.TestSuite.run(TestSuite.java:203)
>     at junit.framework.TestSuite.runTest(TestSuite.java:208)
>     at junit.framework.TestSuite.run(TestSuite.java:203)
>     at sun.reflect.NativeMethodAccessorImpl.invoke0(Native Method)
>     at 
> sun.reflect.NativeMethodAccessorImpl.invoke(NativeMethodAccessorImpl.java:39) 
> 
>     at 
> sun.reflect.DelegatingMethodAccessorImpl.invoke(DelegatingMethodAccessorImpl.java:25) 
> 
>     at java.lang.reflect.Method.invoke(Method.java:324)
>     at 
> org.apache.maven.surefire.junit.JUnitTestSet.execute(JUnitTestSet.java:213)
>     at 
> org.apache.maven.surefire.suite.AbstractDirectoryTestSuite.executeTestSet(AbstractDirectoryTestSuite.java:138) 
> 
>     at 
> org.apache.maven.surefire.suite.AbstractDirectoryTestSuite.execute(AbstractDirectoryTestSuite.java:125) 
> 
>     at org.apache.maven.surefire.Surefire.run(Surefire.java:132)
>     at sun.reflect.NativeMethodAccessorImpl.invoke0(Native Method)
>     at 
> sun.reflect.NativeMethodAccessorImpl.invoke(NativeMethodAccessorImpl.java:39) 
> 
>     at 
> sun.reflect.DelegatingMethodAccessorImpl.invoke(DelegatingMethodAccessorImpl.java:25) 
> 
>     at java.lang.reflect.Method.invoke(Method.java:324)
>     at 
> org.apache.maven.surefire.booter.SurefireBooter.runSuitesInProcess(SurefireBooter.java:290) 
> 
>     at 
> org.apache.maven.surefire.booter.SurefireBooter.main(SurefireBooter.java:818) 
> 
> [FATAL ERROR] null
> [FATAL ERROR] null
> [FATAL ERROR] org.apache.commons.logging.impl.AvalonLogger: fatal statement
> [FATAL ERROR] org.apache.commons.logging.impl.AvalonLogger: fatal 
> statement w/ null exception
> java.lang.RuntimeException
>     at 
> org.apache.commons.logging.AbstractLogTest.testLoggingWithNullParameters(AbstractLogTest.java:67) 
> 
>     at sun.reflect.NativeMethodAccessorImpl.invoke0(Native Method)
>     at 
> sun.reflect.NativeMethodAccessorImpl.invoke(NativeMethodAccessorImpl.java:39) 
> 
>     at 
> sun.reflect.DelegatingMethodAccessorImpl.invoke(DelegatingMethodAccessorImpl.java:25) 
> 
>     at java.lang.reflect.Method.invoke(Method.java:324)
>     at junit.framework.TestCase.runTest(TestCase.java:154)
>     at junit.framework.TestCase.runBare(TestCase.java:127)
>     at junit.framework.TestResult$1.protect(TestResult.java:106)
>     at junit.framework.TestResult.runProtected(TestResult.java:124)
>     at junit.framework.TestResult.run(TestResult.java:109)
>     at junit.framework.TestCase.run(TestCase.java:118)
>     at junit.framework.TestSuite.runTest(TestSuite.java:208)
>     at junit.framework.TestSuite.run(TestSuite.java:203)
>     at junit.framework.TestSuite.runTest(TestSuite.java:208)
>     at junit.framework.TestSuite.run(TestSuite.java:203)
>     at sun.reflect.NativeMethodAccessorImpl.invoke0(Native Method)
>     at 
> sun.reflect.NativeMethodAccessorImpl.invoke(NativeMethodAccessorImpl.java:39) 
> 
>     at 
> sun.reflect.DelegatingMethodAccessorImpl.invoke(DelegatingMethodAccessorImpl.java:25) 
> 
>     at java.lang.reflect.Method.invoke(Method.java:324)
>     at 
> org.apache.maven.surefire.junit.JUnitTestSet.execute(JUnitTestSet.java:213)
>     at 
> org.apache.maven.surefire.suite.AbstractDirectoryTestSuite.executeTestSet(AbstractDirectoryTestSuite.java:138) 
> 
>     at 
> org.apache.maven.surefire.suite.AbstractDirectoryTestSuite.execute(AbstractDirectoryTestSuite.java:125) 
> 
>     at org.apache.maven.surefire.Surefire.run(Surefire.java:132)
>     at sun.reflect.NativeMethodAccessorImpl.invoke0(Native Method)
>     at 
> sun.reflect.NativeMethodAccessorImpl.invoke(NativeMethodAccessorImpl.java:39) 
> 
>     at 
> sun.reflect.DelegatingMethodAccessorImpl.invoke(DelegatingMethodAccessorImpl.java:25) 
> 
>     at java.lang.reflect.Method.invoke(Method.java:324)
>     at 
> org.apache.maven.surefire.booter.SurefireBooter.runSuitesInProcess(SurefireBooter.java:290) 
> 
>     at 
> org.apache.maven.surefire.booter.SurefireBooter.main(SurefireBooter.java:818) 
> 
> [INFO] null
> [INFO] null
> [INFO] org.apache.commons.logging.impl.AvalonLogger: info statement
> [INFO] org.apache.commons.logging.impl.AvalonLogger: info statement w/ 
> null exception
> java.lang.RuntimeException
>     at 
> org.apache.commons.logging.AbstractLogTest.testLoggingWithNullParameters(AbstractLogTest.java:76) 
> 
>     at sun.reflect.NativeMethodAccessorImpl.invoke0(Native Method)
>     at 
> sun.reflect.NativeMethodAccessorImpl.invoke(NativeMethodAccessorImpl.java:39) 
> 
>     at 
> sun.reflect.DelegatingMethodAccessorImpl.invoke(DelegatingMethodAccessorImpl.java:25) 
> 
>     at java.lang.reflect.Method.invoke(Method.java:324)
>     at junit.framework.TestCase.runTest(TestCase.java:154)
>     at junit.framework.TestCase.runBare(TestCase.java:127)
>     at junit.framework.TestResult$1.protect(TestResult.java:106)
>     at junit.framework.TestResult.runProtected(TestResult.java:124)
>     at junit.framework.TestResult.run(TestResult.java:109)
>     at junit.framework.TestCase.run(TestCase.java:118)
>     at junit.framework.TestSuite.runTest(TestSuite.java:208)
>     at junit.framework.TestSuite.run(TestSuite.java:203)
>     at junit.framework.TestSuite.runTest(TestSuite.java:208)
>     at junit.framework.TestSuite.run(TestSuite.java:203)
>     at sun.reflect.NativeMethodAccessorImpl.invoke0(Native Method)
>     at 
> sun.reflect.NativeMethodAccessorImpl.invoke(NativeMethodAccessorImpl.java:39) 
> 
>     at 
> sun.reflect.DelegatingMethodAccessorImpl.invoke(DelegatingMethodAccessorImpl.java:25) 
> 
>     at java.lang.reflect.Method.invoke(Method.java:324)
>     at 
> org.apache.maven.surefire.junit.JUnitTestSet.execute(JUnitTestSet.java:213)
>     at 
> org.apache.maven.surefire.suite.AbstractDirectoryTestSuite.executeTestSet(AbstractDirectoryTestSuite.java:138) 
> 
>     at 
> org.apache.maven.surefire.suite.AbstractDirectoryTestSuite.execute(AbstractDirectoryTestSuite.java:125) 
> 
>     at org.apache.maven.surefire.Surefire.run(Surefire.java:132)
>     at sun.reflect.NativeMethodAccessorImpl.invoke0(Native Method)
>     at 
> sun.reflect.NativeMethodAccessorImpl.invoke(NativeMethodAccessorImpl.java:39) 
> 
>     at 
> sun.reflect.DelegatingMethodAccessorImpl.invoke(DelegatingMethodAccessorImpl.java:25) 
> 
>     at java.lang.reflect.Method.invoke(Method.java:324)
>     at 
> org.apache.maven.surefire.booter.SurefireBooter.runSuitesInProcess(SurefireBooter.java:290) 
> 
>     at 
> org.apache.maven.surefire.booter.SurefireBooter.main(SurefireBooter.java:818) 
> 
> [DEBUG] null
> [DEBUG] null
> [DEBUG] org.apache.commons.logging.impl.AvalonLogger: trace statement
> [DEBUG] org.apache.commons.logging.impl.AvalonLogger: trace statement w/ 
> null exception
> java.lang.RuntimeException
>     at 
> org.apache.commons.logging.AbstractLogTest.testLoggingWithNullParameters(AbstractLogTest.java:85) 
> 
>     at sun.reflect.NativeMethodAccessorImpl.invoke0(Native Method)
>     at 
> sun.reflect.NativeMethodAccessorImpl.invoke(NativeMethodAccessorImpl.java:39) 
> 
>     at 
> sun.reflect.DelegatingMethodAccessorImpl.invoke(DelegatingMethodAccessorImpl.java:25) 
> 
>     at java.lang.reflect.Method.invoke(Method.java:324)
>     at junit.framework.TestCase.runTest(TestCase.java:154)
>     at junit.framework.TestCase.runBare(TestCase.java:127)
>     at junit.framework.TestResult$1.protect(TestResult.java:106)
>     at junit.framework.TestResult.runProtected(TestResult.java:124)
>     at junit.framework.TestResult.run(TestResult.java:109)
>     at junit.framework.TestCase.run(TestCase.java:118)
>     at junit.framework.TestSuite.runTest(TestSuite.java:208)
>     at junit.framework.TestSuite.run(TestSuite.java:203)
>     at junit.framework.TestSuite.runTest(TestSuite.java:208)
>     at junit.framework.TestSuite.run(TestSuite.java:203)
>     at sun.reflect.NativeMethodAccessorImpl.invoke0(Native Method)
>     at 
> sun.reflect.NativeMethodAccessorImpl.invoke(NativeMethodAccessorImpl.java:39) 
> 
>     at 
> sun.reflect.DelegatingMethodAccessorImpl.invoke(DelegatingMethodAccessorImpl.java:25) 
> 
>     at java.lang.reflect.Method.invoke(Method.java:324)
>     at 
> org.apache.maven.surefire.junit.JUnitTestSet.execute(JUnitTestSet.java:213)
>     at 
> org.apache.maven.surefire.suite.AbstractDirectoryTestSuite.executeTestSet(AbstractDirectoryTestSuite.java:138) 
> 
>     at 
> org.apache.maven.surefire.suite.AbstractDirectoryTestSuite.execute(AbstractDirectoryTestSuite.java:125) 
> 
>     at org.apache.maven.surefire.Surefire.run(Surefire.java:132)
>     at sun.reflect.NativeMethodAccessorImpl.invoke0(Native Method)
>     at 
> sun.reflect.NativeMethodAccessorImpl.invoke(NativeMethodAccessorImpl.java:39) 
> 
>     at 
> sun.reflect.DelegatingMethodAccessorImpl.invoke(DelegatingMethodAccessorImpl.java:25) 
> 
>     at java.lang.reflect.Method.invoke(Method.java:324)
>     at 
> org.apache.maven.surefire.booter.SurefireBooter.runSuitesInProcess(SurefireBooter.java:290) 
> 
>     at 
> org.apache.maven.surefire.booter.SurefireBooter.main(SurefireBooter.java:818) 
> 
> [WARNING] null
> [WARNING] null
> [WARNING] org.apache.commons.logging.impl.AvalonLogger: warn statement
> [WARNING] org.apache.commons.logging.impl.AvalonLogger: warn statement 
> w/ null exception
> java.lang.RuntimeException
>     at 
> org.apache.commons.logging.AbstractLogTest.testLoggingWithNullParameters(AbstractLogTest.java:94) 
> 
>     at sun.reflect.NativeMethodAccessorImpl.invoke0(Native Method)
>     at 
> sun.reflect.NativeMethodAccessorImpl.invoke(NativeMethodAccessorImpl.java:39) 
> 
>     at 
> sun.reflect.DelegatingMethodAccessorImpl.invoke(DelegatingMethodAccessorImpl.java:25) 
> 
>     at java.lang.reflect.Method.invoke(Method.java:324)
>     at junit.framework.TestCase.runTest(TestCase.java:154)
>     at junit.framework.TestCase.runBare(TestCase.java:127)
>     at junit.framework.TestResult$1.protect(TestResult.java:106)
>     at junit.framework.TestResult.runProtected(TestResult.java:124)
>     at junit.framework.TestResult.run(TestResult.java:109)
>     at junit.framework.TestCase.run(TestCase.java:118)
>     at junit.framework.TestSuite.runTest(TestSuite.java:208)
>     at junit.framework.TestSuite.run(TestSuite.java:203)
>     at junit.framework.TestSuite.runTest(TestSuite.java:208)
>     at junit.framework.TestSuite.run(TestSuite.java:203)
>     at sun.reflect.NativeMethodAccessorImpl.invoke0(Native Method)
>     at 
> sun.reflect.NativeMethodAccessorImpl.invoke(NativeMethodAccessorImpl.java:39) 
> 
>     at 
> sun.reflect.DelegatingMethodAccessorImpl.invoke(DelegatingMethodAccessorImpl.java:25) 
> 
>     at java.lang.reflect.Method.invoke(Method.java:324)
>     at 
> org.apache.maven.surefire.junit.JUnitTestSet.execute(JUnitTestSet.java:213)
>     at 
> org.apache.maven.surefire.suite.AbstractDirectoryTestSuite.executeTestSet(AbstractDirectoryTestSuite.java:138) 
> 
>     at 
> org.apache.maven.surefire.suite.AbstractDirectoryTestSuite.execute(AbstractDirectoryTestSuite.java:125) 
> 
>     at org.apache.maven.surefire.Surefire.run(Surefire.java:132)
>     at sun.reflect.NativeMethodAccessorImpl.invoke0(Native Method)
>     at 
> sun.reflect.NativeMethodAccessorImpl.invoke(NativeMethodAccessorImpl.java:39) 
> 
>     at 
> sun.reflect.DelegatingMethodAccessorImpl.invoke(DelegatingMethodAccessorImpl.java:25) 
> 
>     at java.lang.reflect.Method.invoke(Method.java:324)
>     at 
> org.apache.maven.surefire.booter.SurefireBooter.runSuitesInProcess(SurefireBooter.java:290) 
> 
>     at 
> org.apache.maven.surefire.booter.SurefireBooter.main(SurefireBooter.java:818) 
> 
> Tests run: 1, Failures: 0, Errors: 0, Skipped: 0, Time elapsed: 0.126 sec
> 
> Results :
> 
> Tests run: 1, Failures: 0, Errors: 0, Skipped: 0
> 
> [INFO] [jar:jar]
> [INFO] Building jar: 
> /home/continuum/data/working-directory/168/target/commons-logging-1.1.1-SNAPSHOT.jar 
> 
> [INFO] [jar:test-jar {execution: testjar}]
> [INFO] Building jar: 
> /home/continuum/data/working-directory/168/target/commons-logging-tests.jar
> [INFO] [antrun:run {execution: apijar}]
> [INFO] Executing tasks
>    [mkdir] Created dir: 
> /home/continuum/data/working-directory/168/target/rejar
>    [unjar] Expanding: 
> /home/continuum/data/working-directory/168/target/commons-logging-1.1.1-SNAPSHOT.jar 
> into /home/continuum/data/working-directory/168/target/rejar
>      [jar] Building jar: 
> /home/continuum/data/working-directory/168/target/commons-logging-api-1.1.1-SNAPSHOT.jar 
> 
> [INFO] Executed tasks
> [INFO] [antrun:run {execution: adaptersjar}]
> [INFO] Executing tasks
>   [delete] Deleting directory 
> /home/continuum/data/working-directory/168/target/rejar
>    [mkdir] Created dir: 
> /home/continuum/data/working-directory/168/target/rejar
>    [unjar] Expanding: 
> /home/continuum/data/working-directory/168/target/commons-logging-1.1.1-SNAPSHOT.jar 
> into /home/continuum/data/working-directory/168/target/rejar
>      [jar] Building jar: 
> /home/continuum/data/working-directory/168/target/commons-logging-adapters-1.1.1-SNAPSHOT.jar 
> 
> [INFO] Executed tasks
> [INFO] [build-helper:attach-artifact {execution: attach-artifacts}]
> [INFO] [surefire:test {execution: integration-test}]
> [INFO] Surefire report directory: 
> /home/continuum/data/working-directory/168/target/surefire-reports
> Trying to load resource 
> [org/apache/commons/logging/jdk14/TestHandler.class]
> Reading resource [org/apache/commons/logging/jdk14/TestHandler.class]
> 
> -------------------------------------------------------
> T E S T S
> -------------------------------------------------------
> Running org.apache.commons.logging.pathable.GeneralTestCase
> Tests run: 4, Failures: 0, Errors: 0, Skipped: 0, Time elapsed: 0.057 sec
> Running org.apache.commons.logging.AltHashtableTestCase
> Tests run: 2, Failures: 0, Errors: 0, Skipped: 0, Time elapsed: 0.049 sec
> Running org.apache.commons.logging.config.PriorityConfigTestCase
> Tests run: 1, Failures: 0, Errors: 0, Skipped: 0, Time elapsed: 0.044 sec
> Running org.apache.commons.logging.simple.CustomConfigTestCase
> [DEBUG] DecoratedLogger - debug 
> <org.apache.commons.logging.DummyException>org.apache.commons.logging.DummyException 
> 
>     at 
> org.apache.commons.logging.simple.CustomConfigTestCase.logExceptionMessages(CustomConfigTestCase.java:238) 
> 
>     at 
> org.apache.commons.logging.simple.CustomConfigTestCase.testExceptionMessages(CustomConfigTestCase.java:137) 
> 
>     at sun.reflect.NativeMethodAccessorImpl.invoke0(Native Method)
>     at 
> sun.reflect.NativeMethodAccessorImpl.invoke(NativeMethodAccessorImpl.java:39) 
> 
>     at 
> sun.reflect.DelegatingMethodAccessorImpl.invoke(DelegatingMethodAccessorImpl.java:25) 
> 
>     at java.lang.reflect.Method.invoke(Method.java:324)
>     at junit.framework.TestCase.runTest(TestCase.java:154)
>     at junit.framework.TestCase.runBare(TestCase.java:127)
>     at junit.framework.TestResult$1.protect(TestResult.java:106)
>     at junit.framework.TestResult.runProtected(TestResult.java:124)
>     at junit.framework.TestResult.run(TestResult.java:109)
>     at junit.framework.TestCase.run(TestCase.java:118)
>     at 
> org.apache.commons.logging.PathableTestSuite.runTest(PathableTestSuite.java:142) 
> 
>     at junit.framework.TestSuite.run(TestSuite.java:203)
>     at sun.reflect.NativeMethodAccessorImpl.invoke0(Native Method)
>     at 
> sun.reflect.NativeMethodAccessorImpl.invoke(NativeMethodAccessorImpl.java:39) 
> 
>     at 
> sun.reflect.DelegatingMethodAccessorImpl.invoke(DelegatingMethodAccessorImpl.java:25) 
> 
>     at java.lang.reflect.Method.invoke(Method.java:324)
>     at 
> org.apache.maven.surefire.junit.JUnitTestSet.execute(JUnitTestSet.java:213)
>     at 
> org.apache.maven.surefire.suite.AbstractDirectoryTestSuite.executeTestSet(AbstractDirectoryTestSuite.java:138) 
> 
>     at 
> org.apache.maven.surefire.suite.AbstractDirectoryTestSuite.execute(AbstractDirectoryTestSuite.java:125) 
> 
>     at org.apache.maven.surefire.Surefire.run(Surefire.java:132)
>     at sun.reflect.NativeMethodAccessorImpl.invoke0(Native Method)
>     at 
> sun.reflect.NativeMethodAccessorImpl.invoke(NativeMethodAccessorImpl.java:39) 
> 
>     at 
> sun.reflect.DelegatingMethodAccessorImpl.invoke(DelegatingMethodAccessorImpl.java:25) 
> 
>     at java.lang.reflect.Method.invoke(Method.java:324)
>     at 
> org.apache.maven.surefire.booter.SurefireBooter.runSuitesInProcess(SurefireBooter.java:290) 
> 
>     at 
> org.apache.maven.surefire.booter.SurefireBooter.main(SurefireBooter.java:818) 
> 
> 
> [INFO] DecoratedLogger - info 
> <org.apache.commons.logging.DummyException>org.apache.commons.logging.DummyException 
> 
>     at 
> org.apache.commons.logging.simple.CustomConfigTestCase.logExceptionMessages(CustomConfigTestCase.java:238) 
> 
>     at 
> org.apache.commons.logging.simple.CustomConfigTestCase.testExceptionMessages(CustomConfigTestCase.java:137) 
> 
>     at sun.reflect.NativeMethodAccessorImpl.invoke0(Native Method)
>     at 
> sun.reflect.NativeMethodAccessorImpl.invoke(NativeMethodAccessorImpl.java:39) 
> 
>     at 
> sun.reflect.DelegatingMethodAccessorImpl.invoke(DelegatingMethodAccessorImpl.java:25) 
> 
>     at java.lang.reflect.Method.invoke(Method.java:324)
>     at junit.framework.TestCase.runTest(TestCase.java:154)
>     at junit.framework.TestCase.runBare(TestCase.java:127)
>     at junit.framework.TestResult$1.protect(TestResult.java:106)
>     at junit.framework.TestResult.runProtected(TestResult.java:124)
>     at junit.framework.TestResult.run(TestResult.java:109)
>     at junit.framework.TestCase.run(TestCase.java:118)
>     at 
> org.apache.commons.logging.PathableTestSuite.runTest(PathableTestSuite.java:142) 
> 
>     at junit.framework.TestSuite.run(TestSuite.java:203)
>     at sun.reflect.NativeMethodAccessorImpl.invoke0(Native Method)
>     at 
> sun.reflect.NativeMethodAccessorImpl.invoke(NativeMethodAccessorImpl.java:39) 
> 
>     at 
> sun.reflect.DelegatingMethodAccessorImpl.invoke(DelegatingMethodAccessorImpl.java:25) 
> 
>     at java.lang.reflect.Method.invoke(Method.java:324)
>     at 
> org.apache.maven.surefire.junit.JUnitTestSet.execute(JUnitTestSet.java:213)
>     at 
> org.apache.maven.surefire.suite.AbstractDirectoryTestSuite.executeTestSet(AbstractDirectoryTestSuite.java:138) 
> 
>     at 
> org.apache.maven.surefire.suite.AbstractDirectoryTestSuite.execute(AbstractDirectoryTestSuite.java:125) 
> 
>     at org.apache.maven.surefire.Surefire.run(Surefire.java:132)
>     at sun.reflect.NativeMethodAccessorImpl.invoke0(Native Method)
>     at 
> sun.reflect.NativeMethodAccessorImpl.invoke(NativeMethodAccessorImpl.java:39) 
> 
>     at 
> sun.reflect.DelegatingMethodAccessorImpl.invoke(DelegatingMethodAccessorImpl.java:25) 
> 
>     at java.lang.reflect.Method.invoke(Method.java:324)
>     at 
> org.apache.maven.surefire.booter.SurefireBooter.runSuitesInProcess(SurefireBooter.java:290) 
> 
>     at 
> org.apache.maven.surefire.booter.SurefireBooter.main(SurefireBooter.java:818) 
> 
> 
> [WARN] DecoratedLogger - warn 
> <org.apache.commons.logging.DummyException>org.apache.commons.logging.DummyException 
> 
>     at 
> org.apache.commons.logging.simple.CustomConfigTestCase.logExceptionMessages(CustomConfigTestCase.java:238) 
> 
>     at 
> org.apache.commons.logging.simple.CustomConfigTestCase.testExceptionMessages(CustomConfigTestCase.java:137) 
> 
>     at sun.reflect.NativeMethodAccessorImpl.invoke0(Native Method)
>     at 
> sun.reflect.NativeMethodAccessorImpl.invoke(NativeMethodAccessorImpl.java:39) 
> 
>     at 
> sun.reflect.DelegatingMethodAccessorImpl.invoke(DelegatingMethodAccessorImpl.java:25) 
> 
>     at java.lang.reflect.Method.invoke(Method.java:324)
>     at junit.framework.TestCase.runTest(TestCase.java:154)
>     at junit.framework.TestCase.runBare(TestCase.java:127)
>     at junit.framework.TestResult$1.protect(TestResult.java:106)
>     at junit.framework.TestResult.runProtected(TestResult.java:124)
>     at junit.framework.TestResult.run(TestResult.java:109)
>     at junit.framework.TestCase.run(TestCase.java:118)
>     at 
> org.apache.commons.logging.PathableTestSuite.runTest(PathableTestSuite.java:142) 
> 
>     at junit.framework.TestSuite.run(TestSuite.java:203)
>     at sun.reflect.NativeMethodAccessorImpl.invoke0(Native Method)
>     at 
> sun.reflect.NativeMethodAccessorImpl.invoke(NativeMethodAccessorImpl.java:39) 
> 
>     at 
> sun.reflect.DelegatingMethodAccessorImpl.invoke(DelegatingMethodAccessorImpl.java:25) 
> 
>     at java.lang.reflect.Method.invoke(Method.java:324)
>     at 
> org.apache.maven.surefire.junit.JUnitTestSet.execute(JUnitTestSet.java:213)
>     at 
> org.apache.maven.surefire.suite.AbstractDirectoryTestSuite.executeTestSet(AbstractDirectoryTestSuite.java:138) 
> 
>     at 
> org.apache.maven.surefire.suite.AbstractDirectoryTestSuite.execute(AbstractDirectoryTestSuite.java:125) 
> 
>     at org.apache.maven.surefire.Surefire.run(Surefire.java:132)
>     at sun.reflect.NativeMethodAccessorImpl.invoke0(Native Method)
>     at 
> sun.reflect.NativeMethodAccessorImpl.invoke(NativeMethodAccessorImpl.java:39) 
> 
>     at 
> sun.reflect.DelegatingMethodAccessorImpl.invoke(DelegatingMethodAccessorImpl.java:25) 
> 
>     at java.lang.reflect.Method.invoke(Method.java:324)
>     at 
> org.apache.maven.surefire.booter.SurefireBooter.runSuitesInProcess(SurefireBooter.java:290) 
> 
>     at 
> org.apache.maven.surefire.booter.SurefireBooter.main(SurefireBooter.java:818) 
> 
> 
> [ERROR] DecoratedLogger - error 
> <org.apache.commons.logging.DummyException>org.apache.commons.logging.DummyException 
> 
>     at 
> org.apache.commons.logging.simple.CustomConfigTestCase.logExceptionMessages(CustomConfigTestCase.java:238) 
> 
>     at 
> org.apache.commons.logging.simple.CustomConfigTestCase.testExceptionMessages(CustomConfigTestCase.java:137) 
> 
>     at sun.reflect.NativeMethodAccessorImpl.invoke0(Native Method)
>     at 
> sun.reflect.NativeMethodAccessorImpl.invoke(NativeMethodAccessorImpl.java:39) 
> 
>     at 
> sun.reflect.DelegatingMethodAccessorImpl.invoke(DelegatingMethodAccessorImpl.java:25) 
> 
>     at java.lang.reflect.Method.invoke(Method.java:324)
>     at junit.framework.TestCase.runTest(TestCase.java:154)
>     at junit.framework.TestCase.runBare(TestCase.java:127)
>     at junit.framework.TestResult$1.protect(TestResult.java:106)
>     at junit.framework.TestResult.runProtected(TestResult.java:124)
>     at junit.framework.TestResult.run(TestResult.java:109)
>     at junit.framework.TestCase.run(TestCase.java:118)
>     at 
> org.apache.commons.logging.PathableTestSuite.runTest(PathableTestSuite.java:142) 
> 
>     at junit.framework.TestSuite.run(TestSuite.java:203)
>     at sun.reflect.NativeMethodAccessorImpl.invoke0(Native Method)
>     at 
> sun.reflect.NativeMethodAccessorImpl.invoke(NativeMethodAccessorImpl.java:39) 
> 
>     at 
> sun.reflect.DelegatingMethodAccessorImpl.invoke(DelegatingMethodAccessorImpl.java:25) 
> 
>     at java.lang.reflect.Method.invoke(Method.java:324)
>     at 
> org.apache.maven.surefire.junit.JUnitTestSet.execute(JUnitTestSet.java:213)
>     at 
> org.apache.maven.surefire.suite.AbstractDirectoryTestSuite.executeTestSet(AbstractDirectoryTestSuite.java:138) 
> 
>     at 
> org.apache.maven.surefire.suite.AbstractDirectoryTestSuite.execute(AbstractDirectoryTestSuite.java:125) 
> 
>     at org.apache.maven.surefire.Surefire.run(Surefire.java:132)
>     at sun.reflect.NativeMethodAccessorImpl.invoke0(Native Method)
>     at 
> sun.reflect.NativeMethodAccessorImpl.invoke(NativeMethodAccessorImpl.java:39) 
> 
>     at 
> sun.reflect.DelegatingMethodAccessorImpl.invoke(DelegatingMethodAccessorImpl.java:25) 
> 
>     at java.lang.reflect.Method.invoke(Method.java:324)
>     at 
> org.apache.maven.surefire.booter.SurefireBooter.runSuitesInProcess(SurefireBooter.java:290) 
> 
>     at 
> org.apache.maven.surefire.booter.SurefireBooter.main(SurefireBooter.java:818) 
> 
> 
> [FATAL] DecoratedLogger - fatal 
> <org.apache.commons.logging.DummyException>org.apache.commons.logging.DummyException 
> 
>     at 
> org.apache.commons.logging.simple.CustomConfigTestCase.logExceptionMessages(CustomConfigTestCase.java:238) 
> 
>     at 
> org.apache.commons.logging.simple.CustomConfigTestCase.testExceptionMessages(CustomConfigTestCase.java:137) 
> 
>     at sun.reflect.NativeMethodAccessorImpl.invoke0(Native Method)
>     at 
> sun.reflect.NativeMethodAccessorImpl.invoke(NativeMethodAccessorImpl.java:39) 
> 
>     at 
> sun.reflect.DelegatingMethodAccessorImpl.invoke(DelegatingMethodAccessorImpl.java:25) 
> 
>     at java.lang.reflect.Method.invoke(Method.java:324)
>     at junit.framework.TestCase.runTest(TestCase.java:154)
>     at junit.framework.TestCase.runBare(TestCase.java:127)
>     at junit.framework.TestResult$1.protect(TestResult.java:106)
>     at junit.framework.TestResult.runProtected(TestResult.java:124)
>     at junit.framework.TestResult.run(TestResult.java:109)
>     at junit.framework.TestCase.run(TestCase.java:118)
>     at 
> org.apache.commons.logging.PathableTestSuite.runTest(PathableTestSuite.java:142) 
> 
>     at junit.framework.TestSuite.run(TestSuite.java:203)
>     at sun.reflect.NativeMethodAccessorImpl.invoke0(Native Method)
>     at 
> sun.reflect.NativeMethodAccessorImpl.invoke(NativeMethodAccessorImpl.java:39) 
> 
>     at 
> sun.reflect.DelegatingMethodAccessorImpl.invoke(DelegatingMethodAccessorImpl.java:25) 
> 
>     at java.lang.reflect.Method.invoke(Method.java:324)
>     at 
> org.apache.maven.surefire.junit.JUnitTestSet.execute(JUnitTestSet.java:213)
>     at 
> org.apache.maven.surefire.suite.AbstractDirectoryTestSuite.executeTestSet(AbstractDirectoryTestSuite.java:138) 
> 
>     at 
> org.apache.maven.surefire.suite.AbstractDirectoryTestSuite.execute(AbstractDirectoryTestSuite.java:125) 
> 
>     at org.apache.maven.surefire.Surefire.run(Surefire.java:132)
>     at sun.reflect.NativeMethodAccessorImpl.invoke0(Native Method)
>     at 
> sun.reflect.NativeMethodAccessorImpl.invoke(NativeMethodAccessorImpl.java:39) 
> 
>     at 
> sun.reflect.DelegatingMethodAccessorImpl.invoke(DelegatingMethodAccessorImpl.java:25) 
> 
>     at java.lang.reflect.Method.invoke(Method.java:324)
>     at 
> org.apache.maven.surefire.booter.SurefireBooter.runSuitesInProcess(SurefireBooter.java:290) 
> 
>     at 
> org.apache.maven.surefire.booter.SurefireBooter.main(SurefireBooter.java:818) 
> 
> 
> [DEBUG] DecoratedLogger - debug
> [INFO] DecoratedLogger - info
> [WARN] DecoratedLogger - warn
> [ERROR] DecoratedLogger - error
> [FATAL] DecoratedLogger - fatal
> [DEBUG] DecoratedLogger - debug
> [INFO] DecoratedLogger - info
> [WARN] DecoratedLogger - warn
> [ERROR] DecoratedLogger - error
> [FATAL] DecoratedLogger - fatal
> [DEBUG] DecoratedLogger - debug 
> <org.apache.commons.logging.DummyException>org.apache.commons.logging.DummyException 
> 
>     at 
> org.apache.commons.logging.simple.CustomConfigTestCase.logExceptionMessages(CustomConfigTestCase.java:238) 
> 
>     at 
> org.apache.commons.logging.simple.CustomConfigTestCase.testSerializable(CustomConfigTestCase.java:159) 
> 
>     at sun.reflect.NativeMethodAccessorImpl.invoke0(Native Method)
>     at 
> sun.reflect.NativeMethodAccessorImpl.invoke(NativeMethodAccessorImpl.java:39) 
> 
>     at 
> sun.reflect.DelegatingMethodAccessorImpl.invoke(DelegatingMethodAccessorImpl.java:25) 
> 
>     at java.lang.reflect.Method.invoke(Method.java:324)
>     at junit.framework.TestCase.runTest(TestCase.java:154)
>     at junit.framework.TestCase.runBare(TestCase.java:127)
>     at junit.framework.TestResult$1.protect(TestResult.java:106)
>     at junit.framework.TestResult.runProtected(TestResult.java:124)
>     at junit.framework.TestResult.run(TestResult.java:109)
>     at junit.framework.TestCase.run(TestCase.java:118)
>     at 
> org.apache.commons.logging.PathableTestSuite.runTest(PathableTestSuite.java:142) 
> 
>     at junit.framework.TestSuite.run(TestSuite.java:203)
>     at sun.reflect.NativeMethodAccessorImpl.invoke0(Native Method)
>     at 
> sun.reflect.NativeMethodAccessorImpl.invoke(NativeMethodAccessorImpl.java:39) 
> 
>     at 
> sun.reflect.DelegatingMethodAccessorImpl.invoke(DelegatingMethodAccessorImpl.java:25) 
> 
>     at java.lang.reflect.Method.invoke(Method.java:324)
>     at 
> org.apache.maven.surefire.junit.JUnitTestSet.execute(JUnitTestSet.java:213)
>     at 
> org.apache.maven.surefire.suite.AbstractDirectoryTestSuite.executeTestSet(AbstractDirectoryTestSuite.java:138) 
> 
>     at 
> org.apache.maven.surefire.suite.AbstractDirectoryTestSuite.execute(AbstractDirectoryTestSuite.java:125) 
> 
>     at org.apache.maven.surefire.Surefire.run(Surefire.java:132)
>     at sun.reflect.NativeMethodAccessorImpl.invoke0(Native Method)
>     at 
> sun.reflect.NativeMethodAccessorImpl.invoke(NativeMethodAccessorImpl.java:39) 
> 
>     at 
> sun.reflect.DelegatingMethodAccessorImpl.invoke(DelegatingMethodAccessorImpl.java:25) 
> 
>     at java.lang.reflect.Method.invoke(Method.java:324)
>     at 
> org.apache.maven.surefire.booter.SurefireBooter.runSuitesInProcess(SurefireBooter.java:290) 
> 
>     at 
> org.apache.maven.surefire.booter.SurefireBooter.main(SurefireBooter.java:818) 
> 
> 
> [INFO] DecoratedLogger - info 
> <org.apache.commons.logging.DummyException>org.apache.commons.logging.DummyException 
> 
>     at 
> org.apache.commons.logging.simple.CustomConfigTestCase.logExceptionMessages(CustomConfigTestCase.java:238) 
> 
>     at 
> org.apache.commons.logging.simple.CustomConfigTestCase.testSerializable(CustomConfigTestCase.java:159) 
> 
>     at sun.reflect.NativeMethodAccessorImpl.invoke0(Native Method)
>     at 
> sun.reflect.NativeMethodAccessorImpl.invoke(NativeMethodAccessorImpl.java:39) 
> 
>     at 
> sun.reflect.DelegatingMethodAccessorImpl.invoke(DelegatingMethodAccessorImpl.java:25) 
> 
>     at java.lang.reflect.Method.invoke(Method.java:324)
>     at junit.framework.TestCase.runTest(TestCase.java:154)
>     at junit.framework.TestCase.runBare(TestCase.java:127)
>     at junit.framework.TestResult$1.protect(TestResult.java:106)
>     at junit.framework.TestResult.runProtected(TestResult.java:124)
>     at junit.framework.TestResult.run(TestResult.java:109)
>     at junit.framework.TestCase.run(TestCase.java:118)
>     at 
> org.apache.commons.logging.PathableTestSuite.runTest(PathableTestSuite.java:142) 
> 
>     at junit.framework.TestSuite.run(TestSuite.java:203)
>     at sun.reflect.NativeMethodAccessorImpl.invoke0(Native Method)
>     at 
> sun.reflect.NativeMethodAccessorImpl.invoke(NativeMethodAccessorImpl.java:39) 
> 
>     at 
> sun.reflect.DelegatingMethodAccessorImpl.invoke(DelegatingMethodAccessorImpl.java:25) 
> 
>     at java.lang.reflect.Method.invoke(Method.java:324)
>     at 
> org.apache.maven.surefire.junit.JUnitTestSet.execute(JUnitTestSet.java:213)
>     at 
> org.apache.maven.surefire.suite.AbstractDirectoryTestSuite.executeTestSet(AbstractDirectoryTestSuite.java:138) 
> 
>     at 
> org.apache.maven.surefire.suite.AbstractDirectoryTestSuite.execute(AbstractDirectoryTestSuite.java:125) 
> 
>     at org.apache.maven.surefire.Surefire.run(Surefire.java:132)
>     at sun.reflect.NativeMethodAccessorImpl.invoke0(Native Method)
>     at 
> sun.reflect.NativeMethodAccessorImpl.invoke(NativeMethodAccessorImpl.java:39) 
> 
>     at 
> sun.reflect.DelegatingMethodAccessorImpl.invoke(DelegatingMethodAccessorImpl.java:25) 
> 
>     at java.lang.reflect.Method.invoke(Method.java:324)
>     at 
> org.apache.maven.surefire.booter.SurefireBooter.runSuitesInProcess(SurefireBooter.java:290) 
> 
>     at 
> org.apache.maven.surefire.booter.SurefireBooter.main(SurefireBooter.java:818) 
> 
> 
> [WARN] DecoratedLogger - warn 
> <org.apache.commons.logging.DummyException>org.apache.commons.logging.DummyException 
> 
>     at 
> org.apache.commons.logging.simple.CustomConfigTestCase.logExceptionMessages(CustomConfigTestCase.java:238) 
> 
>     at 
> org.apache.commons.logging.simple.CustomConfigTestCase.testSerializable(CustomConfigTestCase.java:159) 
> 
>     at sun.reflect.NativeMethodAccessorImpl.invoke0(Native Method)
>     at 
> sun.reflect.NativeMethodAccessorImpl.invoke(NativeMethodAccessorImpl.java:39) 
> 
>     at 
> sun.reflect.DelegatingMethodAccessorImpl.invoke(DelegatingMethodAccessorImpl.java:25) 
> 
>     at java.lang.reflect.Method.invoke(Method.java:324)
>     at junit.framework.TestCase.runTest(TestCase.java:154)
>     at junit.framework.TestCase.runBare(TestCase.java:127)
>     at junit.framework.TestResult$1.protect(TestResult.java:106)
>     at junit.framework.TestResult.runProtected(TestResult.java:124)
>     at junit.framework.TestResult.run(TestResult.java:109)
>     at junit.framework.TestCase.run(TestCase.java:118)
>     at 
> org.apache.commons.logging.PathableTestSuite.runTest(PathableTestSuite.java:142) 
> 
>     at junit.framework.TestSuite.run(TestSuite.java:203)
>     at sun.reflect.NativeMethodAccessorImpl.invoke0(Native Method)
>     at 
> sun.reflect.NativeMethodAccessorImpl.invoke(NativeMethodAccessorImpl.java:39) 
> 
>     at 
> sun.reflect.DelegatingMethodAccessorImpl.invoke(DelegatingMethodAccessorImpl.java:25) 
> 
>     at java.lang.reflect.Method.invoke(Method.java:324)
>     at 
> org.apache.maven.surefire.junit.JUnitTestSet.execute(JUnitTestSet.java:213)
>     at 
> org.apache.maven.surefire.suite.AbstractDirectoryTestSuite.executeTestSet(AbstractDirectoryTestSuite.java:138) 
> 
>     at 
> org.apache.maven.surefire.suite.AbstractDirectoryTestSuite.execute(AbstractDirectoryTestSuite.java:125) 
> 
>     at org.apache.maven.surefire.Surefire.run(Surefire.java:132)
>     at sun.reflect.NativeMethodAccessorImpl.invoke0(Native Method)
>     at 
> sun.reflect.NativeMethodAccessorImpl.invoke(NativeMethodAccessorImpl.java:39) 
> 
>     at 
> sun.reflect.DelegatingMethodAccessorImpl.invoke(DelegatingMethodAccessorImpl.java:25) 
> 
>     at java.lang.reflect.Method.invoke(Method.java:324)
>     at 
> org.apache.maven.surefire.booter.SurefireBooter.runSuitesInProcess(SurefireBooter.java:290) 
> 
>     at 
> org.apache.maven.surefire.booter.SurefireBooter.main(SurefireBooter.java:818) 
> 
> 
> [ERROR] DecoratedLogger - error 
> <org.apache.commons.logging.DummyException>org.apache.commons.logging.DummyException 
> 
>     at 
> org.apache.commons.logging.simple.CustomConfigTestCase.logExceptionMessages(CustomConfigTestCase.java:238) 
> 
>     at 
> org.apache.commons.logging.simple.CustomConfigTestCase.testSerializable(CustomConfigTestCase.java:159) 
> 
>     at sun.reflect.NativeMethodAccessorImpl.invoke0(Native Method)
>     at 
> sun.reflect.NativeMethodAccessorImpl.invoke(NativeMethodAccessorImpl.java:39) 
> 
>     at 
> sun.reflect.DelegatingMethodAccessorImpl.invoke(DelegatingMethodAccessorImpl.java:25) 
> 
>     at java.lang.reflect.Method.invoke(Method.java:324)
>     at junit.framework.TestCase.runTest(TestCase.java:154)
>     at junit.framework.TestCase.runBare(TestCase.java:127)
>     at junit.framework.TestResult$1.protect(TestResult.java:106)
>     at junit.framework.TestResult.runProtected(TestResult.java:124)
>     at junit.framework.TestResult.run(TestResult.java:109)
>     at junit.framework.TestCase.run(TestCase.java:118)
>     at 
> org.apache.commons.logging.PathableTestSuite.runTest(PathableTestSuite.java:142) 
> 
>     at junit.framework.TestSuite.run(TestSuite.java:203)
>     at sun.reflect.NativeMethodAccessorImpl.invoke0(Native Method)
>     at 
> sun.reflect.NativeMethodAccessorImpl.invoke(NativeMethodAccessorImpl.java:39) 
> 
>     at 
> sun.reflect.DelegatingMethodAccessorImpl.invoke(DelegatingMethodAccessorImpl.java:25) 
> 
>     at java.lang.reflect.Method.invoke(Method.java:324)
>     at 
> org.apache.maven.surefire.junit.JUnitTestSet.execute(JUnitTestSet.java:213)
>     at 
> org.apache.maven.surefire.suite.AbstractDirectoryTestSuite.executeTestSet(AbstractDirectoryTestSuite.java:138) 
> 
>     at 
> org.apache.maven.surefire.suite.AbstractDirectoryTestSuite.execute(AbstractDirectoryTestSuite.java:125) 
> 
>     at org.apache.maven.surefire.Surefire.run(Surefire.java:132)
>     at sun.reflect.NativeMethodAccessorImpl.invoke0(Native Method)
>     at 
> sun.reflect.NativeMethodAccessorImpl.invoke(NativeMethodAccessorImpl.java:39) 
> 
>     at 
> sun.reflect.DelegatingMethodAccessorImpl.invoke(DelegatingMethodAccessorImpl.java:25) 
> 
>     at java.lang.reflect.Method.invoke(Method.java:324)
>     at 
> org.apache.maven.surefire.booter.SurefireBooter.runSuitesInProcess(SurefireBooter.java:290) 
> 
>     at 
> org.apache.maven.surefire.booter.SurefireBooter.main(SurefireBooter.java:818) 
> 
> 
> [FATAL] DecoratedLogger - fatal 
> <org.apache.commons.logging.DummyException>org.apache.commons.logging.DummyException 
> 
>     at 
> org.apache.commons.logging.simple.CustomConfigTestCase.logExceptionMessages(CustomConfigTestCase.java:238) 
> 
>     at 
> org.apache.commons.logging.simple.CustomConfigTestCase.testSerializable(CustomConfigTestCase.java:159) 
> 
>     at sun.reflect.NativeMethodAccessorImpl.invoke0(Native Method)
>     at 
> sun.reflect.NativeMethodAccessorImpl.invoke(NativeMethodAccessorImpl.java:39) 
> 
>     at 
> sun.reflect.DelegatingMethodAccessorImpl.invoke(DelegatingMethodAccessorImpl.java:25) 
> 
>     at java.lang.reflect.Method.invoke(Method.java:324)
>     at junit.framework.TestCase.runTest(TestCase.java:154)
>     at junit.framework.TestCase.runBare(TestCase.java:127)
>     at junit.framework.TestResult$1.protect(TestResult.java:106)
>     at junit.framework.TestResult.runProtected(TestResult.java:124)
>     at junit.framework.TestResult.run(TestResult.java:109)
>     at junit.framework.TestCase.run(TestCase.java:118)
>     at 
> org.apache.commons.logging.PathableTestSuite.runTest(PathableTestSuite.java:142) 
> 
>     at junit.framework.TestSuite.run(TestSuite.java:203)
>     at sun.reflect.NativeMethodAccessorImpl.invoke0(Native Method)
>     at 
> sun.reflect.NativeMethodAccessorImpl.invoke(NativeMethodAccessorImpl.java:39) 
> 
>     at 
> sun.reflect.DelegatingMethodAccessorImpl.invoke(DelegatingMethodAccessorImpl.java:25) 
> 
>     at java.lang.reflect.Method.invoke(Method.java:324)
>     at 
> org.apache.maven.surefire.junit.JUnitTestSet.execute(JUnitTestSet.java:213)
>     at 
> org.apache.maven.surefire.suite.AbstractDirectoryTestSuite.executeTestSet(AbstractDirectoryTestSuite.java:138) 
> 
>     at 
> org.apache.maven.surefire.suite.AbstractDirectoryTestSuite.execute(AbstractDirectoryTestSuite.java:125) 
> 
>     at org.apache.maven.surefire.Surefire.run(Surefire.java:132)
>     at sun.reflect.NativeMethodAccessorImpl.invoke0(Native Method)
>     at 
> sun.reflect.NativeMethodAccessorImpl.invoke(NativeMethodAccessorImpl.java:39) 
> 
>     at 
> sun.reflect.DelegatingMethodAccessorImpl.invoke(DelegatingMethodAccessorImpl.java:25) 
> 
>     at java.lang.reflect.Method.invoke(Method.java:324)
>     at 
> org.apache.maven.surefire.booter.SurefireBooter.runSuitesInProcess(SurefireBooter.java:290) 
> 
>     at 
> org.apache.maven.surefire.booter.SurefireBooter.main(SurefireBooter.java:818) 
> 
> 
> Tests run: 6, Failures: 0, Errors: 0, Skipped: 0, Time elapsed: 0.217 sec
> Running org.apache.commons.logging.logkit.StandardTestCase
> DEBUG   11877   [org.apac] (): 
> org.apache.commons.logging.impl.LogKitLogger: debug statement
> DEBUG   11877   [org.apac] (): 
> org.apache.commons.logging.impl.LogKitLogger: debug statement w/ null 
> exception
> java.lang.RuntimeException
>     at 
> org.apache.commons.logging.AbstractLogTest.testLoggingWithNullParameters(AbstractLogTest.java:49) 
> 
>     at sun.reflect.NativeMethodAccessorImpl.invoke0(Native Method)
>     at 
> sun.reflect.NativeMethodAccessorImpl.invoke(NativeMethodAccessorImpl.java:39) 
> 
>     at 
> sun.reflect.DelegatingMethodAccessorImpl.invoke(DelegatingMethodAccessorImpl.java:25) 
> 
>     at java.lang.reflect.Method.invoke(Method.java:324)
>     at junit.framework.TestCase.runTest(TestCase.java:154)
>     at junit.framework.TestCase.runBare(TestCase.java:127)
>     at junit.framework.TestResult$1.protect(TestResult.java:106)
>     at junit.framework.TestResult.runProtected(TestResult.java:124)
>     at junit.framework.TestResult.run(TestResult.java:109)
>     at junit.framework.TestCase.run(TestCase.java:118)
>     at 
> org.apache.commons.logging.PathableTestSuite.runTest(PathableTestSuite.java:142) 
> 
>     at junit.framework.TestSuite.run(TestSuite.java:203)
>     at sun.reflect.NativeMethodAccessorImpl.invoke0(Native Method)
>     at 
> sun.reflect.NativeMethodAccessorImpl.invoke(NativeMethodAccessorImpl.java:39) 
> 
>     at 
> sun.reflect.DelegatingMethodAccessorImpl.invoke(DelegatingMethodAccessorImpl.java:25) 
> 
>     at java.lang.reflect.Method.invoke(Method.java:324)
>     at 
> org.apache.maven.surefire.junit.JUnitTestSet.execute(JUnitTestSet.java:213)
>     at 
> org.apache.maven.surefire.suite.AbstractDirectoryTestSuite.executeTestSet(AbstractDirectoryTestSuite.java:138) 
> 
>     at 
> org.apache.maven.surefire.suite.AbstractDirectoryTestSuite.execute(AbstractDirectoryTestSuite.java:125) 
> 
>     at org.apache.maven.surefire.Surefire.run(Surefire.java:132)
>     at sun.reflect.NativeMethodAccessorImpl.invoke0(Native Method)
>     at 
> sun.reflect.NativeMethodAccessorImpl.invoke(NativeMethodAccessorImpl.java:39) 
> 
>     at 
> sun.reflect.DelegatingMethodAccessorImpl.invoke(DelegatingMethodAccessorImpl.java:25) 
> 
>     at java.lang.reflect.Method.invoke(Method.java:324)
>     at 
> org.apache.maven.surefire.booter.SurefireBooter.runSuitesInProcess(SurefireBooter.java:290) 
> 
>     at 
> org.apache.maven.surefire.booter.SurefireBooter.main(SurefireBooter.java:818) 
> 
> ERROR   11877   [org.apac] (): 
> org.apache.commons.logging.impl.LogKitLogger: error statement
> ERROR   11877   [org.apac] (): 
> org.apache.commons.logging.impl.LogKitLogger: error statement w/ null 
> exception
> java.lang.RuntimeException
>     at 
> org.apache.commons.logging.AbstractLogTest.testLoggingWithNullParameters(AbstractLogTest.java:58) 
> 
>     at sun.reflect.NativeMethodAccessorImpl.invoke0(Native Method)
>     at 
> sun.reflect.NativeMethodAccessorImpl.invoke(NativeMethodAccessorImpl.java:39) 
> 
>     at 
> sun.reflect.DelegatingMethodAccessorImpl.invoke(DelegatingMethodAccessorImpl.java:25) 
> 
>     at java.lang.reflect.Method.invoke(Method.java:324)
>     at junit.framework.TestCase.runTest(TestCase.java:154)
>     at junit.framework.TestCase.runBare(TestCase.java:127)
>     at junit.framework.TestResult$1.protect(TestResult.java:106)
>     at junit.framework.TestResult.runProtected(TestResult.java:124)
>     at junit.framework.TestResult.run(TestResult.java:109)
>     at junit.framework.TestCase.run(TestCase.java:118)
>     at 
> org.apache.commons.logging.PathableTestSuite.runTest(PathableTestSuite.java:142) 
> 
>     at junit.framework.TestSuite.run(TestSuite.java:203)
>     at sun.reflect.NativeMethodAccessorImpl.invoke0(Native Method)
>     at 
> sun.reflect.NativeMethodAccessorImpl.invoke(NativeMethodAccessorImpl.java:39) 
> 
>     at 
> sun.reflect.DelegatingMethodAccessorImpl.invoke(DelegatingMethodAccessorImpl.java:25) 
> 
>     at java.lang.reflect.Method.invoke(Method.java:324)
>     at 
> org.apache.maven.surefire.junit.JUnitTestSet.execute(JUnitTestSet.java:213)
>     at 
> org.apache.maven.surefire.suite.AbstractDirectoryTestSuite.executeTestSet(AbstractDirectoryTestSuite.java:138) 
> 
>     at 
> org.apache.maven.surefire.suite.AbstractDirectoryTestSuite.execute(AbstractDirectoryTestSuite.java:125) 
> 
>     at org.apache.maven.surefire.Surefire.run(Surefire.java:132)
>     at sun.reflect.NativeMethodAccessorImpl.invoke0(Native Method)
>     at 
> sun.reflect.NativeMethodAccessorImpl.invoke(NativeMethodAccessorImpl.java:39) 
> 
>     at 
> sun.reflect.DelegatingMethodAccessorImpl.invoke(DelegatingMethodAccessorImpl.java:25) 
> 
>     at java.lang.reflect.Method.invoke(Method.java:324)
>     at 
> org.apache.maven.surefire.booter.SurefireBooter.runSuitesInProcess(SurefireBooter.java:290) 
> 
>     at 
> org.apache.maven.surefire.booter.SurefireBooter.main(SurefireBooter.java:818) 
> 
> FATAL_E 11877   [org.apac] (): 
> org.apache.commons.logging.impl.LogKitLogger: fatal statement
> FATAL_E 11877   [org.apac] (): 
> org.apache.commons.logging.impl.LogKitLogger: fatal statement w/ null 
> exception
> java.lang.RuntimeException
>     at 
> org.apache.commons.logging.AbstractLogTest.testLoggingWithNullParameters(AbstractLogTest.java:67) 
> 
>     at sun.reflect.NativeMethodAccessorImpl.invoke0(Native Method)
>     at 
> sun.reflect.NativeMethodAccessorImpl.invoke(NativeMethodAccessorImpl.java:39) 
> 
>     at 
> sun.reflect.DelegatingMethodAccessorImpl.invoke(DelegatingMethodAccessorImpl.java:25) 
> 
>     at java.lang.reflect.Method.invoke(Method.java:324)
>     at junit.framework.TestCase.runTest(TestCase.java:154)
>     at junit.framework.TestCase.runBare(TestCase.java:127)
>     at junit.framework.TestResult$1.protect(TestResult.java:106)
>     at junit.framework.TestResult.runProtected(TestResult.java:124)
>     at junit.framework.TestResult.run(TestResult.java:109)
>     at junit.framework.TestCase.run(TestCase.java:118)
>     at 
> org.apache.commons.logging.PathableTestSuite.runTest(PathableTestSuite.java:142) 
> 
>     at junit.framework.TestSuite.run(TestSuite.java:203)
>     at sun.reflect.NativeMethodAccessorImpl.invoke0(Native Method)
>     at 
> sun.reflect.NativeMethodAccessorImpl.invoke(NativeMethodAccessorImpl.java:39) 
> 
>     at 
> sun.reflect.DelegatingMethodAccessorImpl.invoke(DelegatingMethodAccessorImpl.java:25) 
> 
>     at java.lang.reflect.Method.invoke(Method.java:324)
>     at 
> org.apache.maven.surefire.junit.JUnitTestSet.execute(JUnitTestSet.java:213)
>     at 
> org.apache.maven.surefire.suite.AbstractDirectoryTestSuite.executeTestSet(AbstractDirectoryTestSuite.java:138) 
> 
>     at 
> org.apache.maven.surefire.suite.AbstractDirectoryTestSuite.execute(AbstractDirectoryTestSuite.java:125) 
> 
>     at org.apache.maven.surefire.Surefire.run(Surefire.java:132)
>     at sun.reflect.NativeMethodAccessorImpl.invoke0(Native Method)
>     at 
> sun.reflect.NativeMethodAccessorImpl.invoke(NativeMethodAccessorImpl.java:39) 
> 
>     at 
> sun.reflect.DelegatingMethodAccessorImpl.invoke(DelegatingMethodAccessorImpl.java:25) 
> 
>     at java.lang.reflect.Method.invoke(Method.java:324)
>     at 
> org.apache.maven.surefire.booter.SurefireBooter.runSuitesInProcess(SurefireBooter.java:290) 
> 
>     at 
> org.apache.maven.surefire.booter.SurefireBooter.main(SurefireBooter.java:818) 
> 
> INFO    11877   [org.apac] (): 
> org.apache.commons.logging.impl.LogKitLogger: info statement
> INFO    11877   [org.apac] (): 
> org.apache.commons.logging.impl.LogKitLogger: info statement w/ null 
> exception
> java.lang.RuntimeException
>     at 
> org.apache.commons.logging.AbstractLogTest.testLoggingWithNullParameters(AbstractLogTest.java:76) 
> 
>     at sun.reflect.NativeMethodAccessorImpl.invoke0(Native Method)
>     at 
> sun.reflect.NativeMethodAccessorImpl.invoke(NativeMethodAccessorImpl.java:39) 
> 
>     at 
> sun.reflect.DelegatingMethodAccessorImpl.invoke(DelegatingMethodAccessorImpl.java:25) 
> 
>     at java.lang.reflect.Method.invoke(Method.java:324)
>     at junit.framework.TestCase.runTest(TestCase.java:154)
>     at junit.framework.TestCase.runBare(TestCase.java:127)
>     at junit.framework.TestResult$1.protect(TestResult.java:106)
>     at junit.framework.TestResult.runProtected(TestResult.java:124)
>     at junit.framework.TestResult.run(TestResult.java:109)
>     at junit.framework.TestCase.run(TestCase.java:118)
>     at 
> org.apache.commons.logging.PathableTestSuite.runTest(PathableTestSuite.java:142) 
> 
>     at junit.framework.TestSuite.run(TestSuite.java:203)
>     at sun.reflect.NativeMethodAccessorImpl.invoke0(Native Method)
>     at 
> sun.reflect.NativeMethodAccessorImpl.invoke(NativeMethodAccessorImpl.java:39) 
> 
>     at 
> sun.reflect.DelegatingMethodAccessorImpl.invoke(DelegatingMethodAccessorImpl.java:25) 
> 
>     at java.lang.reflect.Method.invoke(Method.java:324)
>     at 
> org.apache.maven.surefire.junit.JUnitTestSet.execute(JUnitTestSet.java:213)
>     at 
> org.apache.maven.surefire.suite.AbstractDirectoryTestSuite.executeTestSet(AbstractDirectoryTestSuite.java:138) 
> 
>     at 
> org.apache.maven.surefire.suite.AbstractDirectoryTestSuite.execute(AbstractDirectoryTestSuite.java:125) 
> 
>     at org.apache.maven.surefire.Surefire.run(Surefire.java:132)
>     at sun.reflect.NativeMethodAccessorImpl.invoke0(Native Method)
>     at 
> sun.reflect.NativeMethodAccessorImpl.invoke(NativeMethodAccessorImpl.java:39) 
> 
>     at 
> sun.reflect.DelegatingMethodAccessorImpl.invoke(DelegatingMethodAccessorImpl.java:25) 
> 
>     at java.lang.reflect.Method.invoke(Method.java:324)
>     at 
> org.apache.maven.surefire.booter.SurefireBooter.runSuitesInProcess(SurefireBooter.java:290) 
> 
>     at 
> org.apache.maven.surefire.booter.SurefireBooter.main(SurefireBooter.java:818) 
> 
> DEBUG   11877   [org.apac] (): 
> org.apache.commons.logging.impl.LogKitLogger: trace statement
> DEBUG   11877   [org.apac] (): 
> org.apache.commons.logging.impl.LogKitLogger: trace statement w/ null 
> exception
> java.lang.RuntimeException
>     at 
> org.apache.commons.logging.AbstractLogTest.testLoggingWithNullParameters(AbstractLogTest.java:85) 
> 
>     at sun.reflect.NativeMethodAccessorImpl.invoke0(Native Method)
>     at 
> sun.reflect.NativeMethodAccessorImpl.invoke(NativeMethodAccessorImpl.java:39) 
> 
>     at 
> sun.reflect.DelegatingMethodAccessorImpl.invoke(DelegatingMethodAccessorImpl.java:25) 
> 
>     at java.lang.reflect.Method.invoke(Method.java:324)
>     at junit.framework.TestCase.runTest(TestCase.java:154)
>     at junit.framework.TestCase.runBare(TestCase.java:127)
>     at junit.framework.TestResult$1.protect(TestResult.java:106)
>     at junit.framework.TestResult.runProtected(TestResult.java:124)
>     at junit.framework.TestResult.run(TestResult.java:109)
>     at junit.framework.TestCase.run(TestCase.java:118)
>     at 
> org.apache.commons.logging.PathableTestSuite.runTest(PathableTestSuite.java:142) 
> 
>     at junit.framework.TestSuite.run(TestSuite.java:203)
>     at sun.reflect.NativeMethodAccessorImpl.invoke0(Native Method)
>     at 
> sun.reflect.NativeMethodAccessorImpl.invoke(NativeMethodAccessorImpl.java:39) 
> 
>     at 
> sun.reflect.DelegatingMethodAccessorImpl.invoke(DelegatingMethodAccessorImpl.java:25) 
> 
>     at java.lang.reflect.Method.invoke(Method.java:324)
>     at 
> org.apache.maven.surefire.junit.JUnitTestSet.execute(JUnitTestSet.java:213)
>     at 
> org.apache.maven.surefire.suite.AbstractDirectoryTestSuite.executeTestSet(AbstractDirectoryTestSuite.java:138) 
> 
>     at 
> org.apache.maven.surefire.suite.AbstractDirectoryTestSuite.execute(AbstractDirectoryTestSuite.java:125) 
> 
>     at org.apache.maven.surefire.Surefire.run(Surefire.java:132)
>     at sun.reflect.NativeMethodAccessorImpl.invoke0(Native Method)
>     at 
> sun.reflect.NativeMethodAccessorImpl.invoke(NativeMethodAccessorImpl.java:39) 
> 
>     at 
> sun.reflect.DelegatingMethodAccessorImpl.invoke(DelegatingMethodAccessorImpl.java:25) 
> 
>     at java.lang.reflect.Method.invoke(Method.java:324)
>     at 
> org.apache.maven.surefire.booter.SurefireBooter.runSuitesInProcess(SurefireBooter.java:290) 
> 
>     at 
> org.apache.maven.surefire.booter.SurefireBooter.main(SurefireBooter.java:818) 
> 
> WARN    11877   [org.apac] (): 
> org.apache.commons.logging.impl.LogKitLogger: warn statement
> WARN    11877   [org.apac] (): 
> org.apache.commons.logging.impl.LogKitLogger: warn statement w/ null 
> exception
> java.lang.RuntimeException
>     at 
> org.apache.commons.logging.AbstractLogTest.testLoggingWithNullParameters(AbstractLogTest.java:94) 
> 
>     at sun.reflect.NativeMethodAccessorImpl.invoke0(Native Method)
>     at 
> sun.reflect.NativeMethodAccessorImpl.invoke(NativeMethodAccessorImpl.java:39) 
> 
>     at 
> sun.reflect.DelegatingMethodAccessorImpl.invoke(DelegatingMethodAccessorImpl.java:25) 
> 
>     at java.lang.reflect.Method.invoke(Method.java:324)
>     at junit.framework.TestCase.runTest(TestCase.java:154)
>     at junit.framework.TestCase.runBare(TestCase.java:127)
>     at junit.framework.TestResult$1.protect(TestResult.java:106)
>     at junit.framework.TestResult.runProtected(TestResult.java:124)
>     at junit.framework.TestResult.run(TestResult.java:109)
>     at junit.framework.TestCase.run(TestCase.java:118)
>     at 
> org.apache.commons.logging.PathableTestSuite.runTest(PathableTestSuite.java:142) 
> 
>     at junit.framework.TestSuite.run(TestSuite.java:203)
>     at sun.reflect.NativeMethodAccessorImpl.invoke0(Native Method)
>     at 
> sun.reflect.NativeMethodAccessorImpl.invoke(NativeMethodAccessorImpl.java:39) 
> 
>     at 
> sun.reflect.DelegatingMethodAccessorImpl.invoke(DelegatingMethodAccessorImpl.java:25) 
> 
>     at java.lang.reflect.Method.invoke(Method.java:324)
>     at 
> org.apache.maven.surefire.junit.JUnitTestSet.execute(JUnitTestSet.java:213)
>     at 
> org.apache.maven.surefire.suite.AbstractDirectoryTestSuite.executeTestSet(AbstractDirectoryTestSuite.java:138) 
> 
>     at 
> org.apache.maven.surefire.suite.AbstractDirectoryTestSuite.execute(AbstractDirectoryTestSuite.java:125) 
> 
>     at org.apache.maven.surefire.Surefire.run(Surefire.java:132)
>     at sun.reflect.NativeMethodAccessorImpl.invoke0(Native Method)
>     at 
> sun.reflect.NativeMethodAccessorImpl.invoke(NativeMethodAccessorImpl.java:39) 
> 
>     at 
> sun.reflect.DelegatingMethodAccessorImpl.invoke(DelegatingMethodAccessorImpl.java:25) 
> 
>     at java.lang.reflect.Method.invoke(Method.java:324)
>     at 
> org.apache.maven.surefire.booter.SurefireBooter.runSuitesInProcess(SurefireBooter.java:290) 
> 
>     at 
> org.apache.maven.surefire.booter.SurefireBooter.main(SurefireBooter.java:818) 
> 
> Tests run: 4, Failures: 0, Errors: 0, Skipped: 0, Time elapsed: 0.087 sec
> Running org.apache.commons.logging.NullClassLoaderTestCase
> Tests run: 1, Failures: 0, Errors: 0, Skipped: 0, Time elapsed: 0.006 sec
> Running org.apache.commons.logging.tccl.log.TcclDisabledTestCase
> Tests run: 2, Failures: 0, Errors: 0, Skipped: 0, Time elapsed: 0.049 sec
> Running org.apache.commons.logging.jdk14.CustomConfigAPITestCase
> Tests run: 7, Failures: 2, Errors: 0, Skipped: 0, Time elapsed: 0.114 
> sec <<< FAILURE!
> Running org.apache.commons.logging.tccl.logfactory.TcclEnabledTestCase
> Tests run: 2, Failures: 0, Errors: 0, Skipped: 0, Time elapsed: 0.045 sec
> Running org.apache.commons.logging.jdk14.DefaultConfigTestCase
> Tests run: 3, Failures: 0, Errors: 0, Skipped: 0, Time elapsed: 0.045 sec
> Running 
> org.apache.commons.logging.log4j.log4j12.ParentClasspathStandardTestCase
> Tests run: 0, Failures: 0, Errors: 0, Skipped: 0, Time elapsed: 0.005 sec
> Running org.apache.commons.logging.tccl.log.TcclEnabledTestCase
> Tests run: 2, Failures: 0, Errors: 0, Skipped: 0, Time elapsed: 0.037 sec
> Running org.apache.commons.logging.SimpleLogTestCase
> [ERROR] SimpleLogTestCase - null
> [ERROR] SimpleLogTestCase - null
> [ERROR] SimpleLogTestCase - org.apache.commons.logging.impl.SimpleLog: 
> error statement
> [ERROR] SimpleLogTestCase - org.apache.commons.logging.impl.SimpleLog: 
> error statement w/ null exception 
> <java.lang.RuntimeException>java.lang.RuntimeException
>     at 
> org.apache.commons.logging.AbstractLogTest.testLoggingWithNullParameters(AbstractLogTest.java:58) 
> 
>     at sun.reflect.NativeMethodAccessorImpl.invoke0(Native Method)
>     at 
> sun.reflect.NativeMethodAccessorImpl.invoke(NativeMethodAccessorImpl.java:39) 
> 
>     at 
> sun.reflect.DelegatingMethodAccessorImpl.invoke(DelegatingMethodAccessorImpl.java:25) 
> 
>     at java.lang.reflect.Method.invoke(Method.java:324)
>     at junit.framework.TestCase.runTest(TestCase.java:154)
>     at junit.framework.TestCase.runBare(TestCase.java:127)
>     at junit.framework.TestResult$1.protect(TestResult.java:106)
>     at junit.framework.TestResult.runProtected(TestResult.java:124)
>     at junit.framework.TestResult.run(TestResult.java:109)
>     at junit.framework.TestCase.run(TestCase.java:118)
>     at junit.framework.TestSuite.runTest(TestSuite.java:208)
>     at junit.framework.TestSuite.run(TestSuite.java:203)
>     at sun.reflect.NativeMethodAccessorImpl.invoke0(Native Method)
>     at 
> sun.reflect.NativeMethodAccessorImpl.invoke(NativeMethodAccessorImpl.java:39) 
> 
>     at 
> sun.reflect.DelegatingMethodAccessorImpl.invoke(DelegatingMethodAccessorImpl.java:25) 
> 
>     at java.lang.reflect.Method.invoke(Method.java:324)
>     at 
> org.apache.maven.surefire.junit.JUnitTestSet.execute(JUnitTestSet.java:213)
>     at 
> org.apache.maven.surefire.suite.AbstractDirectoryTestSuite.executeTestSet(AbstractDirectoryTestSuite.java:138) 
> 
>     at 
> org.apache.maven.surefire.suite.AbstractDirectoryTestSuite.execute(AbstractDirectoryTestSuite.java:125) 
> 
>     at org.apache.maven.surefire.Surefire.run(Surefire.java:132)
>     at sun.reflect.NativeMethodAccessorImpl.invoke0(Native Method)
>     at 
> sun.reflect.NativeMethodAccessorImpl.invoke(NativeMethodAccessorImpl.java:39) 
> 
>     at 
> sun.reflect.DelegatingMethodAccessorImpl.invoke(DelegatingMethodAccessorImpl.java:25) 
> 
>     at java.lang.reflect.Method.invoke(Method.java:324)
>     at 
> org.apache.maven.surefire.booter.SurefireBooter.runSuitesInProcess(SurefireBooter.java:290) 
> 
>     at 
> org.apache.maven.surefire.booter.SurefireBooter.main(SurefireBooter.java:818) 
> 
> 
> [FATAL] SimpleLogTestCase - null
> [FATAL] SimpleLogTestCase - null
> [FATAL] SimpleLogTestCase - org.apache.commons.logging.impl.SimpleLog: 
> fatal statement
> [FATAL] SimpleLogTestCase - org.apache.commons.logging.impl.SimpleLog: 
> fatal statement w/ null exception 
> <java.lang.RuntimeException>java.lang.RuntimeException
>     at 
> org.apache.commons.logging.AbstractLogTest.testLoggingWithNullParameters(AbstractLogTest.java:67) 
> 
>     at sun.reflect.NativeMethodAccessorImpl.invoke0(Native Method)
>     at 
> sun.reflect.NativeMethodAccessorImpl.invoke(NativeMethodAccessorImpl.java:39) 
> 
>     at 
> sun.reflect.DelegatingMethodAccessorImpl.invoke(DelegatingMethodAccessorImpl.java:25) 
> 
>     at java.lang.reflect.Method.invoke(Method.java:324)
>     at junit.framework.TestCase.runTest(TestCase.java:154)
>     at junit.framework.TestCase.runBare(TestCase.java:127)
>     at junit.framework.TestResult$1.protect(TestResult.java:106)
>     at junit.framework.TestResult.runProtected(TestResult.java:124)
>     at junit.framework.TestResult.run(TestResult.java:109)
>     at junit.framework.TestCase.run(TestCase.java:118)
>     at junit.framework.TestSuite.runTest(TestSuite.java:208)
>     at junit.framework.TestSuite.run(TestSuite.java:203)
>     at sun.reflect.NativeMethodAccessorImpl.invoke0(Native Method)
>     at 
> sun.reflect.NativeMethodAccessorImpl.invoke(NativeMethodAccessorImpl.java:39) 
> 
>     at 
> sun.reflect.DelegatingMethodAccessorImpl.invoke(DelegatingMethodAccessorImpl.java:25) 
> 
>     at java.lang.reflect.Method.invoke(Method.java:324)
>     at 
> org.apache.maven.surefire.junit.JUnitTestSet.execute(JUnitTestSet.java:213)
>     at 
> org.apache.maven.surefire.suite.AbstractDirectoryTestSuite.executeTestSet(AbstractDirectoryTestSuite.java:138) 
> 
>     at 
> org.apache.maven.surefire.suite.AbstractDirectoryTestSuite.execute(AbstractDirectoryTestSuite.java:125) 
> 
>     at org.apache.maven.surefire.Surefire.run(Surefire.java:132)
>     at sun.reflect.NativeMethodAccessorImpl.invoke0(Native Method)
>     at 
> sun.reflect.NativeMethodAccessorImpl.invoke(NativeMethodAccessorImpl.java:39) 
> 
>     at 
> sun.reflect.DelegatingMethodAccessorImpl.invoke(DelegatingMethodAccessorImpl.java:25) 
> 
>     at java.lang.reflect.Method.invoke(Method.java:324)
>     at 
> org.apache.maven.surefire.booter.SurefireBooter.runSuitesInProcess(SurefireBooter.java:290) 
> 
>     at 
> org.apache.maven.surefire.booter.SurefireBooter.main(SurefireBooter.java:818) 
> 
> 
> [INFO] SimpleLogTestCase - null
> [INFO] SimpleLogTestCase - null
> [INFO] SimpleLogTestCase - org.apache.commons.logging.impl.SimpleLog: 
> info statement
> [INFO] SimpleLogTestCase - org.apache.commons.logging.impl.SimpleLog: 
> info statement w/ null exception 
> <java.lang.RuntimeException>java.lang.RuntimeException
>     at 
> org.apache.commons.logging.AbstractLogTest.testLoggingWithNullParameters(AbstractLogTest.java:76) 
> 
>     at sun.reflect.NativeMethodAccessorImpl.invoke0(Native Method)
>     at 
> sun.reflect.NativeMethodAccessorImpl.invoke(NativeMethodAccessorImpl.java:39) 
> 
>     at 
> sun.reflect.DelegatingMethodAccessorImpl.invoke(DelegatingMethodAccessorImpl.java:25) 
> 
>     at java.lang.reflect.Method.invoke(Method.java:324)
>     at junit.framework.TestCase.runTest(TestCase.java:154)
>     at junit.framework.TestCase.runBare(TestCase.java:127)
>     at junit.framework.TestResult$1.protect(TestResult.java:106)
>     at junit.framework.TestResult.runProtected(TestResult.java:124)
>     at junit.framework.TestResult.run(TestResult.java:109)
>     at junit.framework.TestCase.run(TestCase.java:118)
>     at junit.framework.TestSuite.runTest(TestSuite.java:208)
>     at junit.framework.TestSuite.run(TestSuite.java:203)
>     at sun.reflect.NativeMethodAccessorImpl.invoke0(Native Method)
>     at 
> sun.reflect.NativeMethodAccessorImpl.invoke(NativeMethodAccessorImpl.java:39) 
> 
>     at 
> sun.reflect.DelegatingMethodAccessorImpl.invoke(DelegatingMethodAccessorImpl.java:25) 
> 
>     at java.lang.reflect.Method.invoke(Method.java:324)
>     at 
> org.apache.maven.surefire.junit.JUnitTestSet.execute(JUnitTestSet.java:213)
>     at 
> org.apache.maven.surefire.suite.AbstractDirectoryTestSuite.executeTestSet(AbstractDirectoryTestSuite.java:138) 
> 
>     at 
> org.apache.maven.surefire.suite.AbstractDirectoryTestSuite.execute(AbstractDirectoryTestSuite.java:125) 
> 
>     at org.apache.maven.surefire.Surefire.run(Surefire.java:132)
>     at sun.reflect.NativeMethodAccessorImpl.invoke0(Native Method)
>     at 
> sun.reflect.NativeMethodAccessorImpl.invoke(NativeMethodAccessorImpl.java:39) 
> 
>     at 
> sun.reflect.DelegatingMethodAccessorImpl.invoke(DelegatingMethodAccessorImpl.java:25) 
> 
>     at java.lang.reflect.Method.invoke(Method.java:324)
>     at 
> org.apache.maven.surefire.booter.SurefireBooter.runSuitesInProcess(SurefireBooter.java:290) 
> 
>     at 
> org.apache.maven.surefire.booter.SurefireBooter.main(SurefireBooter.java:818) 
> 
> 
> [WARN] SimpleLogTestCase - null
> [WARN] SimpleLogTestCase - null
> [WARN] SimpleLogTestCase - org.apache.commons.logging.impl.SimpleLog: 
> warn statement
> [WARN] SimpleLogTestCase - org.apache.commons.logging.impl.SimpleLog: 
> warn statement w/ null exception 
> <java.lang.RuntimeException>java.lang.RuntimeException
>     at 
> org.apache.commons.logging.AbstractLogTest.testLoggingWithNullParameters(AbstractLogTest.java:94) 
> 
>     at sun.reflect.NativeMethodAccessorImpl.invoke0(Native Method)
>     at 
> sun.reflect.NativeMethodAccessorImpl.invoke(NativeMethodAccessorImpl.java:39) 
> 
>     at 
> sun.reflect.DelegatingMethodAccessorImpl.invoke(DelegatingMethodAccessorImpl.java:25) 
> 
>     at java.lang.reflect.Method.invoke(Method.java:324)
>     at junit.framework.TestCase.runTest(TestCase.java:154)
>     at junit.framework.TestCase.runBare(TestCase.java:127)
>     at junit.framework.TestResult$1.protect(TestResult.java:106)
>     at junit.framework.TestResult.runProtected(TestResult.java:124)
>     at junit.framework.TestResult.run(TestResult.java:109)
>     at junit.framework.TestCase.run(TestCase.java:118)
>     at junit.framework.TestSuite.runTest(TestSuite.java:208)
>     at junit.framework.TestSuite.run(TestSuite.java:203)
>     at sun.reflect.NativeMethodAccessorImpl.invoke0(Native Method)
>     at 
> sun.reflect.NativeMethodAccessorImpl.invoke(NativeMethodAccessorImpl.java:39) 
> 
>     at 
> sun.reflect.DelegatingMethodAccessorImpl.invoke(DelegatingMethodAccessorImpl.java:25) 
> 
>     at java.lang.reflect.Method.invoke(Method.java:324)
>     at 
> org.apache.maven.surefire.junit.JUnitTestSet.execute(JUnitTestSet.java:213)
>     at 
> org.apache.maven.surefire.suite.AbstractDirectoryTestSuite.executeTestSet(AbstractDirectoryTestSuite.java:138) 
> 
>     at 
> org.apache.maven.surefire.suite.AbstractDirectoryTestSuite.execute(AbstractDirectoryTestSuite.java:125) 
> 
>     at org.apache.maven.surefire.Surefire.run(Surefire.java:132)
>     at sun.reflect.NativeMethodAccessorImpl.invoke0(Native Method)
>     at 
> sun.reflect.NativeMethodAccessorImpl.invoke(NativeMethodAccessorImpl.java:39) 
> 
>     at 
> sun.reflect.DelegatingMethodAccessorImpl.invoke(DelegatingMethodAccessorImpl.java:25) 
> 
>     at java.lang.reflect.Method.invoke(Method.java:324)
>     at 
> org.apache.maven.surefire.booter.SurefireBooter.runSuitesInProcess(SurefireBooter.java:290) 
> 
>     at 
> org.apache.maven.surefire.booter.SurefireBooter.main(SurefireBooter.java:818) 
> 
> 
> Tests run: 1, Failures: 0, Errors: 0, Skipped: 0, Time elapsed: 0.047 sec
> Running org.apache.commons.logging.security.SecurityAllowedTestCase
> 
> 
> testing permission:class 
> java.security.SecurityPermission:(java.security.SecurityPermission 
> getProperty.networkaddress.cache.ttl)
> 1:java.security.Security.getProperty
> 2:sun.net.InetAddressCachePolicy$1.run
> 3:java.security.AccessController.doPrivileged
> Access controller found: returning
> 
> 
> testing permission:class 
> java.util.PropertyPermission:(java.util.PropertyPermission 
> sun.net.inetaddr.ttl read)
> 1:java.lang.SecurityManager.checkPropertyAccess
> 2:java.lang.System.getProperty
> 3:java.lang.Integer.getInteger
> 4:java.lang.Integer.getInteger
> 5:sun.security.action.GetIntegerAction.run
> 6:java.security.AccessController.doPrivileged
> Access controller found: returning
> 
> 
> testing permission:class 
> java.security.SecurityPermission:(java.security.SecurityPermission 
> getProperty.networkaddress.cache.negative.ttl)
> 1:java.security.Security.getProperty
> 2:sun.net.InetAddressCachePolicy$2.run
> 3:java.security.AccessController.doPrivileged
> Access controller found: returning
> 
> 
> testing permission:class 
> java.util.PropertyPermission:(java.util.PropertyPermission 
> org.apache.commons.logging.diagnostics.dest read)
> 1:java.lang.SecurityManager.checkPropertyAccess
> 2:java.lang.System.getProperty
> 3:org.apache.commons.logging.LogFactory$6.run
> Permission in allowed set for JCL class
> 4:java.security.AccessController.doPrivileged
> Access controller found: returning
> 
> 
> testing permission:class 
> java.util.PropertyPermission:(java.util.PropertyPermission 
> org.apache.commons.logging.LogFactory.HashtableImpl read)
> 1:java.lang.SecurityManager.checkPropertyAccess
> 2:java.lang.System.getProperty
> 3:org.apache.commons.logging.LogFactory$6.run
> Permission in allowed set for JCL class
> 4:java.security.AccessController.doPrivileged
> Access controller found: returning
> 
> 
> testing permission:class 
> java.lang.reflect.ReflectPermission:(java.lang.reflect.ReflectPermission 
> suppressAccessChecks)
> 1:java.lang.reflect.AccessibleObject.setAccessible
> 2:java.lang.Class$1.run
> 3:java.security.AccessController.doPrivileged
> Access controller found: returning
> 
> 
> testing permission:class 
> java.util.PropertyPermission:(java.util.PropertyPermission 
> org.apache.commons.logging.LogFactory read)
> 1:java.lang.SecurityManager.checkPropertyAccess
> 2:java.lang.System.getProperty
> 3:org.apache.commons.logging.LogFactory$6.run
> Permission in allowed set for JCL class
> 4:java.security.AccessController.doPrivileged
> Access controller found: returning
> 
> 
> testing permission:class 
> java.lang.reflect.ReflectPermission:(java.lang.reflect.ReflectPermission 
> suppressAccessChecks)
> 1:java.lang.reflect.AccessibleObject.setAccessible
> 2:java.lang.Class$1.run
> 3:java.security.AccessController.doPrivileged
> Access controller found: returning
> 
> 
> testing permission:class 
> java.util.PropertyPermission:(java.util.PropertyPermission 
> org.apache.commons.logging.Log.allowFlawedContext read)
> 1:java.lang.SecurityManager.checkPropertyAccess
> 2:java.lang.System.getProperty
> 3:org.apache.commons.logging.impl.LogFactoryImpl$2.run
> Permission in allowed set for JCL class
> 4:java.security.AccessController.doPrivileged
> Access controller found: returning
> 
> 
> testing permission:class 
> java.util.PropertyPermission:(java.util.PropertyPermission 
> org.apache.commons.logging.Log.allowFlawedDiscovery read)
> 1:java.lang.SecurityManager.checkPropertyAccess
> 2:java.lang.System.getProperty
> 3:org.apache.commons.logging.impl.LogFactoryImpl$2.run
> Permission in allowed set for JCL class
> 4:java.security.AccessController.doPrivileged
> Access controller found: returning
> 
> 
> testing permission:class 
> java.util.PropertyPermission:(java.util.PropertyPermission 
> org.apache.commons.logging.Log.allowFlawedHierarchy read)
> 1:java.lang.SecurityManager.checkPropertyAccess
> 2:java.lang.System.getProperty
> 3:org.apache.commons.logging.impl.LogFactoryImpl$2.run
> Permission in allowed set for JCL class
> 4:java.security.AccessController.doPrivileged
> Access controller found: returning
> 
> 
> testing permission:class 
> java.util.PropertyPermission:(java.util.PropertyPermission 
> org.apache.commons.logging.Log read)
> 1:java.lang.SecurityManager.checkPropertyAccess
> 2:java.lang.System.getProperty
> 3:org.apache.commons.logging.impl.LogFactoryImpl$2.run
> Permission in allowed set for JCL class
> 4:java.security.AccessController.doPrivileged
> Access controller found: returning
> 
> 
> testing permission:class 
> java.util.PropertyPermission:(java.util.PropertyPermission 
> org.apache.commons.logging.log read)
> 1:java.lang.SecurityManager.checkPropertyAccess
> 2:java.lang.System.getProperty
> 3:org.apache.commons.logging.impl.LogFactoryImpl$2.run
> Permission in allowed set for JCL class
> 4:java.security.AccessController.doPrivileged
> Access controller found: returning
> 
> 
> testing permission:class 
> java.util.logging.LoggingPermission:(java.util.logging.LoggingPermission 
> control)
> 1:java.util.logging.LogManager.checkAccess
> 2:java.util.logging.Logger.checkAccess
> 3:java.util.logging.Logger.setParent
> 4:java.util.logging.LogManager$4.run
> 5:java.security.AccessController.doPrivileged
> Access controller found: returning
> Tests run: 1, Failures: 0, Errors: 0, Skipped: 0, Time elapsed: 0.198 sec
> Running 
> org.apache.commons.logging.log4j.log4j12.ChildClasspathStandardTestCase
> Tests run: 0, Failures: 0, Errors: 0, Skipped: 0, Time elapsed: 0.007 sec
> Running org.apache.commons.logging.simple.DefaultConfigTestCase
> Tests run: 4, Failures: 0, Errors: 0, Skipped: 0, Time elapsed: 0.103 sec
> Running org.apache.commons.logging.jdk14.CustomConfigFullTestCase
> Tests run: 7, Failures: 2, Errors: 0, Skipped: 0, Time elapsed: 0.193 
> sec <<< FAILURE!
> Running org.apache.commons.logging.security.SecurityForbiddenTestCase
> 
> 
> testing permission:class 
> java.util.PropertyPermission:(java.util.PropertyPermission 
> org.apache.commons.logging.diagnostics.dest read)
> 1:java.lang.SecurityManager.checkPropertyAccess
> 2:java.lang.System.getProperty
> 3:org.apache.commons.logging.LogFactory$6.run
> Permission refused:class 
> java.util.PropertyPermission:(java.util.PropertyPermission 
> org.apache.commons.logging.diagnostics.dest read)
> 
> 
> testing permission:class 
> java.util.PropertyPermission:(java.util.PropertyPermission 
> org.apache.commons.logging.LogFactory.HashtableImpl read)
> 1:java.lang.SecurityManager.checkPropertyAccess
> 2:java.lang.System.getProperty
> 3:org.apache.commons.logging.LogFactory$6.run
> Permission refused:class 
> java.util.PropertyPermission:(java.util.PropertyPermission 
> org.apache.commons.logging.LogFactory.HashtableImpl read)
> 
> 
> testing permission:class 
> java.lang.reflect.ReflectPermission:(java.lang.reflect.ReflectPermission 
> suppressAccessChecks)
> 1:java.lang.reflect.AccessibleObject.setAccessible
> 2:java.lang.Class$1.run
> 3:java.security.AccessController.doPrivileged
> Access controller found: returning
> 
> 
> testing permission:class 
> java.util.PropertyPermission:(java.util.PropertyPermission 
> org.apache.commons.logging.LogFactory read)
> 1:java.lang.SecurityManager.checkPropertyAccess
> 2:java.lang.System.getProperty
> 3:org.apache.commons.logging.LogFactory$6.run
> Permission refused:class 
> java.util.PropertyPermission:(java.util.PropertyPermission 
> org.apache.commons.logging.LogFactory read)
> 
> 
> testing permission:class 
> java.lang.reflect.ReflectPermission:(java.lang.reflect.ReflectPermission 
> suppressAccessChecks)
> 1:java.lang.reflect.AccessibleObject.setAccessible
> 2:java.lang.Class$1.run
> 3:java.security.AccessController.doPrivileged
> Access controller found: returning
> 
> 
> testing permission:class 
> java.util.PropertyPermission:(java.util.PropertyPermission 
> org.apache.commons.logging.Log.allowFlawedContext read)
> 1:java.lang.SecurityManager.checkPropertyAccess
> 2:java.lang.System.getProperty
> 3:org.apache.commons.logging.impl.LogFactoryImpl$2.run
> Permission refused:class 
> java.util.PropertyPermission:(java.util.PropertyPermission 
> org.apache.commons.logging.Log.allowFlawedContext read)
> 
> 
> testing permission:class 
> java.util.PropertyPermission:(java.util.PropertyPermission 
> org.apache.commons.logging.Log.allowFlawedDiscovery read)
> 1:java.lang.SecurityManager.checkPropertyAccess
> 2:java.lang.System.getProperty
> 3:org.apache.commons.logging.impl.LogFactoryImpl$2.run
> Permission refused:class 
> java.util.PropertyPermission:(java.util.PropertyPermission 
> org.apache.commons.logging.Log.allowFlawedDiscovery read)
> 
> 
> testing permission:class 
> java.util.PropertyPermission:(java.util.PropertyPermission 
> org.apache.commons.logging.Log.allowFlawedHierarchy read)
> 1:java.lang.SecurityManager.checkPropertyAccess
> 2:java.lang.System.getProperty
> 3:org.apache.commons.logging.impl.LogFactoryImpl$2.run
> Permission refused:class 
> java.util.PropertyPermission:(java.util.PropertyPermission 
> org.apache.commons.logging.Log.allowFlawedHierarchy read)
> 
> 
> testing permission:class 
> java.util.PropertyPermission:(java.util.PropertyPermission 
> org.apache.commons.logging.Log read)
> 1:java.lang.SecurityManager.checkPropertyAccess
> 2:java.lang.System.getProperty
> 3:org.apache.commons.logging.impl.LogFactoryImpl$2.run
> Permission refused:class 
> java.util.PropertyPermission:(java.util.PropertyPermission 
> org.apache.commons.logging.Log read)
> 
> 
> testing permission:class 
> java.util.PropertyPermission:(java.util.PropertyPermission 
> org.apache.commons.logging.log read)
> 1:java.lang.SecurityManager.checkPropertyAccess
> 2:java.lang.System.getProperty
> 3:org.apache.commons.logging.impl.LogFactoryImpl$2.run
> Permission refused:class 
> java.util.PropertyPermission:(java.util.PropertyPermission 
> org.apache.commons.logging.log read)
> 
> 
> testing permission:class 
> java.util.logging.LoggingPermission:(java.util.logging.LoggingPermission 
> control)
> 1:java.util.logging.LogManager.checkAccess
> 2:java.util.logging.Logger.checkAccess
> 3:java.util.logging.Logger.setParent
> 4:java.util.logging.LogManager$4.run
> 5:java.security.AccessController.doPrivileged
> Access controller found: returning
> Tests run: 1, Failures: 0, Errors: 0, Skipped: 0, Time elapsed: 0.078 sec
> Running org.apache.commons.logging.tccl.NullTCCLTestCase
> log4j:WARN No appenders could be found for logger 
> (org.apache.commons.logging.tccl.NullTCCLTestCase).
> log4j:WARN Please initialize the log4j system properly.
> Tests run: 1, Failures: 0, Errors: 0, Skipped: 0, Time elapsed: 0.137 sec
> Running org.apache.commons.logging.BasicOperationsTestCase
> Tests run: 6, Failures: 0, Errors: 0, Skipped: 0, Time elapsed: 0.013 sec
> Running org.apache.commons.logging.BadHashtablePropertyTestCase
> Tests run: 2, Failures: 0, Errors: 0, Skipped: 0, Time elapsed: 0.021 sec
> Running org.apache.commons.logging.jdk14.CustomConfigTestCase
> Tests run: 7, Failures: 2, Errors: 0, Skipped: 0, Time elapsed: 0.067 
> sec <<< FAILURE!
> Running org.apache.commons.logging.LogTestCase
> Tests run: 1, Failures: 0, Errors: 0, Skipped: 0, Time elapsed: 0.006 sec
> Running org.apache.commons.logging.LoadTestCase
> Tests run: 1, Failures: 0, Errors: 0, Skipped: 0, Time elapsed: 2.25 sec
> Running org.apache.commons.logging.avalon.AvalonLoggerTestCase
> [DEBUG] null
> [DEBUG] null
> [DEBUG] org.apache.commons.logging.impl.AvalonLogger: debug statement
> [DEBUG] org.apache.commons.logging.impl.AvalonLogger: debug statement w/ 
> null exception
> java.lang.RuntimeException
>     at 
> org.apache.commons.logging.AbstractLogTest.testLoggingWithNullParameters(AbstractLogTest.java:49) 
> 
>     at sun.reflect.NativeMethodAccessorImpl.invoke0(Native Method)
>     at 
> sun.reflect.NativeMethodAccessorImpl.invoke(NativeMethodAccessorImpl.java:39) 
> 
>     at 
> sun.reflect.DelegatingMethodAccessorImpl.invoke(DelegatingMethodAccessorImpl.java:25) 
> 
>     at java.lang.reflect.Method.invoke(Method.java:324)
>     at junit.framework.TestCase.runTest(TestCase.java:154)
>     at junit.framework.TestCase.runBare(TestCase.java:127)
>     at junit.framework.TestResult$1.protect(TestResult.java:106)
>     at junit.framework.TestResult.runProtected(TestResult.java:124)
>     at junit.framework.TestResult.run(TestResult.java:109)
>     at junit.framework.TestCase.run(TestCase.java:118)
>     at junit.framework.TestSuite.runTest(TestSuite.java:208)
>     at junit.framework.TestSuite.run(TestSuite.java:203)
>     at junit.framework.TestSuite.runTest(TestSuite.java:208)
>     at junit.framework.TestSuite.run(TestSuite.java:203)
>     at sun.reflect.GeneratedMethodAccessor4.invoke(Unknown Source)
>     at 
> sun.reflect.DelegatingMethodAccessorImpl.invoke(DelegatingMethodAccessorImpl.java:25) 
> 
>     at java.lang.reflect.Method.invoke(Method.java:324)
>     at 
> org.apache.maven.surefire.junit.JUnitTestSet.execute(JUnitTestSet.java:213)
>     at 
> org.apache.maven.surefire.suite.AbstractDirectoryTestSuite.executeTestSet(AbstractDirectoryTestSuite.java:138) 
> 
>     at 
> org.apache.maven.surefire.suite.AbstractDirectoryTestSuite.execute(AbstractDirectoryTestSuite.java:125) 
> 
>     at org.apache.maven.surefire.Surefire.run(Surefire.java:132)
>     at sun.reflect.NativeMethodAccessorImpl.invoke0(Native Method)
>     at 
> sun.reflect.NativeMethodAccessorImpl.invoke(NativeMethodAccessorImpl.java:39) 
> 
>     at 
> sun.reflect.DelegatingMethodAccessorImpl.invoke(DelegatingMethodAccessorImpl.java:25) 
> 
>     at java.lang.reflect.Method.invoke(Method.java:324)
>     at 
> org.apache.maven.surefire.booter.SurefireBooter.runSuitesInProcess(SurefireBooter.java:290) 
> 
>     at 
> org.apache.maven.surefire.booter.SurefireBooter.main(SurefireBooter.java:818) 
> 
> [ERROR] null
> [ERROR] null
> [ERROR] org.apache.commons.logging.impl.AvalonLogger: error statement
> [ERROR] org.apache.commons.logging.impl.AvalonLogger: error statement w/ 
> null exception
> java.lang.RuntimeException
>     at 
> org.apache.commons.logging.AbstractLogTest.testLoggingWithNullParameters(AbstractLogTest.java:58) 
> 
>     at sun.reflect.NativeMethodAccessorImpl.invoke0(Native Method)
>     at 
> sun.reflect.NativeMethodAccessorImpl.invoke(NativeMethodAccessorImpl.java:39) 
> 
>     at 
> sun.reflect.DelegatingMethodAccessorImpl.invoke(DelegatingMethodAccessorImpl.java:25) 
> 
>     at java.lang.reflect.Method.invoke(Method.java:324)
>     at junit.framework.TestCase.runTest(TestCase.java:154)
>     at junit.framework.TestCase.runBare(TestCase.java:127)
>     at junit.framework.TestResult$1.protect(TestResult.java:106)
>     at junit.framework.TestResult.runProtected(TestResult.java:124)
>     at junit.framework.TestResult.run(TestResult.java:109)
>     at junit.framework.TestCase.run(TestCase.java:118)
>     at junit.framework.TestSuite.runTest(TestSuite.java:208)
>     at junit.framework.TestSuite.run(TestSuite.java:203)
>     at junit.framework.TestSuite.runTest(TestSuite.java:208)
>     at junit.framework.TestSuite.run(TestSuite.java:203)
>     at sun.reflect.GeneratedMethodAccessor4.invoke(Unknown Source)
>     at 
> sun.reflect.DelegatingMethodAccessorImpl.invoke(DelegatingMethodAccessorImpl.java:25) 
> 
>     at java.lang.reflect.Method.invoke(Method.java:324)
>     at 
> org.apache.maven.surefire.junit.JUnitTestSet.execute(JUnitTestSet.java:213)
>     at 
> org.apache.maven.surefire.suite.AbstractDirectoryTestSuite.executeTestSet(AbstractDirectoryTestSuite.java:138) 
> 
>     at 
> org.apache.maven.surefire.suite.AbstractDirectoryTestSuite.execute(AbstractDirectoryTestSuite.java:125) 
> 
>     at org.apache.maven.surefire.Surefire.run(Surefire.java:132)
>     at sun.reflect.NativeMethodAccessorImpl.invoke0(Native Method)
>     at 
> sun.reflect.NativeMethodAccessorImpl.invoke(NativeMethodAccessorImpl.java:39) 
> 
>     at 
> sun.reflect.DelegatingMethodAccessorImpl.invoke(DelegatingMethodAccessorImpl.java:25) 
> 
>     at java.lang.reflect.Method.invoke(Method.java:324)
>     at 
> org.apache.maven.surefire.booter.SurefireBooter.runSuitesInProcess(SurefireBooter.java:290) 
> 
>     at 
> org.apache.maven.surefire.booter.SurefireBooter.main(SurefireBooter.java:818) 
> 
> [FATAL ERROR] null
> [FATAL ERROR] null
> [FATAL ERROR] org.apache.commons.logging.impl.AvalonLogger: fatal statement
> [FATAL ERROR] org.apache.commons.logging.impl.AvalonLogger: fatal 
> statement w/ null exception
> java.lang.RuntimeException
>     at 
> org.apache.commons.logging.AbstractLogTest.testLoggingWithNullParameters(AbstractLogTest.java:67) 
> 
>     at sun.reflect.NativeMethodAccessorImpl.invoke0(Native Method)
>     at 
> sun.reflect.NativeMethodAccessorImpl.invoke(NativeMethodAccessorImpl.java:39) 
> 
>     at 
> sun.reflect.DelegatingMethodAccessorImpl.invoke(DelegatingMethodAccessorImpl.java:25) 
> 
>     at java.lang.reflect.Method.invoke(Method.java:324)
>     at junit.framework.TestCase.runTest(TestCase.java:154)
>     at junit.framework.TestCase.runBare(TestCase.java:127)
>     at junit.framework.TestResult$1.protect(TestResult.java:106)
>     at junit.framework.TestResult.runProtected(TestResult.java:124)
>     at junit.framework.TestResult.run(TestResult.java:109)
>     at junit.framework.TestCase.run(TestCase.java:118)
>     at junit.framework.TestSuite.runTest(TestSuite.java:208)
>     at junit.framework.TestSuite.run(TestSuite.java:203)
>     at junit.framework.TestSuite.runTest(TestSuite.java:208)
>     at junit.framework.TestSuite.run(TestSuite.java:203)
>     at sun.reflect.GeneratedMethodAccessor4.invoke(Unknown Source)
>     at 
> sun.reflect.DelegatingMethodAccessorImpl.invoke(DelegatingMethodAccessorImpl.java:25) 
> 
>     at java.lang.reflect.Method.invoke(Method.java:324)
>     at 
> org.apache.maven.surefire.junit.JUnitTestSet.execute(JUnitTestSet.java:213)
>     at 
> org.apache.maven.surefire.suite.AbstractDirectoryTestSuite.executeTestSet(AbstractDirectoryTestSuite.java:138) 
> 
>     at 
> org.apache.maven.surefire.suite.AbstractDirectoryTestSuite.execute(AbstractDirectoryTestSuite.java:125) 
> 
>     at org.apache.maven.surefire.Surefire.run(Surefire.java:132)
>     at sun.reflect.NativeMethodAccessorImpl.invoke0(Native Method)
>     at 
> sun.reflect.NativeMethodAccessorImpl.invoke(NativeMethodAccessorImpl.java:39) 
> 
>     at 
> sun.reflect.DelegatingMethodAccessorImpl.invoke(DelegatingMethodAccessorImpl.java:25) 
> 
>     at java.lang.reflect.Method.invoke(Method.java:324)
>     at 
> org.apache.maven.surefire.booter.SurefireBooter.runSuitesInProcess(SurefireBooter.java:290) 
> 
>     at 
> org.apache.maven.surefire.booter.SurefireBooter.main(SurefireBooter.java:818) 
> 
> [INFO] null
> [INFO] null
> [INFO] org.apache.commons.logging.impl.AvalonLogger: info statement
> [INFO] org.apache.commons.logging.impl.AvalonLogger: info statement w/ 
> null exception
> java.lang.RuntimeException
>     at 
> org.apache.commons.logging.AbstractLogTest.testLoggingWithNullParameters(AbstractLogTest.java:76) 
> 
>     at sun.reflect.NativeMethodAccessorImpl.invoke0(Native Method)
>     at 
> sun.reflect.NativeMethodAccessorImpl.invoke(NativeMethodAccessorImpl.java:39) 
> 
>     at 
> sun.reflect.DelegatingMethodAccessorImpl.invoke(DelegatingMethodAccessorImpl.java:25) 
> 
>     at java.lang.reflect.Method.invoke(Method.java:324)
>     at junit.framework.TestCase.runTest(TestCase.java:154)
>     at junit.framework.TestCase.runBare(TestCase.java:127)
>     at junit.framework.TestResult$1.protect(TestResult.java:106)
>     at junit.framework.TestResult.runProtected(TestResult.java:124)
>     at junit.framework.TestResult.run(TestResult.java:109)
>     at junit.framework.TestCase.run(TestCase.java:118)
>     at junit.framework.TestSuite.runTest(TestSuite.java:208)
>     at junit.framework.TestSuite.run(TestSuite.java:203)
>     at junit.framework.TestSuite.runTest(TestSuite.java:208)
>     at junit.framework.TestSuite.run(TestSuite.java:203)
>     at sun.reflect.GeneratedMethodAccessor4.invoke(Unknown Source)
>     at 
> sun.reflect.DelegatingMethodAccessorImpl.invoke(DelegatingMethodAccessorImpl.java:25) 
> 
>     at java.lang.reflect.Method.invoke(Method.java:324)
>     at 
> org.apache.maven.surefire.junit.JUnitTestSet.execute(JUnitTestSet.java:213)
>     at 
> org.apache.maven.surefire.suite.AbstractDirectoryTestSuite.executeTestSet(AbstractDirectoryTestSuite.java:138) 
> 
>     at 
> org.apache.maven.surefire.suite.AbstractDirectoryTestSuite.execute(AbstractDirectoryTestSuite.java:125) 
> 
>     at org.apache.maven.surefire.Surefire.run(Surefire.java:132)
>     at sun.reflect.NativeMethodAccessorImpl.invoke0(Native Method)
>     at 
> sun.reflect.NativeMethodAccessorImpl.invoke(NativeMethodAccessorImpl.java:39) 
> 
>     at 
> sun.reflect.DelegatingMethodAccessorImpl.invoke(DelegatingMethodAccessorImpl.java:25) 
> 
>     at java.lang.reflect.Method.invoke(Method.java:324)
>     at 
> org.apache.maven.surefire.booter.SurefireBooter.runSuitesInProcess(SurefireBooter.java:290) 
> 
>     at 
> org.apache.maven.surefire.booter.SurefireBooter.main(SurefireBooter.java:818) 
> 
> [DEBUG] null
> [DEBUG] null
> [DEBUG] org.apache.commons.logging.impl.AvalonLogger: trace statement
> [DEBUG] org.apache.commons.logging.impl.AvalonLogger: trace statement w/ 
> null exception
> java.lang.RuntimeException
>     at 
> org.apache.commons.logging.AbstractLogTest.testLoggingWithNullParameters(AbstractLogTest.java:85) 
> 
>     at sun.reflect.NativeMethodAccessorImpl.invoke0(Native Method)
>     at 
> sun.reflect.NativeMethodAccessorImpl.invoke(NativeMethodAccessorImpl.java:39) 
> 
>     at 
> sun.reflect.DelegatingMethodAccessorImpl.invoke(DelegatingMethodAccessorImpl.java:25) 
> 
>     at java.lang.reflect.Method.invoke(Method.java:324)
>     at junit.framework.TestCase.runTest(TestCase.java:154)
>     at junit.framework.TestCase.runBare(TestCase.java:127)
>     at junit.framework.TestResult$1.protect(TestResult.java:106)
>     at junit.framework.TestResult.runProtected(TestResult.java:124)
>     at junit.framework.TestResult.run(TestResult.java:109)
>     at junit.framework.TestCase.run(TestCase.java:118)
>     at junit.framework.TestSuite.runTest(TestSuite.java:208)
>     at junit.framework.TestSuite.run(TestSuite.java:203)
>     at junit.framework.TestSuite.runTest(TestSuite.java:208)
>     at junit.framework.TestSuite.run(TestSuite.java:203)
>     at sun.reflect.GeneratedMethodAccessor4.invoke(Unknown Source)
>     at 
> sun.reflect.DelegatingMethodAccessorImpl.invoke(DelegatingMethodAccessorImpl.java:25) 
> 
>     at java.lang.reflect.Method.invoke(Method.java:324)
>     at 
> org.apache.maven.surefire.junit.JUnitTestSet.execute(JUnitTestSet.java:213)
>     at 
> org.apache.maven.surefire.suite.AbstractDirectoryTestSuite.executeTestSet(AbstractDirectoryTestSuite.java:138) 
> 
>     at 
> org.apache.maven.surefire.suite.AbstractDirectoryTestSuite.execute(AbstractDirectoryTestSuite.java:125) 
> 
>     at org.apache.maven.surefire.Surefire.run(Surefire.java:132)
>     at sun.reflect.NativeMethodAccessorImpl.invoke0(Native Method)
>     at 
> sun.reflect.NativeMethodAccessorImpl.invoke(NativeMethodAccessorImpl.java:39) 
> 
>     at 
> sun.reflect.DelegatingMethodAccessorImpl.invoke(DelegatingMethodAccessorImpl.java:25) 
> 
>     at java.lang.reflect.Method.invoke(Method.java:324)
>     at 
> org.apache.maven.surefire.booter.SurefireBooter.runSuitesInProcess(SurefireBooter.java:290) 
> 
>     at 
> org.apache.maven.surefire.booter.SurefireBooter.main(SurefireBooter.java:818) 
> 
> [WARNING] null
> [WARNING] null
> [WARNING] org.apache.commons.logging.impl.AvalonLogger: warn statement
> [WARNING] org.apache.commons.logging.impl.AvalonLogger: warn statement 
> w/ null exception
> java.lang.RuntimeException
>     at 
> org.apache.commons.logging.AbstractLogTest.testLoggingWithNullParameters(AbstractLogTest.java:94) 
> 
>     at sun.reflect.NativeMethodAccessorImpl.invoke0(Native Method)
>     at 
> sun.reflect.NativeMethodAccessorImpl.invoke(NativeMethodAccessorImpl.java:39) 
> 
>     at 
> sun.reflect.DelegatingMethodAccessorImpl.invoke(DelegatingMethodAccessorImpl.java:25) 
> 
>     at java.lang.reflect.Method.invoke(Method.java:324)
>     at junit.framework.TestCase.runTest(TestCase.java:154)
>     at junit.framework.TestCase.runBare(TestCase.java:127)
>     at junit.framework.TestResult$1.protect(TestResult.java:106)
>     at junit.framework.TestResult.runProtected(TestResult.java:124)
>     at junit.framework.TestResult.run(TestResult.java:109)
>     at junit.framework.TestCase.run(TestCase.java:118)
>     at junit.framework.TestSuite.runTest(TestSuite.java:208)
>     at junit.framework.TestSuite.run(TestSuite.java:203)
>     at junit.framework.TestSuite.runTest(TestSuite.java:208)
>     at junit.framework.TestSuite.run(TestSuite.java:203)
>     at sun.reflect.GeneratedMethodAccessor4.invoke(Unknown Source)
>     at 
> sun.reflect.DelegatingMethodAccessorImpl.invoke(DelegatingMethodAccessorImpl.java:25) 
> 
>     at java.lang.reflect.Method.invoke(Method.java:324)
>     at 
> org.apache.maven.surefire.junit.JUnitTestSet.execute(JUnitTestSet.java:213)
>     at 
> org.apache.maven.surefire.suite.AbstractDirectoryTestSuite.executeTestSet(AbstractDirectoryTestSuite.java:138) 
> 
>     at 
> org.apache.maven.surefire.suite.AbstractDirectoryTestSuite.execute(AbstractDirectoryTestSuite.java:125) 
> 
>     at org.apache.maven.surefire.Surefire.run(Surefire.java:132)
>     at sun.reflect.NativeMethodAccessorImpl.invoke0(Native Method)
>     at 
> sun.reflect.NativeMethodAccessorImpl.invoke(NativeMethodAccessorImpl.java:39) 
> 
>     at 
> sun.reflect.DelegatingMethodAccessorImpl.invoke(DelegatingMethodAccessorImpl.java:25) 
> 
>     at java.lang.reflect.Method.invoke(Method.java:324)
>     at 
> org.apache.maven.surefire.booter.SurefireBooter.runSuitesInProcess(SurefireBooter.java:290) 
> 
>     at 
> org.apache.maven.surefire.booter.SurefireBooter.main(SurefireBooter.java:818) 
> 
> Tests run: 1, Failures: 0, Errors: 0, Skipped: 0, Time elapsed: 0.132 sec
> Running org.apache.commons.logging.noop.NoOpLogTestCase
> Tests run: 2, Failures: 0, Errors: 0, Skipped: 0, Time elapsed: 0.021 sec
> Running 
> org.apache.commons.logging.log4j.log4j12.ApiClasspathStandardTestCase
> Tests run: 0, Failures: 0, Errors: 0, Skipped: 0, Time elapsed: 0.004 sec
> Running org.apache.commons.logging.pathable.ChildFirstTestCase
> Tests run: 4, Failures: 0, Errors: 0, Skipped: 0, Time elapsed: 0.024 sec
> Running 
> org.apache.commons.logging.log4j.log4j12.AppClasspathStandardTestCase
> Tests run: 0, Failures: 0, Errors: 0, Skipped: 0, Time elapsed: 0.006 sec
> Running org.apache.commons.logging.simple.DateTimeCustomConfigTestCase
> 22.58.2007 [DEBUG] DecoratedLogger - debug 
> <org.apache.commons.logging.DummyException>org.apache.commons.logging.DummyException 
> 
>     at 
> org.apache.commons.logging.simple.CustomConfigTestCase.logExceptionMessages(CustomConfigTestCase.java:238) 
> 
>     at 
> org.apache.commons.logging.simple.CustomConfigTestCase.testExceptionMessages(CustomConfigTestCase.java:137) 
> 
>     at sun.reflect.NativeMethodAccessorImpl.invoke0(Native Method)
>     at 
> sun.reflect.NativeMethodAccessorImpl.invoke(NativeMethodAccessorImpl.java:39) 
> 
>     at 
> sun.reflect.DelegatingMethodAccessorImpl.invoke(DelegatingMethodAccessorImpl.java:25) 
> 
>     at java.lang.reflect.Method.invoke(Method.java:324)
>     at junit.framework.TestCase.runTest(TestCase.java:154)
>     at junit.framework.TestCase.runBare(TestCase.java:127)
>     at junit.framework.TestResult$1.protect(TestResult.java:106)
>     at junit.framework.TestResult.runProtected(TestResult.java:124)
>     at junit.framework.TestResult.run(TestResult.java:109)
>     at junit.framework.TestCase.run(TestCase.java:118)
>     at 
> org.apache.commons.logging.PathableTestSuite.runTest(PathableTestSuite.java:142) 
> 
>     at junit.framework.TestSuite.run(TestSuite.java:203)
>     at sun.reflect.GeneratedMethodAccessor4.invoke(Unknown Source)
>     at 
> sun.reflect.DelegatingMethodAccessorImpl.invoke(DelegatingMethodAccessorImpl.java:25) 
> 
>     at java.lang.reflect.Method.invoke(Method.java:324)
>     at 
> org.apache.maven.surefire.junit.JUnitTestSet.execute(JUnitTestSet.java:213)
>     at 
> org.apache.maven.surefire.suite.AbstractDirectoryTestSuite.executeTestSet(AbstractDirectoryTestSuite.java:138) 
> 
>     at 
> org.apache.maven.surefire.suite.AbstractDirectoryTestSuite.execute(AbstractDirectoryTestSuite.java:125) 
> 
>     at org.apache.maven.surefire.Surefire.run(Surefire.java:132)
>     at sun.reflect.NativeMethodAccessorImpl.invoke0(Native Method)
>     at 
> sun.reflect.NativeMethodAccessorImpl.invoke(NativeMethodAccessorImpl.java:39) 
> 
>     at 
> sun.reflect.DelegatingMethodAccessorImpl.invoke(DelegatingMethodAccessorImpl.java:25) 
> 
>     at java.lang.reflect.Method.invoke(Method.java:324)
>     at 
> org.apache.maven.surefire.booter.SurefireBooter.runSuitesInProcess(SurefireBooter.java:290) 
> 
>     at 
> org.apache.maven.surefire.booter.SurefireBooter.main(SurefireBooter.java:818) 
> 
> 
> 22.58.2007 [INFO] DecoratedLogger - info 
> <org.apache.commons.logging.DummyException>org.apache.commons.logging.DummyException 
> 
>     at 
> org.apache.commons.logging.simple.CustomConfigTestCase.logExceptionMessages(CustomConfigTestCase.java:238) 
> 
>     at 
> org.apache.commons.logging.simple.CustomConfigTestCase.testExceptionMessages(CustomConfigTestCase.java:137) 
> 
>     at sun.reflect.NativeMethodAccessorImpl.invoke0(Native Method)
>     at 
> sun.reflect.NativeMethodAccessorImpl.invoke(NativeMethodAccessorImpl.java:39) 
> 
>     at 
> sun.reflect.DelegatingMethodAccessorImpl.invoke(DelegatingMethodAccessorImpl.java:25) 
> 
>     at java.lang.reflect.Method.invoke(Method.java:324)
>     at junit.framework.TestCase.runTest(TestCase.java:154)
>     at junit.framework.TestCase.runBare(TestCase.java:127)
>     at junit.framework.TestResult$1.protect(TestResult.java:106)
>     at junit.framework.TestResult.runProtected(TestResult.java:124)
>     at junit.framework.TestResult.run(TestResult.java:109)
>     at junit.framework.TestCase.run(TestCase.java:118)
>     at 
> org.apache.commons.logging.PathableTestSuite.runTest(PathableTestSuite.java:142) 
> 
>     at junit.framework.TestSuite.run(TestSuite.java:203)
>     at sun.reflect.GeneratedMethodAccessor4.invoke(Unknown Source)
>     at 
> sun.reflect.DelegatingMethodAccessorImpl.invoke(DelegatingMethodAccessorImpl.java:25) 
> 
>     at java.lang.reflect.Method.invoke(Method.java:324)
>     at 
> org.apache.maven.surefire.junit.JUnitTestSet.execute(JUnitTestSet.java:213)
>     at 
> org.apache.maven.surefire.suite.AbstractDirectoryTestSuite.executeTestSet(AbstractDirectoryTestSuite.java:138) 
> 
>     at 
> org.apache.maven.surefire.suite.AbstractDirectoryTestSuite.execute(AbstractDirectoryTestSuite.java:125) 
> 
>     at org.apache.maven.surefire.Surefire.run(Surefire.java:132)
>     at sun.reflect.NativeMethodAccessorImpl.invoke0(Native Method)
>     at 
> sun.reflect.NativeMethodAccessorImpl.invoke(NativeMethodAccessorImpl.java:39) 
> 
>     at 
> sun.reflect.DelegatingMethodAccessorImpl.invoke(DelegatingMethodAccessorImpl.java:25) 
> 
>     at java.lang.reflect.Method.invoke(Method.java:324)
>     at 
> org.apache.maven.surefire.booter.SurefireBooter.runSuitesInProcess(SurefireBooter.java:290) 
> 
>     at 
> org.apache.maven.surefire.booter.SurefireBooter.main(SurefireBooter.java:818) 
> 
> 
> 22.58.2007 [WARN] DecoratedLogger - warn 
> <org.apache.commons.logging.DummyException>org.apache.commons.logging.DummyException 
> 
>     at 
> org.apache.commons.logging.simple.CustomConfigTestCase.logExceptionMessages(CustomConfigTestCase.java:238) 
> 
>     at 
> org.apache.commons.logging.simple.CustomConfigTestCase.testExceptionMessages(CustomConfigTestCase.java:137) 
> 
>     at sun.reflect.NativeMethodAccessorImpl.invoke0(Native Method)
>     at 
> sun.reflect.NativeMethodAccessorImpl.invoke(NativeMethodAccessorImpl.java:39) 
> 
>     at 
> sun.reflect.DelegatingMethodAccessorImpl.invoke(DelegatingMethodAccessorImpl.java:25) 
> 
>     at java.lang.reflect.Method.invoke(Method.java:324)
>     at junit.framework.TestCase.runTest(TestCase.java:154)
>     at junit.framework.TestCase.runBare(TestCase.java:127)
>     at junit.framework.TestResult$1.protect(TestResult.java:106)
>     at junit.framework.TestResult.runProtected(TestResult.java:124)
>     at junit.framework.TestResult.run(TestResult.java:109)
>     at junit.framework.TestCase.run(TestCase.java:118)
>     at 
> org.apache.commons.logging.PathableTestSuite.runTest(PathableTestSuite.java:142) 
> 
>     at junit.framework.TestSuite.run(TestSuite.java:203)
>     at sun.reflect.GeneratedMethodAccessor4.invoke(Unknown Source)
>     at 
> sun.reflect.DelegatingMethodAccessorImpl.invoke(DelegatingMethodAccessorImpl.java:25) 
> 
>     at java.lang.reflect.Method.invoke(Method.java:324)
>     at 
> org.apache.maven.surefire.junit.JUnitTestSet.execute(JUnitTestSet.java:213)
>     at 
> org.apache.maven.surefire.suite.AbstractDirectoryTestSuite.executeTestSet(AbstractDirectoryTestSuite.java:138) 
> 
>     at 
> org.apache.maven.surefire.suite.AbstractDirectoryTestSuite.execute(AbstractDirectoryTestSuite.java:125) 
> 
>     at org.apache.maven.surefire.Surefire.run(Surefire.java:132)
>     at sun.reflect.NativeMethodAccessorImpl.invoke0(Native Method)
>     at 
> sun.reflect.NativeMethodAccessorImpl.invoke(NativeMethodAccessorImpl.java:39) 
> 
>     at 
> sun.reflect.DelegatingMethodAccessorImpl.invoke(DelegatingMethodAccessorImpl.java:25) 
> 
>     at java.lang.reflect.Method.invoke(Method.java:324)
>     at 
> org.apache.maven.surefire.booter.SurefireBooter.runSuitesInProcess(SurefireBooter.java:290) 
> 
>     at 
> org.apache.maven.surefire.booter.SurefireBooter.main(SurefireBooter.java:818) 
> 
> 
> 22.58.2007 [ERROR] DecoratedLogger - error 
> <org.apache.commons.logging.DummyException>org.apache.commons.logging.DummyException 
> 
>     at 
> org.apache.commons.logging.simple.CustomConfigTestCase.logExceptionMessages(CustomConfigTestCase.java:238) 
> 
>     at 
> org.apache.commons.logging.simple.CustomConfigTestCase.testExceptionMessages(CustomConfigTestCase.java:137) 
> 
>     at sun.reflect.NativeMethodAccessorImpl.invoke0(Native Method)
>     at 
> sun.reflect.NativeMethodAccessorImpl.invoke(NativeMethodAccessorImpl.java:39) 
> 
>     at 
> sun.reflect.DelegatingMethodAccessorImpl.invoke(DelegatingMethodAccessorImpl.java:25) 
> 
>     at java.lang.reflect.Method.invoke(Method.java:324)
>     at junit.framework.TestCase.runTest(TestCase.java:154)
>     at junit.framework.TestCase.runBare(TestCase.java:127)
>     at junit.framework.TestResult$1.protect(TestResult.java:106)
>     at junit.framework.TestResult.runProtected(TestResult.java:124)
>     at junit.framework.TestResult.run(TestResult.java:109)
>     at junit.framework.TestCase.run(TestCase.java:118)
>     at 
> org.apache.commons.logging.PathableTestSuite.runTest(PathableTestSuite.java:142) 
> 
>     at junit.framework.TestSuite.run(TestSuite.java:203)
>     at sun.reflect.GeneratedMethodAccessor4.invoke(Unknown Source)
>     at 
> sun.reflect.DelegatingMethodAccessorImpl.invoke(DelegatingMethodAccessorImpl.java:25) 
> 
>     at java.lang.reflect.Method.invoke(Method.java:324)
>     at 
> org.apache.maven.surefire.junit.JUnitTestSet.execute(JUnitTestSet.java:213)
>     at 
> org.apache.maven.surefire.suite.AbstractDirectoryTestSuite.executeTestSet(AbstractDirectoryTestSuite.java:138) 
> 
>     at 
> org.apache.maven.surefire.suite.AbstractDirectoryTestSuite.execute(AbstractDirectoryTestSuite.java:125) 
> 
>     at org.apache.maven.surefire.Surefire.run(Surefire.java:132)
>     at sun.reflect.NativeMethodAccessorImpl.invoke0(Native Method)
>     at 
> sun.reflect.NativeMethodAccessorImpl.invoke(NativeMethodAccessorImpl.java:39) 
> 
>     at 
> sun.reflect.DelegatingMethodAccessorImpl.invoke(DelegatingMethodAccessorImpl.java:25) 
> 
>     at java.lang.reflect.Method.invoke(Method.java:324)
>     at 
> org.apache.maven.surefire.booter.SurefireBooter.runSuitesInProcess(SurefireBooter.java:290) 
> 
>     at 
> org.apache.maven.surefire.booter.SurefireBooter.main(SurefireBooter.java:818) 
> 
> 
> 22.58.2007 [FATAL] DecoratedLogger - fatal 
> <org.apache.commons.logging.DummyException>org.apache.commons.logging.DummyException 
> 
>     at 
> org.apache.commons.logging.simple.CustomConfigTestCase.logExceptionMessages(CustomConfigTestCase.java:238) 
> 
>     at 
> org.apache.commons.logging.simple.CustomConfigTestCase.testExceptionMessages(CustomConfigTestCase.java:137) 
> 
>     at sun.reflect.NativeMethodAccessorImpl.invoke0(Native Method)
>     at 
> sun.reflect.NativeMethodAccessorImpl.invoke(NativeMethodAccessorImpl.java:39) 
> 
>     at 
> sun.reflect.DelegatingMethodAccessorImpl.invoke(DelegatingMethodAccessorImpl.java:25) 
> 
>     at java.lang.reflect.Method.invoke(Method.java:324)
>     at junit.framework.TestCase.runTest(TestCase.java:154)
>     at junit.framework.TestCase.runBare(TestCase.java:127)
>     at junit.framework.TestResult$1.protect(TestResult.java:106)
>     at junit.framework.TestResult.runProtected(TestResult.java:124)
>     at junit.framework.TestResult.run(TestResult.java:109)
>     at junit.framework.TestCase.run(TestCase.java:118)
>     at 
> org.apache.commons.logging.PathableTestSuite.runTest(PathableTestSuite.java:142) 
> 
>     at junit.framework.TestSuite.run(TestSuite.java:203)
>     at sun.reflect.GeneratedMethodAccessor4.invoke(Unknown Source)
>     at 
> sun.reflect.DelegatingMethodAccessorImpl.invoke(DelegatingMethodAccessorImpl.java:25) 
> 
>     at java.lang.reflect.Method.invoke(Method.java:324)
>     at 
> org.apache.maven.surefire.junit.JUnitTestSet.execute(JUnitTestSet.java:213)
>     at 
> org.apache.maven.surefire.suite.AbstractDirectoryTestSuite.executeTestSet(AbstractDirectoryTestSuite.java:138) 
> 
>     at 
> org.apache.maven.surefire.suite.AbstractDirectoryTestSuite.execute(AbstractDirectoryTestSuite.java:125) 
> 
>     at org.apache.maven.surefire.Surefire.run(Surefire.java:132)
>     at sun.reflect.NativeMethodAccessorImpl.invoke0(Native Method)
>     at 
> sun.reflect.NativeMethodAccessorImpl.invoke(NativeMethodAccessorImpl.java:39) 
> 
>     at 
> sun.reflect.DelegatingMethodAccessorImpl.invoke(DelegatingMethodAccessorImpl.java:25) 
> 
>     at java.lang.reflect.Method.invoke(Method.java:324)
>     at 
> org.apache.maven.surefire.booter.SurefireBooter.runSuitesInProcess(SurefireBooter.java:290) 
> 
>     at 
> org.apache.maven.surefire.booter.SurefireBooter.main(SurefireBooter.java:818) 
> 
> 
> 22.58.2007 [DEBUG] DecoratedLogger - debug
> 22.58.2007 [INFO] DecoratedLogger - info
> 22.58.2007 [WARN] DecoratedLogger - warn
> 22.58.2007 [ERROR] DecoratedLogger - error
> 22.58.2007 [FATAL] DecoratedLogger - fatal
> 22.58.2007 [DEBUG] DecoratedLogger - debug
> 22.58.2007 [INFO] DecoratedLogger - info
> 22.58.2007 [WARN] DecoratedLogger - warn
> 22.58.2007 [ERROR] DecoratedLogger - error
> 22.58.2007 [FATAL] DecoratedLogger - fatal
> 22.58.2007 [DEBUG] DecoratedLogger - debug 
> <org.apache.commons.logging.DummyException>org.apache.commons.logging.DummyException 
> 
>     at 
> org.apache.commons.logging.simple.CustomConfigTestCase.logExceptionMessages(CustomConfigTestCase.java:238) 
> 
>     at 
> org.apache.commons.logging.simple.CustomConfigTestCase.testSerializable(CustomConfigTestCase.java:159) 
> 
>     at sun.reflect.NativeMethodAccessorImpl.invoke0(Native Method)
>     at 
> sun.reflect.NativeMethodAccessorImpl.invoke(NativeMethodAccessorImpl.java:39) 
> 
>     at 
> sun.reflect.DelegatingMethodAccessorImpl.invoke(DelegatingMethodAccessorImpl.java:25) 
> 
>     at java.lang.reflect.Method.invoke(Method.java:324)
>     at junit.framework.TestCase.runTest(TestCase.java:154)
>     at junit.framework.TestCase.runBare(TestCase.java:127)
>     at junit.framework.TestResult$1.protect(TestResult.java:106)
>     at junit.framework.TestResult.runProtected(TestResult.java:124)
>     at junit.framework.TestResult.run(TestResult.java:109)
>     at junit.framework.TestCase.run(TestCase.java:118)
>     at 
> org.apache.commons.logging.PathableTestSuite.runTest(PathableTestSuite.java:142) 
> 
>     at junit.framework.TestSuite.run(TestSuite.java:203)
>     at sun.reflect.GeneratedMethodAccessor4.invoke(Unknown Source)
>     at 
> sun.reflect.DelegatingMethodAccessorImpl.invoke(DelegatingMethodAccessorImpl.java:25) 
> 
>     at java.lang.reflect.Method.invoke(Method.java:324)
>     at 
> org.apache.maven.surefire.junit.JUnitTestSet.execute(JUnitTestSet.java:213)
>     at 
> org.apache.maven.surefire.suite.AbstractDirectoryTestSuite.executeTestSet(AbstractDirectoryTestSuite.java:138) 
> 
>     at 
> org.apache.maven.surefire.suite.AbstractDirectoryTestSuite.execute(AbstractDirectoryTestSuite.java:125) 
> 
>     at org.apache.maven.surefire.Surefire.run(Surefire.java:132)
>     at sun.reflect.NativeMethodAccessorImpl.invoke0(Native Method)
>     at 
> sun.reflect.NativeMethodAccessorImpl.invoke(NativeMethodAccessorImpl.java:39) 
> 
>     at 
> sun.reflect.DelegatingMethodAccessorImpl.invoke(DelegatingMethodAccessorImpl.java:25) 
> 
>     at java.lang.reflect.Method.invoke(Method.java:324)
>     at 
> org.apache.maven.surefire.booter.SurefireBooter.runSuitesInProcess(SurefireBooter.java:290) 
> 
>     at 
> org.apache.maven.surefire.booter.SurefireBooter.main(SurefireBooter.java:818) 
> 
> 
> 22.58.2007 [INFO] DecoratedLogger - info 
> <org.apache.commons.logging.DummyException>org.apache.commons.logging.DummyException 
> 
>     at 
> org.apache.commons.logging.simple.CustomConfigTestCase.logExceptionMessages(CustomConfigTestCase.java:238) 
> 
>     at 
> org.apache.commons.logging.simple.CustomConfigTestCase.testSerializable(CustomConfigTestCase.java:159) 
> 
>     at sun.reflect.NativeMethodAccessorImpl.invoke0(Native Method)
>     at 
> sun.reflect.NativeMethodAccessorImpl.invoke(NativeMethodAccessorImpl.java:39) 
> 
>     at 
> sun.reflect.DelegatingMethodAccessorImpl.invoke(DelegatingMethodAccessorImpl.java:25) 
> 
>     at java.lang.reflect.Method.invoke(Method.java:324)
>     at junit.framework.TestCase.runTest(TestCase.java:154)
>     at junit.framework.TestCase.runBare(TestCase.java:127)
>     at junit.framework.TestResult$1.protect(TestResult.java:106)
>     at junit.framework.TestResult.runProtected(TestResult.java:124)
>     at junit.framework.TestResult.run(TestResult.java:109)
>     at junit.framework.TestCase.run(TestCase.java:118)
>     at 
> org.apache.commons.logging.PathableTestSuite.runTest(PathableTestSuite.java:142) 
> 
>     at junit.framework.TestSuite.run(TestSuite.java:203)
>     at sun.reflect.GeneratedMethodAccessor4.invoke(Unknown Source)
>     at 
> sun.reflect.DelegatingMethodAccessorImpl.invoke(DelegatingMethodAccessorImpl.java:25) 
> 
>     at java.lang.reflect.Method.invoke(Method.java:324)
>     at 
> org.apache.maven.surefire.junit.JUnitTestSet.execute(JUnitTestSet.java:213)
>     at 
> org.apache.maven.surefire.suite.AbstractDirectoryTestSuite.executeTestSet(AbstractDirectoryTestSuite.java:138) 
> 
>     at 
> org.apache.maven.surefire.suite.AbstractDirectoryTestSuite.execute(AbstractDirectoryTestSuite.java:125) 
> 
>     at org.apache.maven.surefire.Surefire.run(Surefire.java:132)
>     at sun.reflect.NativeMethodAccessorImpl.invoke0(Native Method)
>     at 
> sun.reflect.NativeMethodAccessorImpl.invoke(NativeMethodAccessorImpl.java:39) 
> 
>     at 
> sun.reflect.DelegatingMethodAccessorImpl.invoke(DelegatingMethodAccessorImpl.java:25) 
> 
>     at java.lang.reflect.Method.invoke(Method.java:324)
>     at 
> org.apache.maven.surefire.booter.SurefireBooter.runSuitesInProcess(SurefireBooter.java:290) 
> 
>     at 
> org.apache.maven.surefire.booter.SurefireBooter.main(SurefireBooter.java:818) 
> 
> 
> 22.58.2007 [WARN] DecoratedLogger - warn 
> <org.apache.commons.logging.DummyException>org.apache.commons.logging.DummyException 
> 
>     at 
> org.apache.commons.logging.simple.CustomConfigTestCase.logExceptionMessages(CustomConfigTestCase.java:238) 
> 
>     at 
> org.apache.commons.logging.simple.CustomConfigTestCase.testSerializable(CustomConfigTestCase.java:159) 
> 
>     at sun.reflect.NativeMethodAccessorImpl.invoke0(Native Method)
>     at 
> sun.reflect.NativeMethodAccessorImpl.invoke(NativeMethodAccessorImpl.java:39) 
> 
>     at 
> sun.reflect.DelegatingMethodAccessorImpl.invoke(DelegatingMethodAccessorImpl.java:25) 
> 
>     at java.lang.reflect.Method.invoke(Method.java:324)
>     at junit.framework.TestCase.runTest(TestCase.java:154)
>     at junit.framework.TestCase.runBare(TestCase.java:127)
>     at junit.framework.TestResult$1.protect(TestResult.java:106)
>     at junit.framework.TestResult.runProtected(TestResult.java:124)
>     at junit.framework.TestResult.run(TestResult.java:109)
>     at junit.framework.TestCase.run(TestCase.java:118)
>     at 
> org.apache.commons.logging.PathableTestSuite.runTest(PathableTestSuite.java:142) 
> 
>     at junit.framework.TestSuite.run(TestSuite.java:203)
>     at sun.reflect.GeneratedMethodAccessor4.invoke(Unknown Source)
>     at 
> sun.reflect.DelegatingMethodAccessorImpl.invoke(DelegatingMethodAccessorImpl.java:25) 
> 
>     at java.lang.reflect.Method.invoke(Method.java:324)
>     at 
> org.apache.maven.surefire.junit.JUnitTestSet.execute(JUnitTestSet.java:213)
>     at 
> org.apache.maven.surefire.suite.AbstractDirectoryTestSuite.executeTestSet(AbstractDirectoryTestSuite.java:138) 
> 
>     at 
> org.apache.maven.surefire.suite.AbstractDirectoryTestSuite.execute(AbstractDirectoryTestSuite.java:125) 
> 
>     at org.apache.maven.surefire.Surefire.run(Surefire.java:132)
>     at sun.reflect.NativeMethodAccessorImpl.invoke0(Native Method)
>     at 
> sun.reflect.NativeMethodAccessorImpl.invoke(NativeMethodAccessorImpl.java:39) 
> 
>     at 
> sun.reflect.DelegatingMethodAccessorImpl.invoke(DelegatingMethodAccessorImpl.java:25) 
> 
>     at java.lang.reflect.Method.invoke(Method.java:324)
>     at 
> org.apache.maven.surefire.booter.SurefireBooter.runSuitesInProcess(SurefireBooter.java:290) 
> 
>     at 
> org.apache.maven.surefire.booter.SurefireBooter.main(SurefireBooter.java:818) 
> 
> 
> 22.58.2007 [ERROR] DecoratedLogger - error 
> <org.apache.commons.logging.DummyException>org.apache.commons.logging.DummyException 
> 
>     at 
> org.apache.commons.logging.simple.CustomConfigTestCase.logExceptionMessages(CustomConfigTestCase.java:238) 
> 
>     at 
> org.apache.commons.logging.simple.CustomConfigTestCase.testSerializable(CustomConfigTestCase.java:159) 
> 
>     at sun.reflect.NativeMethodAccessorImpl.invoke0(Native Method)
>     at 
> sun.reflect.NativeMethodAccessorImpl.invoke(NativeMethodAccessorImpl.java:39) 
> 
>     at 
> sun.reflect.DelegatingMethodAccessorImpl.invoke(DelegatingMethodAccessorImpl.java:25) 
> 
>     at java.lang.reflect.Method.invoke(Method.java:324)
>     at junit.framework.TestCase.runTest(TestCase.java:154)
>     at junit.framework.TestCase.runBare(TestCase.java:127)
>     at junit.framework.TestResult$1.protect(TestResult.java:106)
>     at junit.framework.TestResult.runProtected(TestResult.java:124)
>     at junit.framework.TestResult.run(TestResult.java:109)
>     at junit.framework.TestCase.run(TestCase.java:118)
>     at 
> org.apache.commons.logging.PathableTestSuite.runTest(PathableTestSuite.java:142) 
> 
>     at junit.framework.TestSuite.run(TestSuite.java:203)
>     at sun.reflect.GeneratedMethodAccessor4.invoke(Unknown Source)
>     at 
> sun.reflect.DelegatingMethodAccessorImpl.invoke(DelegatingMethodAccessorImpl.java:25) 
> 
>     at java.lang.reflect.Method.invoke(Method.java:324)
>     at 
> org.apache.maven.surefire.junit.JUnitTestSet.execute(JUnitTestSet.java:213)
>     at 
> org.apache.maven.surefire.suite.AbstractDirectoryTestSuite.executeTestSet(AbstractDirectoryTestSuite.java:138) 
> 
>     at 
> org.apache.maven.surefire.suite.AbstractDirectoryTestSuite.execute(AbstractDirectoryTestSuite.java:125) 
> 
>     at org.apache.maven.surefire.Surefire.run(Surefire.java:132)
>     at sun.reflect.NativeMethodAccessorImpl.invoke0(Native Method)
>     at 
> sun.reflect.NativeMethodAccessorImpl.invoke(NativeMethodAccessorImpl.java:39) 
> 
>     at 
> sun.reflect.DelegatingMethodAccessorImpl.invoke(DelegatingMethodAccessorImpl.java:25) 
> 
>     at java.lang.reflect.Method.invoke(Method.java:324)
>     at 
> org.apache.maven.surefire.booter.SurefireBooter.runSuitesInProcess(SurefireBooter.java:290) 
> 
>     at 
> org.apache.maven.surefire.booter.SurefireBooter.main(SurefireBooter.java:818) 
> 
> 
> 22.58.2007 [FATAL] DecoratedLogger - fatal 
> <org.apache.commons.logging.DummyException>org.apache.commons.logging.DummyException 
> 
>     at 
> org.apache.commons.logging.simple.CustomConfigTestCase.logExceptionMessages(CustomConfigTestCase.java:238) 
> 
>     at 
> org.apache.commons.logging.simple.CustomConfigTestCase.testSerializable(CustomConfigTestCase.java:159) 
> 
>     at sun.reflect.NativeMethodAccessorImpl.invoke0(Native Method)
>     at 
> sun.reflect.NativeMethodAccessorImpl.invoke(NativeMethodAccessorImpl.java:39) 
> 
>     at 
> sun.reflect.DelegatingMethodAccessorImpl.invoke(DelegatingMethodAccessorImpl.java:25) 
> 
>     at java.lang.reflect.Method.invoke(Method.java:324)
>     at junit.framework.TestCase.runTest(TestCase.java:154)
>     at junit.framework.TestCase.runBare(TestCase.java:127)
>     at junit.framework.TestResult$1.protect(TestResult.java:106)
>     at junit.framework.TestResult.runProtected(TestResult.java:124)
>     at junit.framework.TestResult.run(TestResult.java:109)
>     at junit.framework.TestCase.run(TestCase.java:118)
>     at 
> org.apache.commons.logging.PathableTestSuite.runTest(PathableTestSuite.java:142) 
> 
>     at junit.framework.TestSuite.run(TestSuite.java:203)
>     at sun.reflect.GeneratedMethodAccessor4.invoke(Unknown Source)
>     at 
> sun.reflect.DelegatingMethodAccessorImpl.invoke(DelegatingMethodAccessorImpl.java:25) 
> 
>     at java.lang.reflect.Method.invoke(Method.java:324)
>     at 
> org.apache.maven.surefire.junit.JUnitTestSet.execute(JUnitTestSet.java:213)
>     at 
> org.apache.maven.surefire.suite.AbstractDirectoryTestSuite.executeTestSet(AbstractDirectoryTestSuite.java:138) 
> 
>     at 
> org.apache.maven.surefire.suite.AbstractDirectoryTestSuite.execute(AbstractDirectoryTestSuite.java:125) 
> 
>     at org.apache.maven.surefire.Surefire.run(Surefire.java:132)
>     at sun.reflect.NativeMethodAccessorImpl.invoke0(Native Method)
>     at 
> sun.reflect.NativeMethodAccessorImpl.invoke(NativeMethodAccessorImpl.java:39) 
> 
>     at 
> sun.reflect.DelegatingMethodAccessorImpl.invoke(DelegatingMethodAccessorImpl.java:25) 
> 
>     at java.lang.reflect.Method.invoke(Method.java:324)
>     at 
> org.apache.maven.surefire.booter.SurefireBooter.runSuitesInProcess(SurefireBooter.java:290) 
> 
>     at 
> org.apache.maven.surefire.booter.SurefireBooter.main(SurefireBooter.java:818) 
> 
> 
> Tests run: 6, Failures: 0, Errors: 0, Skipped: 0, Time elapsed: 0.175 sec
> Running org.apache.commons.logging.tccl.logfactory.TcclDisabledTestCase
> Tests run: 2, Failures: 0, Errors: 0, Skipped: 0, Time elapsed: 0.033 sec
> Running org.apache.commons.logging.tccl.BadTCCLTestCase
> Tests run: 1, Failures: 0, Errors: 0, Skipped: 0, Time elapsed: 0.007 sec
> Running org.apache.commons.logging.config.FirstPriorityConfigTestCase
> Tests run: 1, Failures: 0, Errors: 0, Skipped: 0, Time elapsed: 0.034 sec
> Running org.apache.commons.logging.pathable.ParentFirstTestCase
> Tests run: 4, Failures: 0, Errors: 0, Skipped: 0, Time elapsed: 0.018 sec
> Running org.apache.commons.logging.servlet.BasicServletTestCase
> Tests run: 1, Failures: 0, Errors: 0, Skipped: 0, Time elapsed: 0.05 sec
> 
> Results :
> 
> Failed tests: 
>  testExceptionMessages(org.apache.commons.logging.jdk14.CustomConfigAPITestCase) 
> 
>  testSerializable(org.apache.commons.logging.jdk14.CustomConfigAPITestCase)
>  testExceptionMessages(org.apache.commons.logging.jdk14.CustomConfigFullTestCase) 
> 
>  testSerializable(org.apache.commons.logging.jdk14.CustomConfigFullTestCase) 
> 
>  testExceptionMessages(org.apache.commons.logging.jdk14.CustomConfigTestCase) 
> 
>  testSerializable(org.apache.commons.logging.jdk14.CustomConfigTestCase)
> 
> Tests run: 88, Failures: 6, Errors: 0, Skipped: 0
> 
> [INFO] 
> ------------------------------------------------------------------------
> [ERROR] BUILD FAILURE
> [INFO] 
> ------------------------------------------------------------------------
> [INFO] There are test failures.
> [INFO] 
> ------------------------------------------------------------------------
> [INFO] For more information, run Maven with the -e switch
> [INFO] 
> ------------------------------------------------------------------------
> [INFO] Total time: 16 seconds
> [INFO] Finished at: Wed Aug 22 05:58:25 PDT 2007
> [INFO] Final Memory: 8M/17M
> [INFO] 
> ------------------------------------------------------------------------
> 
> **************************************************************************** 
> 
> 
> 
> 
> ---------------------------------------------------------------------
> To unsubscribe, e-mail: dev-unsubscribe@commons.apache.org
> For additional commands, e-mail: dev-help@commons.apache.org
> 
> 


-- 
Dennis Lundberg

---------------------------------------------------------------------
To unsubscribe, e-mail: dev-unsubscribe@commons.apache.org
For additional commands, e-mail: dev-help@commons.apache.org


Mime
View raw message