commons-dev mailing list archives

Site index · List index
Message view « Date » · « Thread »
Top « Date » · « Thread »
From "Continuum@vmbuild" <...@commons.apache.org>
Subject [continuum] BUILD FAILURE: Commons Configuration
Date Thu, 23 Aug 2007 14:35:18 GMT
Online report : http://vmbuild1.apache.org/continuum/buildResult.action?buildId=2234&projectId=161

Build statistics:
  State: Failed
  Previous State: Failed
  Started at: Thu 23 Aug 2007 07:34:39 -0700
  Finished at: Thu 23 Aug 2007 07:35:14 -0700
  Total time: 34s
  Build Trigger: Schedule
  Build Number: 0
  Exit code: 1
  Building machine hostname: vmbuild
  Operating system : Linux(unknown)
  Java Home version : 
          java version "1.4.2_15"
          Java(TM) 2 Runtime Environment, Standard Edition (build 1.4.2_15-b02)
          Java HotSpot(TM) Client VM (build 1.4.2_15-b02, mixed mode)
        
  Builder version :
          Maven version: 2.0.7
          Java version: 1.4.2_15
          OS name: "linux" version: "2.6.20-16-server" arch: "i386"
    
****************************************************************************
SCM Changes:
****************************************************************************
Changed: bayard @ Thu 23 Aug 2007 06:38:00 -0700
Comment: Changing name to 'Commons Xxx'
Files changed:
  /commons/proper/beanutils/trunk/pom.xml ( 568979 )
  /commons/proper/chain/trunk/pom.xml ( 568979 )
  /commons/proper/cli/trunk/pom.xml ( 568979 )
  /commons/proper/codec/trunk/pom.xml ( 568979 )
  /commons/proper/collections/trunk/pom.xml ( 568979 )
  /commons/proper/configuration/trunk/pom.xml ( 568979 )
  /commons/proper/dbcp/trunk/pom.xml ( 568979 )
  /commons/proper/dbutils/trunk/pom.xml ( 568979 )
  /commons/proper/digester/trunk/pom.xml ( 568979 )
  /commons/proper/el/trunk/pom.xml ( 568979 )
  /commons/proper/email/trunk/pom.xml ( 568979 )
  /commons/proper/fileupload/trunk/pom.xml ( 568979 )
  /commons/proper/io/trunk/pom.xml ( 568979 )
  /commons/proper/jci/trunk/pom.xml ( 568979 )
  /commons/proper/jxpath/trunk/pom.xml ( 568979 )
  /commons/proper/lang/trunk/pom.xml ( 568979 )
  /commons/proper/logging/trunk/pom.xml ( 568979 )
  /commons/proper/math/trunk/pom.xml ( 568979 )
  /commons/proper/pool/trunk/pom.xml ( 568979 )
  /commons/proper/scxml/trunk/pom.xml ( 568979 )
  /commons/proper/validator/trunk/pom.xml ( 568979 )
  /commons/proper/vfs/trunk/pom.xml ( 568979 )

****************************************************************************
Dependencies Changes:
****************************************************************************
No dependencies changed

****************************************************************************
Test Summary:
****************************************************************************
Tests: 1197
Failures: 55
Total time: 18096

****************************************************************************
Output:
****************************************************************************
[INFO] Scanning for projects...
[INFO] ----------------------------------------------------------------------------
[INFO] Building Commons Configuration
[INFO]    task-segment: [clean, install]
[INFO] ----------------------------------------------------------------------------
[INFO] [clean:clean]
[INFO] Deleting directory /home/continuum/data/working-directory/161/target
[INFO] Deleting directory /home/continuum/data/working-directory/161/target/classes
[INFO] Deleting directory /home/continuum/data/working-directory/161/target/test-classes
[INFO] Deleting directory /home/continuum/data/working-directory/161/target/site
[WARNING] While downloading xerces:xerces:2.2.1
  This artifact has been relocated to xerces:xercesImpl:2.2.1.


[WARNING] While downloading servletapi:servletapi:2.4
  This artifact has been relocated to javax.servlet:servlet-api:2.4.


[INFO] [antrun:run {execution: default}]
[INFO] Executing tasks
     [copy] Copying 2 files to /home/continuum/data/working-directory/161/target/classes/META-INF
[INFO] Executed tasks
[INFO] [resources:resources]
[INFO] Using default encoding to copy filtered resources.
[INFO] [compiler:compile]
[INFO] Compiling 91 source files to /home/continuum/data/working-directory/161/target/classes
[INFO] [resources:testResources]
[INFO] Using default encoding to copy filtered resources.
[INFO] [compiler:testCompile]
[INFO] Compiling 91 source files to /home/continuum/data/working-directory/161/target/test-classes
[INFO] [surefire:test]
[INFO] Surefire report directory: /home/continuum/data/working-directory/161/target/surefire-reports

-------------------------------------------------------
 T E S T S
-------------------------------------------------------
Running org.apache.commons.configuration.TestDatabaseConfiguration
log4j:WARN No appenders could be found for logger (org.apache.commons.configuration.test.HsqlDB).
log4j:WARN Please initialize the log4j system properly.
Tests run: 29, Failures: 0, Errors: 0, Skipped: 0, Time elapsed: 4.547 sec
Running org.apache.commons.configuration.TestPropertiesSequence
Tests run: 3, Failures: 0, Errors: 0, Skipped: 0, Time elapsed: 0.203 sec
Running org.apache.commons.configuration.plist.TestXMLPropertyListConfigurationEvents
Tests run: 10, Failures: 0, Errors: 0, Skipped: 0, Time elapsed: 0.152 sec
Running org.apache.commons.configuration.TestPropertyConverter
Tests run: 24, Failures: 0, Errors: 0, Skipped: 0, Time elapsed: 0.027 sec
Running org.apache.commons.configuration.tree.TestViewNode
Tests run: 8, Failures: 0, Errors: 0, Skipped: 0, Time elapsed: 0.008 sec
Running org.apache.commons.configuration.TestDataConfiguration
Tests run: 45, Failures: 0, Errors: 45, Skipped: 0, Time elapsed: 0.322 sec <<< FAILURE!
Running org.apache.commons.configuration.event.TestXMLConfigurationEvents
Tests run: 11, Failures: 0, Errors: 0, Skipped: 0, Time elapsed: 0.175 sec
Running org.apache.commons.configuration.TestCompositeConfigurationNonStringProperties
Tests run: 23, Failures: 0, Errors: 0, Skipped: 0, Time elapsed: 0.099 sec
Running org.apache.commons.configuration.plist.TestPropertyListParser
Tests run: 4, Failures: 0, Errors: 0, Skipped: 0, Time elapsed: 0.008 sec
Running org.apache.commons.configuration.beanutils.TestBeanHelper
Tests run: 19, Failures: 0, Errors: 0, Skipped: 0, Time elapsed: 0.032 sec
Running org.apache.commons.configuration.TestCompositeConfiguration
Tests run: 41, Failures: 0, Errors: 0, Skipped: 0, Time elapsed: 0.694 sec
Running org.apache.commons.configuration.TestThreesomeConfiguration
Tests run: 3, Failures: 0, Errors: 0, Skipped: 0, Time elapsed: 0.003 sec
Running org.apache.commons.configuration.TestConfigurationUtils
Tests run: 18, Failures: 0, Errors: 0, Skipped: 0, Time elapsed: 0.06 sec
Running org.apache.commons.configuration.TestEqualBehaviour
Tests run: 7, Failures: 0, Errors: 0, Skipped: 0, Time elapsed: 0.045 sec
Running org.apache.commons.configuration.tree.xpath.TestConfigurationNodePointer
Tests run: 7, Failures: 0, Errors: 0, Skipped: 0, Time elapsed: 0.161 sec
Running org.apache.commons.configuration.tree.TestUnionCombiner
Tests run: 6, Failures: 0, Errors: 0, Skipped: 0, Time elapsed: 0.07 sec
Running org.apache.commons.configuration.TestHierarchicalXMLConfiguration
Tests run: 9, Failures: 0, Errors: 0, Skipped: 0, Time elapsed: 0.105 sec
Running org.apache.commons.configuration.tree.xpath.TestConfigurationNodeIteratorChildren
Tests run: 11, Failures: 0, Errors: 0, Skipped: 0, Time elapsed: 0.082 sec
Running org.apache.commons.configuration.TestSystemConfiguration
Tests run: 1, Failures: 0, Errors: 0, Skipped: 0, Time elapsed: 0.001 sec
Running org.apache.commons.configuration.TestJNDIConfiguration
Tests run: 26, Failures: 0, Errors: 0, Skipped: 0, Time elapsed: 0.304 sec
Running org.apache.commons.configuration.web.TestServletRequestConfiguration
Tests run: 10, Failures: 0, Errors: 0, Skipped: 0, Time elapsed: 0.027 sec
Running org.apache.commons.configuration.web.TestServletFilterConfiguration
Tests run: 9, Failures: 0, Errors: 0, Skipped: 0, Time elapsed: 0.013 sec
Running org.apache.commons.configuration.web.TestAppletConfiguration
Tests run: 9, Failures: 0, Errors: 9, Skipped: 0, Time elapsed: 0.027 sec <<< FAILURE!
Running org.apache.commons.configuration.beanutils.TestConfigurationDynaBean
Tests run: 38, Failures: 0, Errors: 0, Skipped: 0, Time elapsed: 0.061 sec
Running org.apache.commons.configuration.event.TestPropertiesConfigurationEvents
Tests run: 11, Failures: 0, Errors: 0, Skipped: 0, Time elapsed: 0.24 sec
Running org.apache.commons.configuration.tree.TestDefaultExpressionEngine
Tests run: 19, Failures: 0, Errors: 0, Skipped: 0, Time elapsed: 0.016 sec
Running org.apache.commons.configuration.tree.xpath.TestXPathExpressionEngine
Tests run: 25, Failures: 0, Errors: 0, Skipped: 0, Time elapsed: 0.07 sec
Running org.apache.commons.configuration.TestAbstractConfigurationBasicFeatures
Tests run: 12, Failures: 0, Errors: 0, Skipped: 0, Time elapsed: 0.012 sec
Running org.apache.commons.configuration.event.TestHierarchicalConfigurationEvents
Tests run: 12, Failures: 0, Errors: 0, Skipped: 0, Time elapsed: 0.009 sec
Running org.apache.commons.configuration.TestJNDIEnvironmentValues
Tests run: 12, Failures: 0, Errors: 0, Skipped: 0, Time elapsed: 0.04 sec
Running org.apache.commons.configuration.TestXMLConfiguration
[Fatal Error] :1:39: The element type "test" must be terminated by the matching end-tag "</test>".
<?xml version="1.0" encoding="UTF-8"?>
<!DOCTYPE properties PUBLIC "-//Commons Configuration//DTD Test Configuration 1.3//EN"
"properties.dtd">
<properties version="1.0">
<entry key="test">value</entry>
</properties>

Tests run: 62, Failures: 0, Errors: 0, Skipped: 0, Time elapsed: 0.991 sec
Running org.apache.commons.configuration.TestNullJNDIEnvironmentValues
Tests run: 12, Failures: 0, Errors: 0, Skipped: 0, Time elapsed: 0.033 sec
Running org.apache.commons.configuration.TestBaseConfigurationXMLReader
Tests run: 4, Failures: 0, Errors: 0, Skipped: 0, Time elapsed: 0.034 sec
Running org.apache.commons.configuration.TestConfigurationConverter
Tests run: 5, Failures: 0, Errors: 0, Skipped: 0, Time elapsed: 0.017 sec
Running org.apache.commons.configuration.TestConfigurationSet
Tests run: 2, Failures: 0, Errors: 0, Skipped: 0, Time elapsed: 0.002 sec
Running org.apache.commons.configuration.beanutils.TestDefaultBeanFactory
Tests run: 2, Failures: 0, Errors: 0, Skipped: 0, Time elapsed: 0.003 sec
Running org.apache.commons.configuration.tree.xpath.TestConfigurationIteratorAttributes
Tests run: 4, Failures: 0, Errors: 0, Skipped: 0, Time elapsed: 0.033 sec
Running org.apache.commons.configuration.TestCombinedConfiguration
Tests run: 31, Failures: 0, Errors: 0, Skipped: 0, Time elapsed: 0.054 sec
Running org.apache.commons.configuration.TestConfigurationKey
Tests run: 11, Failures: 0, Errors: 0, Skipped: 0, Time elapsed: 0.007 sec
Running org.apache.commons.configuration.TestINIConfiguration
Tests run: 12, Failures: 0, Errors: 0, Skipped: 0, Time elapsed: 0.009 sec
Running org.apache.commons.configuration.TestFileConfiguration
Tests run: 21, Failures: 0, Errors: 0, Skipped: 0, Time elapsed: 0.783 sec
Running org.apache.commons.configuration.tree.TestDefaultConfigurationNode
Tests run: 23, Failures: 0, Errors: 0, Skipped: 0, Time elapsed: 0.026 sec
Running org.apache.commons.configuration.TestStrictConfigurationComparator
Tests run: 2, Failures: 0, Errors: 0, Skipped: 0, Time elapsed: 0.001 sec
Running org.apache.commons.configuration.tree.TestDefaultConfigurationKey
Tests run: 28, Failures: 0, Errors: 0, Skipped: 0, Time elapsed: 0.019 sec
Running org.apache.commons.configuration.event.TestEventSource
Tests run: 20, Failures: 0, Errors: 0, Skipped: 0, Time elapsed: 0.02 sec
Running org.apache.commons.configuration.event.TestMapConfigurationEvents
Tests run: 8, Failures: 0, Errors: 0, Skipped: 0, Time elapsed: 0.012 sec
Running org.apache.commons.configuration.tree.TestNodeAddData
Tests run: 3, Failures: 0, Errors: 0, Skipped: 0, Time elapsed: 0.002 sec
Running org.apache.commons.configuration.TestXMLPropertiesConfiguration
Tests run: 2, Failures: 0, Errors: 0, Skipped: 0, Time elapsed: 0.03 sec
Running org.apache.commons.configuration.plist.TestPropertyListConfiguration
Tests run: 17, Failures: 0, Errors: 0, Skipped: 0, Time elapsed: 0.075 sec
Running org.apache.commons.configuration.TestHierarchicalConfiguration
Tests run: 36, Failures: 0, Errors: 0, Skipped: 0, Time elapsed: 0.044 sec
Running org.apache.commons.configuration.reloading.TestFileChangedReloadingStrategy
Tests run: 5, Failures: 0, Errors: 0, Skipped: 0, Time elapsed: 6.214 sec
Running org.apache.commons.configuration.TestMapConfiguration
Tests run: 12, Failures: 0, Errors: 0, Skipped: 0, Time elapsed: 0.009 sec
Running org.apache.commons.configuration.TestConfigurationFactory
Tests run: 15, Failures: 0, Errors: 0, Skipped: 0, Time elapsed: 0.465 sec
Running org.apache.commons.configuration.plist.TestPropertyListConfigurationEvents
Tests run: 10, Failures: 0, Errors: 0, Skipped: 0, Time elapsed: 0.029 sec
Running org.apache.commons.configuration.reloading.TestManagedReloadingStrategy
Tests run: 1, Failures: 0, Errors: 0, Skipped: 0, Time elapsed: 0.004 sec
Running org.apache.commons.configuration.TestBaseConfiguration
Tests run: 32, Failures: 0, Errors: 1, Skipped: 0, Time elapsed: 0.033 sec <<< FAILURE!
Running org.apache.commons.configuration.TestSubnodeConfiguration
Tests run: 21, Failures: 0, Errors: 0, Skipped: 0, Time elapsed: 0.12 sec
Running org.apache.commons.configuration.TestConfigurationMap
Tests run: 1, Failures: 0, Errors: 0, Skipped: 0, Time elapsed: 0.001 sec
Running org.apache.commons.configuration.TestSubsetConfiguration
Tests run: 17, Failures: 0, Errors: 0, Skipped: 0, Time elapsed: 0.021 sec
Running org.apache.commons.configuration.TestPropertiesConfigurationLayout
Tests run: 34, Failures: 0, Errors: 0, Skipped: 0, Time elapsed: 0.021 sec
Running org.apache.commons.configuration.tree.xpath.TestConfigurationNodePointerFactory
Tests run: 7, Failures: 0, Errors: 0, Skipped: 0, Time elapsed: 0.105 sec
Running org.apache.commons.configuration.tree.TestOverrideCombiner
Tests run: 8, Failures: 0, Errors: 0, Skipped: 0, Time elapsed: 0.059 sec
Running org.apache.commons.configuration.interpol.TestConstantLookup
Tests run: 7, Failures: 0, Errors: 0, Skipped: 0, Time elapsed: 0.004 sec
Running org.apache.commons.configuration.TestBaseNullConfiguration
Tests run: 18, Failures: 0, Errors: 0, Skipped: 0, Time elapsed: 0.01 sec
Running org.apache.commons.configuration.TestNonStringProperties
Tests run: 23, Failures: 0, Errors: 0, Skipped: 0, Time elapsed: 0.049 sec
Running org.apache.commons.configuration.TestHierarchicalConfigurationXMLReader
Tests run: 1, Failures: 0, Errors: 0, Skipped: 0, Time elapsed: 0.015 sec
Running org.apache.commons.configuration.beanutils.TestXMLBeanDeclaration
Tests run: 19, Failures: 0, Errors: 0, Skipped: 0, Time elapsed: 0.017 sec
Running org.apache.commons.configuration.TestNullCompositeConfiguration
java.lang.String -> value1
java.lang.String -> value2
java.lang.String -> value5
Tests run: 23, Failures: 0, Errors: 0, Skipped: 0, Time elapsed: 0.459 sec
Running org.apache.commons.configuration.TestDefaultConfigurationBuilder
Tests run: 30, Failures: 0, Errors: 0, Skipped: 0, Time elapsed: 0.261 sec
Running org.apache.commons.configuration.plist.TestXMLPropertyListConfiguration
Tests run: 14, Failures: 0, Errors: 0, Skipped: 0, Time elapsed: 0.108 sec
Running org.apache.commons.configuration.web.TestServletContextConfiguration
Tests run: 9, Failures: 0, Errors: 0, Skipped: 0, Time elapsed: 0.014 sec
Running org.apache.commons.configuration.TestEqualsProperty
Tests run: 1, Failures: 0, Errors: 0, Skipped: 0, Time elapsed: 0.002 sec
Running org.apache.commons.configuration.beanutils.TestConfigurationDynaBeanXMLConfig
Tests run: 38, Failures: 0, Errors: 0, Skipped: 0, Time elapsed: 0.051 sec
Running org.apache.commons.configuration.web.TestServletConfiguration
Tests run: 9, Failures: 0, Errors: 0, Skipped: 0, Time elapsed: 0.009 sec
Running org.apache.commons.configuration.TestPropertiesConfiguration
Tests run: 53, Failures: 0, Errors: 0, Skipped: 0, Time elapsed: 0.169 sec
Running org.apache.commons.configuration.interpol.TestConfigurationInterpolator
Tests run: 22, Failures: 0, Errors: 0, Skipped: 0, Time elapsed: 0.022 sec

Results :

Tests in error: 
  testGetConfiguration(org.apache.commons.configuration.TestDataConfiguration)
  testIsEmpty(org.apache.commons.configuration.TestDataConfiguration)
  testContainsKey(org.apache.commons.configuration.TestDataConfiguration)
  testGetKeys(org.apache.commons.configuration.TestDataConfiguration)
  testGet(org.apache.commons.configuration.TestDataConfiguration)
  testGetArray(org.apache.commons.configuration.TestDataConfiguration)
  testGetPrimitiveArray(org.apache.commons.configuration.TestDataConfiguration)
  testGetBooleanArray(org.apache.commons.configuration.TestDataConfiguration)
  testGetBooleanList(org.apache.commons.configuration.TestDataConfiguration)
  testGetByteArray(org.apache.commons.configuration.TestDataConfiguration)
  testGetByteList(org.apache.commons.configuration.TestDataConfiguration)
  testGetShortArray(org.apache.commons.configuration.TestDataConfiguration)
  testGetShortList(org.apache.commons.configuration.TestDataConfiguration)
  testGetIntegerArray(org.apache.commons.configuration.TestDataConfiguration)
  testGetIntegerList(org.apache.commons.configuration.TestDataConfiguration)
  testGetLongArray(org.apache.commons.configuration.TestDataConfiguration)
  testGetLongList(org.apache.commons.configuration.TestDataConfiguration)
  testGetFloatArray(org.apache.commons.configuration.TestDataConfiguration)
  testGetFloatList(org.apache.commons.configuration.TestDataConfiguration)
  testGetDoubleArray(org.apache.commons.configuration.TestDataConfiguration)
  testGetDoubleList(org.apache.commons.configuration.TestDataConfiguration)
  testGetBigIntegerArray(org.apache.commons.configuration.TestDataConfiguration)
  testGetBigIntegerList(org.apache.commons.configuration.TestDataConfiguration)
  testGetBigDecimalArray(org.apache.commons.configuration.TestDataConfiguration)
  testGetBigDecimalList(org.apache.commons.configuration.TestDataConfiguration)
  testGetURL(org.apache.commons.configuration.TestDataConfiguration)
  testGetURLArray(org.apache.commons.configuration.TestDataConfiguration)
  testGetURLList(org.apache.commons.configuration.TestDataConfiguration)
  testGetLocale(org.apache.commons.configuration.TestDataConfiguration)
  testGetLocaleArray(org.apache.commons.configuration.TestDataConfiguration)
  testGetLocaleList(org.apache.commons.configuration.TestDataConfiguration)
  testGetColor(org.apache.commons.configuration.TestDataConfiguration)
  testGetColorArray(org.apache.commons.configuration.TestDataConfiguration)
  testGetColorList(org.apache.commons.configuration.TestDataConfiguration)
  testGetDate(org.apache.commons.configuration.TestDataConfiguration)
  testGetDateArray(org.apache.commons.configuration.TestDataConfiguration)
  testGetDateArrayWithFormat(org.apache.commons.configuration.TestDataConfiguration)
  testGetDateList(org.apache.commons.configuration.TestDataConfiguration)
  testGetCalendar(org.apache.commons.configuration.TestDataConfiguration)
  testGetCalendarArray(org.apache.commons.configuration.TestDataConfiguration)
  testGetCalendarArrayWithFormat(org.apache.commons.configuration.TestDataConfiguration)
  testGetCalendarList(org.apache.commons.configuration.TestDataConfiguration)
  testGetInetAddress(org.apache.commons.configuration.TestDataConfiguration)
  testGetInternetAddress(org.apache.commons.configuration.TestDataConfiguration)
  testConversionException(org.apache.commons.configuration.TestDataConfiguration)
  testAddPropertyDirect(org.apache.commons.configuration.web.TestAppletConfiguration)
  testClearProperty(org.apache.commons.configuration.web.TestAppletConfiguration)
  testIsEmpty(org.apache.commons.configuration.web.TestAppletConfiguration)
  testContainsKey(org.apache.commons.configuration.web.TestAppletConfiguration)
  testGetKeys(org.apache.commons.configuration.web.TestAppletConfiguration)
  testGetProperty(org.apache.commons.configuration.web.TestAppletConfiguration)
  testList(org.apache.commons.configuration.web.TestAppletConfiguration)
  testListEscaped(org.apache.commons.configuration.web.TestAppletConfiguration)
  testSetLogger(org.apache.commons.configuration.web.TestAppletConfiguration)
  testInterpolationConstants(org.apache.commons.configuration.TestBaseConfiguration)

Tests run: 1197, Failures: 0, Errors: 55, Skipped: 0

[INFO] ------------------------------------------------------------------------
[ERROR] BUILD FAILURE
[INFO] ------------------------------------------------------------------------
[INFO] There are test failures.
[INFO] ------------------------------------------------------------------------
[INFO] For more information, run Maven with the -e switch
[INFO] ------------------------------------------------------------------------
[INFO] Total time: 31 seconds
[INFO] Finished at: Thu Aug 23 07:35:14 PDT 2007
[INFO] Final Memory: 11M/31M
[INFO] ------------------------------------------------------------------------

****************************************************************************



---------------------------------------------------------------------
To unsubscribe, e-mail: dev-unsubscribe@commons.apache.org
For additional commands, e-mail: dev-help@commons.apache.org


Mime
View raw message