commons-dev mailing list archives

Site index · List index
Message view « Date » · « Thread »
Top « Date » · « Thread »
From "Continuum@vmbuild" <...@commons.apache.org>
Subject [continuum] BUILD FAILURE: Commons Compress (Sandbox)
Date Thu, 30 Aug 2007 15:43:29 GMT
Online report : http://vmbuild.apache.org/continuum/buildResult.action?buildId=2981&projectId=176

Build statistics:
  State: Failed
  Previous State: Failed
  Started at: Thu 30 Aug 2007 08:43:04 -0700
  Finished at: Thu 30 Aug 2007 08:43:25 -0700
  Total time: 20s
  Build Trigger: Forced
  Build Number: 0
  Exit code: 1
  Building machine hostname: vmbuild
  Operating system : Linux(unknown)
  Java Home version : 
          java version "1.4.2_15"
          Java(TM) 2 Runtime Environment, Standard Edition (build 1.4.2_15-b02)
          Java HotSpot(TM) Client VM (build 1.4.2_15-b02, mixed mode)
        
  Builder version :
          Maven version: 2.0.7
          Java version: 1.4.2_15
          OS name: "linux" version: "2.6.20-16-server" arch: "i386"
    
****************************************************************************
SCM Changes:
****************************************************************************
No files changed

****************************************************************************
Dependencies Changes:
****************************************************************************
org.apache.commons:commons-sandbox-parent:3-SNAPSHOT

****************************************************************************
Test Summary:
****************************************************************************
Tests: 26
Failures: 3
Total time: 7942

****************************************************************************
Output:
****************************************************************************
[INFO] Scanning for projects...
[INFO] ----------------------------------------------------------------------------
[INFO] Building Commons Compress (Sandbox)
[INFO]    task-segment: [clean, install, deploy]
[INFO] ----------------------------------------------------------------------------
[INFO] [clean:clean]
[INFO] Deleting directory /home/continuum/data/working-directory/176/target
[INFO] Deleting directory /home/continuum/data/working-directory/176/target/classes
[INFO] Deleting directory /home/continuum/data/working-directory/176/target/test-classes
[INFO] Deleting directory /home/continuum/data/working-directory/176/target/site
[INFO] [cobertura:clean {execution: default}]
[INFO] [resources:resources]
[INFO] Using default encoding to copy filtered resources.
[INFO] [compiler:compile]
[INFO] Compiling 34 source files to /home/continuum/data/working-directory/176/target/classes
[INFO] [resources:testResources]
[INFO] Using default encoding to copy filtered resources.
[INFO] [compiler:testCompile]
[INFO] Compiling 9 source files to /home/continuum/data/working-directory/176/target/test-classes
[INFO] [surefire:test]
[INFO] Surefire report directory: /home/continuum/data/working-directory/176/target/surefire-reports

-------------------------------------------------------
 T E S T S
-------------------------------------------------------
Running org.apache.commons.compress.archivers.tar.TarTestCase
count = 134
ch2 = 51
ch = 49
Tests run: 4, Failures: 3, Errors: 0, Skipped: 0, Time elapsed: 0.115 sec <<< FAILURE!
Running org.apache.commons.compress.archivers.zip.AsiExtraFieldTestCase
Tests run: 7, Failures: 0, Errors: 0, Skipped: 0, Time elapsed: 0.004 sec
Running org.apache.commons.compress.archivers.zip.ExtraFieldUtilsTestCase
Tests run: 2, Failures: 0, Errors: 0, Skipped: 0, Time elapsed: 0.011 sec
Running org.apache.commons.compress.archivers.zip.ZipEntryTestCase
Tests run: 1, Failures: 0, Errors: 0, Skipped: 0, Time elapsed: 0.022 sec
Running org.apache.commons.compress.compressors.bzip2.BzipTestCase
Tests run: 3, Failures: 0, Errors: 0, Skipped: 0, Time elapsed: 7.841 sec
Running org.apache.commons.compress.CompressUtilsTest
Tests run: 1, Failures: 0, Errors: 0, Skipped: 0, Time elapsed: 0.004 sec
Running org.apache.commons.compress.archivers.zip.ZipLongTestCase
Tests run: 4, Failures: 0, Errors: 0, Skipped: 0, Time elapsed: 0.008 sec
Running org.apache.commons.compress.archivers.zip.ZipShortTestCase
Tests run: 4, Failures: 0, Errors: 0, Skipped: 0, Time elapsed: 0.007 sec

Results :

Failed tests: 
  testReadPosixTar(org.apache.commons.compress.archivers.tar.TarTestCase)
  testReadGnuTar(org.apache.commons.compress.archivers.tar.TarTestCase)
  testWritePosixTar(org.apache.commons.compress.archivers.tar.TarTestCase)

Tests run: 26, Failures: 3, Errors: 0, Skipped: 0

[INFO] ------------------------------------------------------------------------
[ERROR] BUILD FAILURE
[INFO] ------------------------------------------------------------------------
[INFO] There are test failures.
[INFO] ------------------------------------------------------------------------
[INFO] For more information, run Maven with the -e switch
[INFO] ------------------------------------------------------------------------
[INFO] Total time: 17 seconds
[INFO] Finished at: Thu Aug 30 08:43:25 PDT 2007
[INFO] Final Memory: 6M/15M
[INFO] ------------------------------------------------------------------------

****************************************************************************



---------------------------------------------------------------------
To unsubscribe, e-mail: dev-unsubscribe@commons.apache.org
For additional commands, e-mail: dev-help@commons.apache.org


Mime
View raw message