commons-dev mailing list archives

Site index · List index
Message view « Date » · « Thread »
Top « Date » · « Thread »
From "Continuum@vmbuild" <...@commons.apache.org>
Subject [continuum] BUILD FAILURE: Commons JS2J (Sandbox)
Date Thu, 23 Aug 2007 14:42:31 GMT
Online report : http://vmbuild1.apache.org/continuum/buildResult.action?buildId=2246&projectId=183

Build statistics:
  State: Failed
  Previous State: Failed
  Started at: Thu 23 Aug 2007 07:42:22 -0700
  Finished at: Thu 23 Aug 2007 07:42:28 -0700
  Total time: 6s
  Build Trigger: Schedule
  Build Number: 0
  Exit code: 1
  Building machine hostname: vmbuild
  Operating system : Linux(unknown)
  Java Home version : 
          java version "1.4.2_15"
          Java(TM) 2 Runtime Environment, Standard Edition (build 1.4.2_15-b02)
          Java HotSpot(TM) Client VM (build 1.4.2_15-b02, mixed mode)
        
  Builder version :
          Maven version: 2.0.7
          Java version: 1.4.2_15
          OS name: "linux" version: "2.6.20-16-server" arch: "i386"
    
****************************************************************************
SCM Changes:
****************************************************************************
Changed: bayard @ Thu 23 Aug 2007 06:37:40 -0700
Comment: Changing name to 'Commons Xxx (Sandbox)'
Files changed:
  /commons/sandbox/compress/trunk/pom.xml ( 568978 )
  /commons/sandbox/csv/trunk/pom.xml ( 568978 )
  /commons/sandbox/exec/trunk/pom.xml ( 568978 )
  /commons/sandbox/finder/trunk/pom.xml ( 568978 )
  /commons/sandbox/i18n/trunk/pom.xml ( 568978 )
  /commons/sandbox/id/trunk/pom.xml ( 568978 )
  /commons/sandbox/javaflow/trunk/pom.xml ( 568978 )
  /commons/sandbox/js2j/trunk/pom.xml ( 568978 )
  /commons/sandbox/openpgp/trunk/pom.xml ( 568978 )
  /commons/sandbox/performance/trunk/pom.xml ( 568978 )
  /commons/sandbox/pipeline/trunk/pom.xml ( 568978 )
  /commons/sandbox/proxy/trunk/pom.xml ( 568978 )

****************************************************************************
Dependencies Changes:
****************************************************************************
No dependencies changed

****************************************************************************
Test Summary:
****************************************************************************
Tests: 0
Failures: 0
Total time: 0

****************************************************************************
Output:
****************************************************************************
[INFO] Scanning for projects...
[INFO] ----------------------------------------------------------------------------
[INFO] Building Commons JS2J (Sandbox)
[INFO]    task-segment: [clean, install]
[INFO] ----------------------------------------------------------------------------
[INFO] [clean:clean]
[INFO] Deleting directory /home/continuum/data/working-directory/183/target
[INFO] Deleting directory /home/continuum/data/working-directory/183/target/classes
[INFO] Deleting directory /home/continuum/data/working-directory/183/target/test-classes
[INFO] Deleting directory /home/continuum/data/working-directory/183/target/site
[INFO] [resources:resources]
[INFO] Using default encoding to copy filtered resources.
[INFO] [compiler:compile]
[INFO] Compiling 12 source files to /home/continuum/data/working-directory/183/target/classes
[INFO] ------------------------------------------------------------------------
[ERROR] BUILD FAILURE
[INFO] ------------------------------------------------------------------------
[INFO] Compilation failure
/home/continuum/data/working-directory/183/src/main/java/org/apache/commons/js2j/ScriptableList.java:[98,28]
cannot resolve symbol
symbol  : method valueOf (int)
location: class java.lang.Integer



/home/continuum/data/working-directory/183/src/main/java/org/apache/commons/js2j/ScriptableList.java:[98,28]
cannot resolve symbol
symbol  : method valueOf (int)
location: class java.lang.Integer


[INFO] ------------------------------------------------------------------------
[INFO] For more information, run Maven with the -e switch
[INFO] ------------------------------------------------------------------------
[INFO] Total time: 3 seconds
[INFO] Finished at: Thu Aug 23 07:42:28 PDT 2007
[INFO] Final Memory: 5M/9M
[INFO] ------------------------------------------------------------------------

****************************************************************************



---------------------------------------------------------------------
To unsubscribe, e-mail: dev-unsubscribe@commons.apache.org
For additional commands, e-mail: dev-help@commons.apache.org


Mime
View raw message