commons-dev mailing list archives

Site index · List index
Message view « Date » · « Thread »
Top « Date » · « Thread »
From "Phil Steitz" <phil.ste...@gmail.com>
Subject Re: [VOTE] Release Validator 1.3.0 based on RC2
Date Mon, 20 Mar 2006 03:47:48 GMT
> On 3/19/06, Niall Pemberton <niall.pemberton@gmail.com> wrote:
> On 3/18/06, Phil Steitz <phil.steitz@gmail.com> wrote:
> > The maven build fails for me on RH FC2, both Sun JDK 1.5.0_06 and
> > 1.4.2_10 with the same failures attached below.  Could be my local
> > setup or some undocumented config dependencies (I tried to config the
> > javadoc thingy mentioned in maven.xml, but still see the same
> > failures).  I get the same failures with Ant, once build properties
> > are set.
>
> The stack traces are misleading - they're from an "exception test"
> that actually passes. The problem seems to be that
> CurrencyValidatorTest has failed for you. Could you post the output
> for that test please?

Here is what I get, with either of the JDKs above and either maven
(1.0.2) or Ant (1.6.5).  Could be this is a problem with my local
setup?   Some of the errors in the report above seemed to be referring
to localization setup...?

Testsuite: org.apache.commons.validator.routines.CurrencyValidatorTest
Tests run: 6, Failures: 3, Errors: 0, Time elapsed: 0.02 sec

Testcase: testPattern(org.apache.commons.validator.routines.CurrencyValidatorTest):	FAILED
default expected:<1234.567> but was:<null>
junit.framework.AssertionFailedError: default expected:<1234.567> but was:<null>
	at org.apache.commons.validator.routines.CurrencyValidatorTest.testPattern(CurrencyValidatorTest.java:181)
	at sun.reflect.NativeMethodAccessorImpl.invoke0(Native Method)
	at sun.reflect.NativeMethodAccessorImpl.invoke(NativeMethodAccessorImpl.java:39)
	at sun.reflect.DelegatingMethodAccessorImpl.invoke(DelegatingMethodAccessorImpl.java:25)
	at org.apache.commons.jelly.tags.ant.AntTag.doTag(AntTag.java:185)
	at org.apache.commons.jelly.impl.TagScript.run(TagScript.java:279)
	at org.apache.commons.jelly.impl.ScriptBlock.run(ScriptBlock.java:135)
	at org.apache.commons.jelly.TagSupport.invokeBody(TagSupport.java:233)
	at org.apache.commons.jelly.tags.core.IfTag.doTag(IfTag.java:88)
	at org.apache.commons.jelly.impl.TagScript.run(TagScript.java:279)
	at org.apache.commons.jelly.impl.ScriptBlock.run(ScriptBlock.java:135)
	at org.apache.maven.jelly.tags.werkz.MavenGoalTag.runBodyTag(MavenGoalTag.java:79)
	at org.apache.maven.jelly.tags.werkz.MavenGoalTag$MavenGoalAction.performAction(MavenGoalTag.java:110)
	at com.werken.werkz.Goal.fire(Goal.java:639)
	at com.werken.werkz.Goal.attain(Goal.java:575)
	at com.werken.werkz.Goal.attainPrecursors(Goal.java:488)
	at com.werken.werkz.Goal.attain(Goal.java:573)
	at org.apache.maven.plugin.PluginManager.attainGoals(PluginManager.java:671)
	at org.apache.maven.MavenSession.attainGoals(MavenSession.java:263)
	at org.apache.maven.cli.App.doMain(App.java:488)
	at org.apache.maven.cli.App.main(App.java:1239)
	at sun.reflect.NativeMethodAccessorImpl.invoke0(Native Method)
	at sun.reflect.NativeMethodAccessorImpl.invoke(NativeMethodAccessorImpl.java:39)
	at sun.reflect.DelegatingMethodAccessorImpl.invoke(DelegatingMethodAccessorImpl.java:25)
	at com.werken.forehead.Forehead.run(Forehead.java:551)
	at com.werken.forehead.Forehead.main(Forehead.java:581)


Testcase: testValid(org.apache.commons.validator.routines.CurrencyValidatorTest):	FAILED
Default locale expected:<1234.56> but was:<null>
junit.framework.AssertionFailedError: Default locale
expected:<1234.56> but was:<null>
	at org.apache.commons.validator.routines.CurrencyValidatorTest.testValid(CurrencyValidatorTest.java:85)
	at sun.reflect.NativeMethodAccessorImpl.invoke0(Native Method)
	at sun.reflect.NativeMethodAccessorImpl.invoke(NativeMethodAccessorImpl.java:39)
	at sun.reflect.DelegatingMethodAccessorImpl.invoke(DelegatingMethodAccessorImpl.java:25)
	at org.apache.commons.jelly.tags.ant.AntTag.doTag(AntTag.java:185)
	at org.apache.commons.jelly.impl.TagScript.run(TagScript.java:279)
	at org.apache.commons.jelly.impl.ScriptBlock.run(ScriptBlock.java:135)
	at org.apache.commons.jelly.TagSupport.invokeBody(TagSupport.java:233)
	at org.apache.commons.jelly.tags.core.IfTag.doTag(IfTag.java:88)
	at org.apache.commons.jelly.impl.TagScript.run(TagScript.java:279)
	at org.apache.commons.jelly.impl.ScriptBlock.run(ScriptBlock.java:135)
	at org.apache.maven.jelly.tags.werkz.MavenGoalTag.runBodyTag(MavenGoalTag.java:79)
	at org.apache.maven.jelly.tags.werkz.MavenGoalTag$MavenGoalAction.performAction(MavenGoalTag.java:110)
	at com.werken.werkz.Goal.fire(Goal.java:639)
	at com.werken.werkz.Goal.attain(Goal.java:575)
	at com.werken.werkz.Goal.attainPrecursors(Goal.java:488)
	at com.werken.werkz.Goal.attain(Goal.java:573)
	at org.apache.maven.plugin.PluginManager.attainGoals(PluginManager.java:671)
	at org.apache.maven.MavenSession.attainGoals(MavenSession.java:263)
	at org.apache.maven.cli.App.doMain(App.java:488)
	at org.apache.maven.cli.App.main(App.java:1239)
	at sun.reflect.NativeMethodAccessorImpl.invoke0(Native Method)
	at sun.reflect.NativeMethodAccessorImpl.invoke(NativeMethodAccessorImpl.java:39)
	at sun.reflect.DelegatingMethodAccessorImpl.invoke(DelegatingMethodAccessorImpl.java:25)
	at com.werken.forehead.Forehead.run(Forehead.java:551)
	at com.werken.forehead.Forehead.main(Forehead.java:581)


Testcase: testIntegerValid(org.apache.commons.validator.routines.CurrencyValidatorTest):	FAILED
Default locale expected:<1234.00> but was:<null>
junit.framework.AssertionFailedError: Default locale
expected:<1234.00> but was:<null>
	at org.apache.commons.validator.routines.CurrencyValidatorTest.testIntegerValid(CurrencyValidatorTest.java:138)
	at sun.reflect.NativeMethodAccessorImpl.invoke0(Native Method)
	at sun.reflect.NativeMethodAccessorImpl.invoke(NativeMethodAccessorImpl.java:39)
	at sun.reflect.DelegatingMethodAccessorImpl.invoke(DelegatingMethodAccessorImpl.java:25)
	at org.apache.commons.jelly.tags.ant.AntTag.doTag(AntTag.java:185)
	at org.apache.commons.jelly.impl.TagScript.run(TagScript.java:279)
	at org.apache.commons.jelly.impl.ScriptBlock.run(ScriptBlock.java:135)
	at org.apache.commons.jelly.TagSupport.invokeBody(TagSupport.java:233)
	at org.apache.commons.jelly.tags.core.IfTag.doTag(IfTag.java:88)
	at org.apache.commons.jelly.impl.TagScript.run(TagScript.java:279)
	at org.apache.commons.jelly.impl.ScriptBlock.run(ScriptBlock.java:135)
	at org.apache.maven.jelly.tags.werkz.MavenGoalTag.runBodyTag(MavenGoalTag.java:79)
	at org.apache.maven.jelly.tags.werkz.MavenGoalTag$MavenGoalAction.performAction(MavenGoalTag.java:110)
	at com.werken.werkz.Goal.fire(Goal.java:639)
	at com.werken.werkz.Goal.attain(Goal.java:575)
	at com.werken.werkz.Goal.attainPrecursors(Goal.java:488)
	at com.werken.werkz.Goal.attain(Goal.java:573)
	at org.apache.maven.plugin.PluginManager.attainGoals(PluginManager.java:671)
	at org.apache.maven.MavenSession.attainGoals(MavenSession.java:263)
	at org.apache.maven.cli.App.doMain(App.java:488)
	at org.apache.maven.cli.App.main(App.java:1239)
	at sun.reflect.NativeMethodAccessorImpl.invoke0(Native Method)
	at sun.reflect.NativeMethodAccessorImpl.invoke(NativeMethodAccessorImpl.java:39)
	at sun.reflect.DelegatingMethodAccessorImpl.invoke(DelegatingMethodAccessorImpl.java:25)
	at com.werken.forehead.Forehead.run(Forehead.java:551)
	at com.werken.forehead.Forehead.main(Forehead.java:581)

---------------------------------------------------------------------
To unsubscribe, e-mail: commons-dev-unsubscribe@jakarta.apache.org
For additional commands, e-mail: commons-dev-help@jakarta.apache.org


Mime
View raw message