commons-dev mailing list archives

Site index · List index
Message view « Date » · « Thread »
Top « Date » · « Thread »
From Fernando Nasser <fnas...@redhat.com>
Subject Re: [GUMP@brutus]: Project commons-jelly-tags-xml (in module commons-jelly) failed
Date Thu, 28 Apr 2005 12:28:19 GMT
Hi,

Where are the people who know about Jelly's tags-xml?  I need to get in 
touch with someone who is still around.  If someone can suggest a name I 
can try and get in touch with that person.

These org.apache.commons.jelly.tags.xml.TestJelly test have been failing 
for quite a while.

When running the tests with my RC1 build I have al them but one passing. 
  The one that fails seem to be related to some classloader problem. 
But what scares me is that it is an 'invokeStatic' tag failure and Maven 
uses it.

In any case, I've filed a bug for that.

Regards to all,
Fernando


commons-jelly-tags-xml development wrote:
> To whom it may engage...
>         
> This is an automated request, but not an unsolicited one. For 
> more information please visit http://gump.apache.org/nagged.html, 
> and/or contact the folk at general@gump.apache.org.
> 
> Project commons-jelly-tags-xml has an issue affecting its community integration.
> This issue affects 12 projects,
>  and has been outstanding for 3 runs.
> The current state of this project is 'Failed', with reason 'Build Failed'.
> For reference only, the following projects are affected by this:
>     - commons-jelly-tags-define :  Commons Jelly
>     - commons-jelly-tags-html :  Commons Jelly
>     - commons-jelly-tags-http :  Commons Jelly
>     - commons-jelly-tags-jaxme :  Commons Jelly
>     - commons-jelly-tags-jetty :  Commons Jelly
>     - commons-jelly-tags-jface :  Commons Jelly
>     - commons-jelly-tags-jsl :  Commons Jelly
>     - commons-jelly-tags-swing :  Commons Jelly
>     - commons-jelly-tags-xml :  Commons Jelly
>     - commons-jelly-tags-xmlunit :  Commons Jelly
>     - maven :  Project Management Tools
>     - maven-bootstrap :  Project Management Tools
> 
> 
> Full details are available at:
>     http://brutus.apache.org/gump/public/commons-jelly/commons-jelly-tags-xml/index.html
> 
> That said, some information snippets are provided here.
> 
> The following annotations (debug/informational/warning/error messages) were provided:
>  -DEBUG- Sole output [commons-jelly-tags-xml-28042005.jar] identifier set to project
name
>  -DEBUG- Dependency on xml-xerces exists, no need to add for property maven.jar.xerces.
>  -DEBUG- (Gump generated) Maven Properties in: /usr/local/gump/public/workspace/commons-jelly/jelly-tags/xml/build.properties
>  -INFO- Failed with reason build failed
>  -DEBUG- Maven POM in: /usr/local/gump/public/workspace/commons-jelly/jelly-tags/xml/project.xml
>  -DEBUG- Maven project properties in: /usr/local/gump/public/workspace/commons-jelly/jelly-tags/xml/project.properties
>  -INFO- Project Reports in: /usr/local/gump/public/workspace/commons-jelly/jelly-tags/xml/target/test-reports
>  -INFO- Failed to extract fallback artifacts from Gump Repository
> 
> 
> 
> The following work was performed:
> http://brutus.apache.org/gump/public/commons-jelly/commons-jelly-tags-xml/gump_work/build_commons-jelly_commons-jelly-tags-xml.html
> Work Name: build_commons-jelly_commons-jelly-tags-xml (Type: Build)
> Work ended in a state of : Failed
> Elapsed: 16 secs
> Command Line: maven --offline jar 
> [Working Directory: /usr/local/gump/public/workspace/commons-jelly/jelly-tags/xml]
> CLASSPATH: /opt/jdk1.4/lib/tools.jar:/usr/local/gump/public/workspace/jakarta-commons/beanutils/dist/commons-beanutils-core.jar:/usr/local/gump/public/workspace/jakarta-commons/collections/build/commons-collections-28042005.jar:/usr/local/gump/public/workspace/commons-jelly/target/commons-jelly-28042005.jar:/usr/local/gump/public/workspace/commons-jelly/jelly-tags/junit/target/commons-jelly-tags-junit-28042005.jar:/usr/local/gump/public/workspace/jakarta-commons/jexl/dist/commons-jexl-28042005.jar:/usr/local/gump/public/workspace/jakarta-commons/logging/dist/commons-logging.jar:/usr/local/gump/public/workspace/jakarta-commons/logging/dist/commons-logging-api.jar:/usr/local/gump/public/workspace/dom4j/build/dom4j.jar:/usr/local/gump/public/workspace/jaxen/target/jaxen-28042005.jar
> ---------------------------------------------
>     [mkdir] Created dir: /home/gump/workspaces2/public/workspace/commons-jelly/jelly-tags/xml/target/classes
> 
> java:compile:
>     [echo] Compiling to /home/gump/workspaces2/public/workspace/commons-jelly/jelly-tags/xml/target/classes
>     [echo] 
> ==========================================================
> 
>   NOTE: Targetting JVM 1.4, classes
>   will not run on earlier JVMs
> 
> ==========================================================
>           
>     [javac] Compiling 16 source files to /home/gump/workspaces2/public/workspace/commons-jelly/jelly-tags/xml/target/classes
> 
> java:jar-resources:
> 
> test:prepare-filesystem:
>     [mkdir] Created dir: /home/gump/workspaces2/public/workspace/commons-jelly/jelly-tags/xml/target/test-classes
>     [mkdir] Created dir: /home/gump/workspaces2/public/workspace/commons-jelly/jelly-tags/xml/target/test-reports
> 
> test:test-resources:
> Copying 36 files to /home/gump/workspaces2/public/workspace/commons-jelly/jelly-tags/xml/target/test-classes
> 
> test:compile:
>     [javac] Compiling 4 source files to /home/gump/workspaces2/public/workspace/commons-jelly/jelly-tags/xml/target/test-classes
> 
> test:test:
>     [junit] Running org.apache.commons.jelly.tags.xml.TestImport
>     [junit] Tests run: 3, Failures: 0, Errors: 0, Time elapsed: 1.119 sec
>     [junit] Running org.apache.commons.jelly.tags.xml.TestJelly
>     [junit] <foo>some text
>     [junit]     exists = true, readable = true, class=java.io.File
>     [junit]     
>     [junit]   Tests run: 15, Failures: 0, Errors: 13, Time elapsed: 0.69 sec
>     [junit] [ERROR] TEST org.apache.commons.jelly.tags.xml.TestJelly FAILED
>     [junit] Running org.apache.commons.jelly.tags.xml.TestParser
>     [junit] Tests run: 1, Failures: 0, Errors: 0, Time elapsed: 0.705 sec
>     [junit] Running org.apache.commons.jelly.tags.xml.TestXMLTags
>     [junit] Tests run: 12, Failures: 1, Errors: 9, Time elapsed: 2.114 sec
>     [junit] [ERROR] TEST org.apache.commons.jelly.tags.xml.TestXMLTags FAILED
> 
> BUILD FAILED
> File...... /home/gump/.maven/cache/maven-test-plugin-1.6.2/plugin.jelly
> Element... fail
> Line...... 181
> Column.... 54
> There were test failures.
> Total time: 16 seconds
> Finished at: Thu Apr 28 02:45:40 PDT 2005
> 
> ---------------------------------------------
> 
> To subscribe to this information via syndicated feeds:
> - RSS: http://brutus.apache.org/gump/public/commons-jelly/commons-jelly-tags-xml/rss.xml
> - Atom: http://brutus.apache.org/gump/public/commons-jelly/commons-jelly-tags-xml/atom.xml
> 
> ============================== Gump Tracking Only ===
> Produced by Gump version 2.2.
> Gump Run 27000028042005, brutus:brutus-public:27000028042005
> Gump E-mail Identifier (unique within run) #24.
> 
> --
> Apache Gump
> http://gump.apache.org/ [Instance: brutus]
> 
> ---------------------------------------------------------------------
> To unsubscribe, e-mail: commons-dev-unsubscribe@jakarta.apache.org
> For additional commands, e-mail: commons-dev-help@jakarta.apache.org
> 
> 

-- 
Fernando Nasser
Red Hat Canada Ltd.                     E-Mail:  fnasser@redhat.com
2323 Yonge Street, Suite #300
Toronto, Ontario   M4P 2C9

---------------------------------------------------------------------
To unsubscribe, e-mail: commons-dev-unsubscribe@jakarta.apache.org
For additional commands, e-mail: commons-dev-help@jakarta.apache.org


Mime
View raw message