commons-dev mailing list archives

Site index · List index
Message view « Date » · « Thread »
Top « Date » · « Thread »
From James Strachan <jstrac...@apache.org>
Subject [GUMP] Build Failure - commons-betwixt
Date Tue, 29 Apr 2003 11:54:54 GMT
----------------------------------------------------
This email is autogenerated from the output from:
<http://cvs.apache.org/builds/gump/2003-04-29/commons-betwixt.html>
----------------------------------------------------

Buildfile: build.xml

init:
    [mkdir] Created dir: /home/rubys/jakarta/jakarta-commons/betwixt/lib

get-deps:

compile:
    [mkdir] Created dir: /home/rubys/jakarta/jakarta-commons/betwixt/target/classes
    [javac] Compiling 51 source files to /home/rubys/jakarta/jakarta-commons/betwixt/target/classes
    [javac] /home/rubys/jakarta/jakarta-commons/betwixt/src/java/org/apache/commons/betwixt/digester/AddDefaultsRule.java:102:
warning: begin(org.xml.sax.Attributes) in org.apache.commons.digester.Rule has been deprecated
    [javac]     public void begin(Attributes attributes) throws Exception {
    [javac]                 ^
    [javac] /home/rubys/jakarta/jakarta-commons/betwixt/src/java/org/apache/commons/betwixt/digester/AttributeRule.java:102:
warning: begin(org.xml.sax.Attributes) in org.apache.commons.digester.Rule has been deprecated
    [javac]     public void begin(Attributes attributes) throws SAXException {
    [javac]                 ^
    [javac] /home/rubys/jakarta/jakarta-commons/betwixt/src/java/org/apache/commons/betwixt/digester/AttributeRule.java:147:
warning: end() in org.apache.commons.digester.Rule has been deprecated
    [javac]     public void end() {
    [javac]                 ^
    [javac] /home/rubys/jakarta/jakarta-commons/betwixt/src/java/org/apache/commons/betwixt/digester/ElementRule.java:107:
warning: begin(org.xml.sax.Attributes) in org.apache.commons.digester.Rule has been deprecated
    [javac]     public void begin(Attributes attributes) throws SAXException {
    [javac]                 ^
    [javac] /home/rubys/jakarta/jakarta-commons/betwixt/src/java/org/apache/commons/betwixt/digester/ElementRule.java:177:
warning: end() in org.apache.commons.digester.Rule has been deprecated
    [javac]     public void end() {
    [javac]                 ^
    [javac] /home/rubys/jakarta/jakarta-commons/betwixt/src/java/org/apache/commons/betwixt/digester/HideRule.java:94:
warning: begin(org.xml.sax.Attributes) in org.apache.commons.digester.Rule has been deprecated
    [javac]     public void begin(Attributes attributes) throws SAXException {
    [javac]                 ^
    [javac] /home/rubys/jakarta/jakarta-commons/betwixt/src/java/org/apache/commons/betwixt/digester/HideRule.java:108:
warning: end() in org.apache.commons.digester.Rule has been deprecated
    [javac]     public void end() {
    [javac]                 ^
    [javac] /home/rubys/jakarta/jakarta-commons/betwixt/src/java/org/apache/commons/betwixt/digester/InfoRule.java:95:
warning: begin(org.xml.sax.Attributes) in org.apache.commons.digester.Rule has been deprecated
    [javac]     public void begin(Attributes attributes) throws SAXException {
    [javac]                 ^
    [javac] /home/rubys/jakarta/jakarta-commons/betwixt/src/java/org/apache/commons/betwixt/digester/InfoRule.java:122:
warning: end() in org.apache.commons.digester.Rule has been deprecated
    [javac]     public void end() {
    [javac]                 ^
    [javac] /home/rubys/jakarta/jakarta-commons/betwixt/src/java/org/apache/commons/betwixt/digester/TextRule.java:106:
warning: begin(org.xml.sax.Attributes) in org.apache.commons.digester.Rule has been deprecated
    [javac]     public void begin(Attributes attributes) throws SAXException {
    [javac]                 ^
    [javac] /home/rubys/jakarta/jakarta-commons/betwixt/src/java/org/apache/commons/betwixt/io/BeanCreateRule.java:250:
warning: begin(org.xml.sax.Attributes) in org.apache.commons.digester.Rule has been deprecated
    [javac]     public void begin(Attributes attributes) {
    [javac]                 ^
    [javac] /home/rubys/jakarta/jakarta-commons/betwixt/src/java/org/apache/commons/betwixt/io/BeanCreateRule.java:342:
warning: end() in org.apache.commons.digester.Rule has been deprecated
    [javac]     public void end() {
    [javac]                 ^
    [javac] /home/rubys/jakarta/jakarta-commons/betwixt/src/java/org/apache/commons/betwixt/io/BeanCreateRule.java:621:
warning: body(java.lang.String) in org.apache.commons.digester.Rule has been deprecated
    [javac]             public void body(String text) throws Exception {
    [javac]                         ^
    [javac] /home/rubys/jakarta/jakarta-commons/betwixt/src/java/org/apache/commons/betwixt/io/BeanRuleSet.java:381:
warning: body(java.lang.String) in org.apache.commons.digester.Rule has been deprecated
    [javac]                 public void body(String text) throws Exception {
    [javac]                             ^
    [javac] /home/rubys/jakarta/jakarta-commons/betwixt/src/java/org/apache/commons/betwixt/io/BeanRuleSet.java:546:
warning: begin(org.xml.sax.Attributes) in org.apache.commons.digester.Rule has been deprecated
    [javac]             public void begin(Attributes attributes) {
    [javac]                         ^
    [javac] /home/rubys/jakarta/jakarta-commons/betwixt/src/java/org/apache/commons/betwixt/io/BeanRuleSet.java:640:
warning: end() in org.apache.commons.digester.Rule has been deprecated
    [javac]             public void end() {
    [javac]                         ^
    [javac] 16 warnings
     [copy] Copying 10 files to /home/rubys/jakarta/jakarta-commons/betwixt/target/test-classes

compile-tests:
    [javac] Compiling 75 source files to /home/rubys/jakarta/jakarta-commons/betwixt/target/test-classes
    [javac] /home/rubys/jakarta/jakarta-commons/betwixt/src/test/org/apache/commons/betwixt/TestBeanReader.java:473:
warning: begin(org.xml.sax.Attributes) in org.apache.commons.digester.Rule has been deprecated
    [javac]         public void begin(Attributes attributes) {
    [javac]                     ^
    [javac] 1 warning

internal-test:
    [mkdir] Created dir: /home/rubys/jakarta/jakarta-commons/betwixt/target/test-reports
    [junit] Running org.apache.commons.betwixt.nowrap.TestNoWrap
    [junit] Tests run: 2, Failures: 1, Errors: 0, Time elapsed: 42 sec
    [junit] TEST org.apache.commons.betwixt.nowrap.TestNoWrap FAILED
    [junit] Running org.apache.commons.betwixt.scarab.TestScarabSettings
    [junit] Tests run: 2, Failures: 1, Errors: 0, Time elapsed: 41.358 sec
    [junit] TEST org.apache.commons.betwixt.scarab.TestScarabSettings FAILED
    [junit] Running org.apache.commons.betwixt.schema.TestSchema
    [junit] Tests run: 3, Failures: 1, Errors: 0, Time elapsed: 41.454 sec
    [junit] TEST org.apache.commons.betwixt.schema.TestSchema FAILED
    [junit] Running org.apache.commons.betwixt.strategy.TestCapitalizeNameMapper
    [junit] Tests run: 1, Failures: 0, Errors: 0, Time elapsed: 0.53 sec
    [junit] Running org.apache.commons.betwixt.strategy.TestDecapitalizeNameMapper
    [junit] Tests run: 1, Failures: 0, Errors: 0, Time elapsed: 0.53 sec
    [junit] Running org.apache.commons.betwixt.strategy.TestDefaultNameMapper
    [junit] Tests run: 1, Failures: 0, Errors: 0, Time elapsed: 0.556 sec
    [junit] Running org.apache.commons.betwixt.strategy.TestDefaultPluralStemmer
    [junit] Tests run: 8, Failures: 0, Errors: 0, Time elapsed: 0.713 sec
    [junit] Running org.apache.commons.betwixt.strategy.TestHyphenatedNameMapper
    [junit] Tests run: 5, Failures: 0, Errors: 0, Time elapsed: 0.702 sec
    [junit] Running org.apache.commons.betwixt.strategy.alt.TestElementsAlt
    [junit] Tests run: 4, Failures: 0, Errors: 0, Time elapsed: 1.228 sec
    [junit] Running org.apache.commons.betwixt.strategy.TestElementsIO
    [junit] Tests run: 4, Failures: 0, Errors: 0, Time elapsed: 1.052 sec
    [junit] Running org.apache.commons.betwixt.TestXMLBeanInfoDigester
    [junit] Tests run: 2, Failures: 1, Errors: 0, Time elapsed: 41.109 sec
    [junit] TEST org.apache.commons.betwixt.TestXMLBeanInfoDigester FAILED
    [junit] Running org.apache.commons.betwixt.TestBeanReader
    [junit] Tests run: 8, Failures: 1, Errors: 0, Time elapsed: 41.509 sec
    [junit] TEST org.apache.commons.betwixt.TestBeanReader FAILED
    [junit] Running org.apache.commons.betwixt.TestBeanWriter
    [junit] Tests run: 10, Failures: 1, Errors: 0, Time elapsed: 41.688 sec
    [junit] TEST org.apache.commons.betwixt.TestBeanWriter FAILED
    [junit] Running org.apache.commons.betwixt.TestRSSRoundTrip
    [junit] Tests run: 4, Failures: 1, Errors: 0, Time elapsed: 41.646 sec
    [junit] TEST org.apache.commons.betwixt.TestRSSRoundTrip FAILED
    [junit] Running org.apache.commons.betwixt.recursion.TestRecursion
    [junit] Tests run: 6, Failures: 1, Errors: 0, Time elapsed: 41.352 sec
    [junit] TEST org.apache.commons.betwixt.recursion.TestRecursion FAILED
    [junit] Running org.apache.commons.betwixt.dotbetwixt.TestBeanToXml
    [junit] Tests run: 6, Failures: 1, Errors: 0, Time elapsed: 41.358 sec
    [junit] TEST org.apache.commons.betwixt.dotbetwixt.TestBeanToXml FAILED
    [junit] Running org.apache.commons.betwixt.dotbetwixt.TestXmlToBean
    [junit] Tests run: 2, Failures: 1, Errors: 0, Time elapsed: 41.38 sec
    [junit] TEST org.apache.commons.betwixt.dotbetwixt.TestXmlToBean FAILED
    [junit] Running org.apache.commons.betwixt.introspection.TestXMLIntrospector
    [junit] Tests run: 3, Failures: 1, Errors: 0, Time elapsed: 41.29 sec
    [junit] TEST org.apache.commons.betwixt.introspection.TestXMLIntrospector FAILED
    [junit] Running org.apache.commons.betwixt.digester.TestXMLIntrospectorHelper
    [junit] Tests run: 1, Failures: 0, Errors: 0, Time elapsed: 0.682 sec
    [junit] Running org.apache.commons.betwixt.digester.TestIDRead
    [junit] Tests run: 3, Failures: 1, Errors: 0, Time elapsed: 41.298 sec
    [junit] TEST org.apache.commons.betwixt.digester.TestIDRead FAILED
    [junit] Running org.apache.commons.betwixt.io.TestSAXBeanWriter
    [junit] Tests run: 3, Failures: 0, Errors: 0, Time elapsed: 1.021 sec
    [junit] Running org.apache.commons.betwixt.registry.TestXMLBeanInfoRegistry
    [junit] Tests run: 3, Failures: 1, Errors: 0, Time elapsed: 40.846 sec
    [junit] TEST org.apache.commons.betwixt.registry.TestXMLBeanInfoRegistry FAILED
    [junit] Running org.apache.commons.betwixt.derived.TestDerived
    [junit] Tests run: 2, Failures: 1, Errors: 0, Time elapsed: 41.201 sec
    [junit] TEST org.apache.commons.betwixt.derived.TestDerived FAILED
    [junit] Running org.apache.commons.betwixt.expression.TestUpdaters
    [junit] Tests run: 2, Failures: 1, Errors: 0, Time elapsed: 40.989 sec
    [junit] TEST org.apache.commons.betwixt.expression.TestUpdaters FAILED
    [junit] Running org.apache.commons.betwixt.TestXMLUtils
    [junit] Tests run: 2, Failures: 1, Errors: 0, Time elapsed: 40.922 sec
    [junit] TEST org.apache.commons.betwixt.TestXMLUtils FAILED

test:

BUILD FAILED
/home/rubys/jakarta/jakarta-commons/betwixt/build.xml:87: There were test failures.

Total time: 11 minutes 32 seconds

---------------------------------------------------------------------
To unsubscribe, e-mail: commons-dev-unsubscribe@jakarta.apache.org
For additional commands, e-mail: commons-dev-help@jakarta.apache.org


Mime
View raw message