commons-dev mailing list archives

Site index · List index
Message view « Date » · « Thread »
Top « Date » · « Thread »
From "J. Matthew Pryor" <matthew_pr...@versata.com>
Subject XPath name() function broken in CVS ?
Date Tue, 12 Nov 2002 19:40:31 GMT
Hi

This worked fine with beta-7

<x:copyOf trim="false" select="$feature/feature/*[name() !=
'requires']"/>

But now with beta-8 CVS build (as of 10 minutes ago) I get the
following:

update-version:

[ERROR] BUILD FAILED
[ERROR] Function :name
Total time:  2 seconds

The XPath expression is OK isn't it?

Did I do something incorrectly?

Debug log is attached...

Thanks,
Matthew
------------------------------------------------------------
j. matthew pryor <matthew_pryor@versata.com>
versata, inc. <www.versata.com>
 


Mime
View raw message