commons-commits mailing list archives

Site index · List index
Message view « Date » · « Thread »
Top « Date » · « Thread »
From er...@apache.org
Subject [06/14] commons-complex git commit: Removed spurious files.
Date Fri, 06 Jan 2017 15:21:43 GMT
http://git-wip-us.apache.org/repos/asf/commons-complex/blob/5529f0cd/target/surefire-reports/TEST-org.apache.commons.complex.RetryRunnerTest.xml
----------------------------------------------------------------------
diff --git a/target/surefire-reports/TEST-org.apache.commons.complex.RetryRunnerTest.xml b/target/surefire-reports/TEST-org.apache.commons.complex.RetryRunnerTest.xml
deleted file mode 100644
index 7354fff..0000000
--- a/target/surefire-reports/TEST-org.apache.commons.complex.RetryRunnerTest.xml
+++ /dev/null
@@ -1,63 +0,0 @@
-<?xml version="1.0" encoding="UTF-8"?>
-<testsuite name="org.apache.commons.complex.RetryRunnerTest" time="0.004" tests="2" errors="0"
skipped="0" failures="0">
-  <properties>
-    <property name="java.runtime.name" value="OpenJDK Runtime Environment"/>
-    <property name="sun.boot.library.path" value="/usr/lib/jvm/java-8-openjdk-amd64/jre/lib/amd64"/>
-    <property name="java.vm.version" value="25.111-b14"/>
-    <property name="java.vm.vendor" value="Oracle Corporation"/>
-    <property name="maven.multiModuleProjectDirectory" value="/home/ericbarnhill/Documents/code/commons-complex"/>
-    <property name="java.vendor.url" value="http://java.oracle.com/"/>
-    <property name="path.separator" value=":"/>
-    <property name="guice.disable.misplaced.annotation.check" value="true"/>
-    <property name="java.vm.name" value="OpenJDK 64-Bit Server VM"/>
-    <property name="file.encoding.pkg" value="sun.io"/>
-    <property name="user.country" value="US"/>
-    <property name="sun.java.launcher" value="SUN_STANDARD"/>
-    <property name="sun.os.patch.level" value="unknown"/>
-    <property name="java.vm.specification.name" value="Java Virtual Machine Specification"/>
-    <property name="user.dir" value="/home/ericbarnhill/Documents/code/commons-complex"/>
-    <property name="java.runtime.version" value="1.8.0_111-8u111-b14-2ubuntu0.16.04.2-b14"/>
-    <property name="java.awt.graphicsenv" value="sun.awt.X11GraphicsEnvironment"/>
-    <property name="java.endorsed.dirs" value="/usr/lib/jvm/java-8-openjdk-amd64/jre/lib/endorsed"/>
-    <property name="os.arch" value="amd64"/>
-    <property name="java.io.tmpdir" value="/tmp"/>
-    <property name="line.separator" value="&#10;"/>
-    <property name="java.vm.specification.vendor" value="Oracle Corporation"/>
-    <property name="os.name" value="Linux"/>
-    <property name="classworlds.conf" value="/usr/share/maven/bin/m2.conf"/>
-    <property name="sun.jnu.encoding" value="UTF-8"/>
-    <property name="java.library.path" value="/home/ericbarnhill/Documents/code//Halide_source/bin:/usr/local/cuda-7.0/lib64:/home/ericbarnhill/Documents/code//itk_build/lib:/usr/lib/x86_64-linux-gnu/:/home/ericbarnhill/Documents/code/caffe-master/matlab/+caffe/private/:/usr/java/packages/lib/amd64:/usr/lib/x86_64-linux-gnu/jni:/lib/x86_64-linux-gnu:/usr/lib/x86_64-linux-gnu:/usr/lib/jni:/lib:/usr/lib"/>
-    <property name="java.specification.name" value="Java Platform API Specification"/>
-    <property name="java.class.version" value="52.0"/>
-    <property name="sun.management.compiler" value="HotSpot 64-Bit Tiered Compilers"/>
-    <property name="os.version" value="4.4.0-53-generic"/>
-    <property name="user.home" value="/home/ericbarnhill"/>
-    <property name="user.timezone" value="Europe/Berlin"/>
-    <property name="java.awt.printerjob" value="sun.print.PSPrinterJob"/>
-    <property name="file.encoding" value="UTF-8"/>
-    <property name="java.specification.version" value="1.8"/>
-    <property name="user.name" value="ericbarnhill"/>
-    <property name="java.class.path" value="/usr/share/maven/boot/plexus-classworlds-2.x.jar"/>
-    <property name="java.vm.specification.version" value="1.8"/>
-    <property name="sun.arch.data.model" value="64"/>
-    <property name="java.home" value="/usr/lib/jvm/java-8-openjdk-amd64/jre"/>
-    <property name="sun.java.command" value="org.codehaus.plexus.classworlds.launcher.Launcher
test"/>
-    <property name="java.specification.vendor" value="Oracle Corporation"/>
-    <property name="user.language" value="en"/>
-    <property name="awt.toolkit" value="sun.awt.X11.XToolkit"/>
-    <property name="java.vm.info" value="mixed mode"/>
-    <property name="java.version" value="1.8.0_111"/>
-    <property name="java.ext.dirs" value="/usr/lib/jvm/java-8-openjdk-amd64/jre/lib/ext:/usr/java/packages/lib/ext"/>
-    <property name="securerandom.source" value="file:/dev/./urandom"/>
-    <property name="sun.boot.class.path" value="/usr/lib/jvm/java-8-openjdk-amd64/jre/lib/resources.jar:/usr/lib/jvm/java-8-openjdk-amd64/jre/lib/rt.jar:/usr/lib/jvm/java-8-openjdk-amd64/jre/lib/sunrsasign.jar:/usr/lib/jvm/java-8-openjdk-amd64/jre/lib/jsse.jar:/usr/lib/jvm/java-8-openjdk-amd64/jre/lib/jce.jar:/usr/lib/jvm/java-8-openjdk-amd64/jre/lib/charsets.jar:/usr/lib/jvm/java-8-openjdk-amd64/jre/lib/jfr.jar:/usr/lib/jvm/java-8-openjdk-amd64/jre/classes"/>
-    <property name="java.vendor" value="Oracle Corporation"/>
-    <property name="maven.home" value="/usr/share/maven"/>
-    <property name="file.separator" value="/"/>
-    <property name="java.vendor.url.bug" value="http://bugreport.sun.com/bugreport/"/>
-    <property name="sun.cpu.endian" value="little"/>
-    <property name="sun.io.unicode.encoding" value="UnicodeLittle"/>
-    <property name="sun.cpu.isalist" value=""/>
-  </properties>
-  <testcase name="testRetryFailSometimes" classname="org.apache.commons.complex.RetryRunnerTest"
time="0.001"/>
-  <testcase name="testRetryFailAlways" classname="org.apache.commons.complex.RetryRunnerTest"
time="0.003"/>
-</testsuite>
\ No newline at end of file

http://git-wip-us.apache.org/repos/asf/commons-complex/blob/5529f0cd/target/surefire-reports/TEST-org.apache.commons.complex.RootsOfUnityTest.xml
----------------------------------------------------------------------
diff --git a/target/surefire-reports/TEST-org.apache.commons.complex.RootsOfUnityTest.xml
b/target/surefire-reports/TEST-org.apache.commons.complex.RootsOfUnityTest.xml
deleted file mode 100644
index dd47572..0000000
--- a/target/surefire-reports/TEST-org.apache.commons.complex.RootsOfUnityTest.xml
+++ /dev/null
@@ -1,82 +0,0 @@
-<?xml version="1.0" encoding="UTF-8"?>
-<testsuite name="org.apache.commons.complex.RootsOfUnityTest" time="0" tests="6" errors="3"
skipped="0" failures="0">
-  <properties>
-    <property name="java.runtime.name" value="OpenJDK Runtime Environment"/>
-    <property name="sun.boot.library.path" value="/usr/lib/jvm/java-8-openjdk-amd64/jre/lib/amd64"/>
-    <property name="java.vm.version" value="25.111-b14"/>
-    <property name="java.vm.vendor" value="Oracle Corporation"/>
-    <property name="maven.multiModuleProjectDirectory" value="/home/ericbarnhill/Documents/code/commons-complex"/>
-    <property name="java.vendor.url" value="http://java.oracle.com/"/>
-    <property name="path.separator" value=":"/>
-    <property name="guice.disable.misplaced.annotation.check" value="true"/>
-    <property name="java.vm.name" value="OpenJDK 64-Bit Server VM"/>
-    <property name="file.encoding.pkg" value="sun.io"/>
-    <property name="user.country" value="US"/>
-    <property name="sun.java.launcher" value="SUN_STANDARD"/>
-    <property name="sun.os.patch.level" value="unknown"/>
-    <property name="java.vm.specification.name" value="Java Virtual Machine Specification"/>
-    <property name="user.dir" value="/home/ericbarnhill/Documents/code/commons-complex"/>
-    <property name="java.runtime.version" value="1.8.0_111-8u111-b14-2ubuntu0.16.04.2-b14"/>
-    <property name="java.awt.graphicsenv" value="sun.awt.X11GraphicsEnvironment"/>
-    <property name="java.endorsed.dirs" value="/usr/lib/jvm/java-8-openjdk-amd64/jre/lib/endorsed"/>
-    <property name="os.arch" value="amd64"/>
-    <property name="java.io.tmpdir" value="/tmp"/>
-    <property name="line.separator" value="&#10;"/>
-    <property name="java.vm.specification.vendor" value="Oracle Corporation"/>
-    <property name="os.name" value="Linux"/>
-    <property name="classworlds.conf" value="/usr/share/maven/bin/m2.conf"/>
-    <property name="sun.jnu.encoding" value="UTF-8"/>
-    <property name="java.library.path" value="/home/ericbarnhill/Documents/code//Halide_source/bin:/usr/local/cuda-7.0/lib64:/home/ericbarnhill/Documents/code//itk_build/lib:/usr/lib/x86_64-linux-gnu/:/home/ericbarnhill/Documents/code/caffe-master/matlab/+caffe/private/:/usr/java/packages/lib/amd64:/usr/lib/x86_64-linux-gnu/jni:/lib/x86_64-linux-gnu:/usr/lib/x86_64-linux-gnu:/usr/lib/jni:/lib:/usr/lib"/>
-    <property name="java.specification.name" value="Java Platform API Specification"/>
-    <property name="java.class.version" value="52.0"/>
-    <property name="sun.management.compiler" value="HotSpot 64-Bit Tiered Compilers"/>
-    <property name="os.version" value="4.4.0-53-generic"/>
-    <property name="user.home" value="/home/ericbarnhill"/>
-    <property name="user.timezone" value="Europe/Berlin"/>
-    <property name="java.awt.printerjob" value="sun.print.PSPrinterJob"/>
-    <property name="file.encoding" value="UTF-8"/>
-    <property name="java.specification.version" value="1.8"/>
-    <property name="user.name" value="ericbarnhill"/>
-    <property name="java.class.path" value="/usr/share/maven/boot/plexus-classworlds-2.x.jar"/>
-    <property name="java.vm.specification.version" value="1.8"/>
-    <property name="sun.arch.data.model" value="64"/>
-    <property name="java.home" value="/usr/lib/jvm/java-8-openjdk-amd64/jre"/>
-    <property name="sun.java.command" value="org.codehaus.plexus.classworlds.launcher.Launcher
test"/>
-    <property name="java.specification.vendor" value="Oracle Corporation"/>
-    <property name="user.language" value="en"/>
-    <property name="awt.toolkit" value="sun.awt.X11.XToolkit"/>
-    <property name="java.vm.info" value="mixed mode"/>
-    <property name="java.version" value="1.8.0_111"/>
-    <property name="java.ext.dirs" value="/usr/lib/jvm/java-8-openjdk-amd64/jre/lib/ext:/usr/java/packages/lib/ext"/>
-    <property name="securerandom.source" value="file:/dev/./urandom"/>
-    <property name="sun.boot.class.path" value="/usr/lib/jvm/java-8-openjdk-amd64/jre/lib/resources.jar:/usr/lib/jvm/java-8-openjdk-amd64/jre/lib/rt.jar:/usr/lib/jvm/java-8-openjdk-amd64/jre/lib/sunrsasign.jar:/usr/lib/jvm/java-8-openjdk-amd64/jre/lib/jsse.jar:/usr/lib/jvm/java-8-openjdk-amd64/jre/lib/jce.jar:/usr/lib/jvm/java-8-openjdk-amd64/jre/lib/charsets.jar:/usr/lib/jvm/java-8-openjdk-amd64/jre/lib/jfr.jar:/usr/lib/jvm/java-8-openjdk-amd64/jre/classes"/>
-    <property name="java.vendor" value="Oracle Corporation"/>
-    <property name="maven.home" value="/usr/share/maven"/>
-    <property name="file.separator" value="/"/>
-    <property name="java.vendor.url.bug" value="http://bugreport.sun.com/bugreport/"/>
-    <property name="sun.cpu.endian" value="little"/>
-    <property name="sun.io.unicode.encoding" value="UnicodeLittle"/>
-    <property name="sun.cpu.isalist" value=""/>
-  </properties>
-  <testcase name="testZeroNumberOfRoots" classname="org.apache.commons.complex.RootsOfUnityTest"
time="0"/>
-  <testcase name="testComputeRoots" classname="org.apache.commons.complex.RootsOfUnityTest"
time="0"/>
-  <testcase name="testMathIllegalState1" classname="org.apache.commons.complex.RootsOfUnityTest"
time="0">
-    <error message="Unexpected exception, expected&lt;java.lang.IllegalStateException&gt;
but was&lt;java.lang.IllegalArgumentException&gt;" type="java.lang.Exception"><![CDATA[java.lang.Exception:
Unexpected exception, expected<java.lang.IllegalStateException> but was<java.lang.IllegalArgumentException>
-	at org.apache.commons.complex.RootsOfUnity.getReal(RootsOfUnity.java:159)
-	at org.apache.commons.complex.RootsOfUnityTest.testMathIllegalState1(RootsOfUnityTest.java:33)
-]]></error>
-  </testcase>
-  <testcase name="testMathIllegalState2" classname="org.apache.commons.complex.RootsOfUnityTest"
time="0">
-    <error message="Unexpected exception, expected&lt;java.lang.IllegalStateException&gt;
but was&lt;java.lang.IllegalArgumentException&gt;" type="java.lang.Exception"><![CDATA[java.lang.Exception:
Unexpected exception, expected<java.lang.IllegalStateException> but was<java.lang.IllegalArgumentException>
-	at org.apache.commons.complex.RootsOfUnity.getImaginary(RootsOfUnity.java:180)
-	at org.apache.commons.complex.RootsOfUnityTest.testMathIllegalState2(RootsOfUnityTest.java:39)
-]]></error>
-  </testcase>
-  <testcase name="testMathIllegalState3" classname="org.apache.commons.complex.RootsOfUnityTest"
time="0">
-    <error message="Unexpected exception, expected&lt;java.lang.IllegalStateException&gt;
but was&lt;java.lang.IllegalArgumentException&gt;" type="java.lang.Exception"><![CDATA[java.lang.Exception:
Unexpected exception, expected<java.lang.IllegalStateException> but was<java.lang.IllegalArgumentException>
-	at org.apache.commons.complex.RootsOfUnity.isCounterClockWise(RootsOfUnity.java:88)
-	at org.apache.commons.complex.RootsOfUnityTest.testMathIllegalState3(RootsOfUnityTest.java:45)
-]]></error>
-  </testcase>
-  <testcase name="testGetNumberOfRoots" classname="org.apache.commons.complex.RootsOfUnityTest"
time="0"/>
-</testsuite>
\ No newline at end of file

http://git-wip-us.apache.org/repos/asf/commons-complex/blob/5529f0cd/target/surefire-reports/org.apache.commons.complex.ComplexFormatTest.txt
----------------------------------------------------------------------
diff --git a/target/surefire-reports/org.apache.commons.complex.ComplexFormatTest.txt b/target/surefire-reports/org.apache.commons.complex.ComplexFormatTest.txt
deleted file mode 100644
index 6410a38..0000000
--- a/target/surefire-reports/org.apache.commons.complex.ComplexFormatTest.txt
+++ /dev/null
@@ -1,4 +0,0 @@
--------------------------------------------------------------------------------
-Test set: org.apache.commons.complex.ComplexFormatTest
--------------------------------------------------------------------------------
-Tests run: 31, Failures: 0, Errors: 0, Skipped: 0, Time elapsed: 0.003 sec - in org.apache.commons.complex.ComplexFormatTest


Mime
View raw message