commons-commits mailing list archives

Site index · List index
Message view « Date » · « Thread »
Top « Date » · « Thread »
From Apache Jenkins Server <jenk...@builds.apache.org>
Subject Build failed in Jenkins: Commons Math #464
Date Tue, 19 Apr 2016 00:16:40 GMT
See <https://builds.apache.org/job/Commons%20Math/464/changes>

Changes:

[sebb] Standard Maven directory layout

------------------------------------------
[...truncated 1205 lines...]
Tests run: 6, Failures: 0, Errors: 0, Skipped: 0, Time elapsed: 0.145 sec - in org.apache.commons.math4.ode.nonstiff.AdamsMoultonFieldIntegratorTest
Running org.apache.commons.math4.ode.nonstiff.GillStepInterpolatorTest
Tests run: 2, Failures: 0, Errors: 0, Skipped: 0, Time elapsed: 0.025 sec - in org.apache.commons.math4.ode.nonstiff.GillStepInterpolatorTest
Running org.apache.commons.math4.ode.nonstiff.HighamHall54FieldStepInterpolatorTest
Tests run: 3, Failures: 0, Errors: 0, Skipped: 0, Time elapsed: 0.001 sec - in org.apache.commons.math4.ode.nonstiff.HighamHall54FieldStepInterpolatorTest
Running org.apache.commons.math4.ode.nonstiff.EulerIntegratorTest
Tests run: 6, Failures: 0, Errors: 0, Skipped: 0, Time elapsed: 0.016 sec - in org.apache.commons.math4.ode.nonstiff.EulerIntegratorTest
Running org.apache.commons.math4.ode.nonstiff.AdamsMoultonIntegratorTest
Tests run: 6, Failures: 0, Errors: 0, Skipped: 0, Time elapsed: 0.071 sec - in org.apache.commons.math4.ode.nonstiff.AdamsMoultonIntegratorTest
Running org.apache.commons.math4.ode.FieldExpandableODETest
Tests run: 8, Failures: 0, Errors: 0, Skipped: 0, Time elapsed: 0.004 sec - in org.apache.commons.math4.ode.FieldExpandableODETest
Running org.apache.commons.math4.ode.ContinuousOutputModelTest
Tests run: 4, Failures: 0, Errors: 0, Skipped: 0, Time elapsed: 0.019 sec - in org.apache.commons.math4.ode.ContinuousOutputModelTest

Results :

Tests run: 6178, Failures: 0, Errors: 0, Skipped: 43

[JENKINS] Recording test results
[INFO] 
[INFO] --- maven-jar-plugin:2.6:jar (default-jar) @ commons-math4 ---
[INFO] Building jar: <https://builds.apache.org/job/Commons%20Math/ws/target/commons-math4-4.0-SNAPSHOT.jar>
[INFO] 
[INFO] --- maven-site-plugin:3.4:attach-descriptor (attach-descriptor) @ commons-math4 ---
[INFO] Downloading: http://repo.maven.apache.org/maven2/org/apache/maven/wagon/wagon-ssh/2.8/wagon-ssh-2.8.pom
[INFO] Downloaded: http://repo.maven.apache.org/maven2/org/apache/maven/wagon/wagon-ssh/2.8/wagon-ssh-2.8.pom
(6 KB at 655.5 KB/sec)
[INFO] Downloading: http://repo.maven.apache.org/maven2/org/apache/maven/wagon/wagon-providers/2.8/wagon-providers-2.8.pom
[INFO] Downloaded: http://repo.maven.apache.org/maven2/org/apache/maven/wagon/wagon-providers/2.8/wagon-providers-2.8.pom
(3 KB at 295.9 KB/sec)
[INFO] Downloading: http://repo.maven.apache.org/maven2/org/apache/maven/wagon/wagon/2.8/wagon-2.8.pom
[INFO] Downloaded: http://repo.maven.apache.org/maven2/org/apache/maven/wagon/wagon/2.8/wagon-2.8.pom
(19 KB at 2054.6 KB/sec)
[INFO] Downloading: http://repo.maven.apache.org/maven2/com/jcraft/jsch/0.1.50/jsch-0.1.50.pom
[INFO] Downloaded: http://repo.maven.apache.org/maven2/com/jcraft/jsch/0.1.50/jsch-0.1.50.pom
(4 KB at 451.3 KB/sec)
[INFO] Downloading: http://repo.maven.apache.org/maven2/com/jcraft/jsch.agentproxy.connector-factory/0.0.6/jsch.agentproxy.connector-factory-0.0.6.pom
[INFO] Downloaded: http://repo.maven.apache.org/maven2/com/jcraft/jsch.agentproxy.connector-factory/0.0.6/jsch.agentproxy.connector-factory-0.0.6.pom
(2 KB at 270.7 KB/sec)
[INFO] Downloading: http://repo.maven.apache.org/maven2/com/jcraft/jsch.agentproxy/0.0.6/jsch.agentproxy-0.0.6.pom
[INFO] Downloaded: http://repo.maven.apache.org/maven2/com/jcraft/jsch.agentproxy/0.0.6/jsch.agentproxy-0.0.6.pom
(5 KB at 606.6 KB/sec)
[INFO] Downloading: http://repo.maven.apache.org/maven2/com/jcraft/jsch.agentproxy.core/0.0.6/jsch.agentproxy.core-0.0.6.pom
[INFO] Downloaded: http://repo.maven.apache.org/maven2/com/jcraft/jsch.agentproxy.core/0.0.6/jsch.agentproxy.core-0.0.6.pom
(804 B at 112.2 KB/sec)
[INFO] Downloading: http://repo.maven.apache.org/maven2/com/jcraft/jsch.agentproxy.usocket-jna/0.0.6/jsch.agentproxy.usocket-jna-0.0.6.pom
[INFO] Downloaded: http://repo.maven.apache.org/maven2/com/jcraft/jsch.agentproxy.usocket-jna/0.0.6/jsch.agentproxy.usocket-jna-0.0.6.pom
(2 KB at 181.8 KB/sec)
[INFO] Downloading: http://repo.maven.apache.org/maven2/net/java/dev/jna/jna/3.4.0/jna-3.4.0.pom
[INFO] Downloaded: http://repo.maven.apache.org/maven2/net/java/dev/jna/jna/3.4.0/jna-3.4.0.pom
(3 KB at 162.6 KB/sec)
[INFO] Downloading: http://repo.maven.apache.org/maven2/net/java/dev/jna/platform/3.4.0/platform-3.4.0.pom
[INFO] Downloaded: http://repo.maven.apache.org/maven2/net/java/dev/jna/platform/3.4.0/platform-3.4.0.pom
(3 KB at 340.1 KB/sec)
[INFO] Downloading: http://repo.maven.apache.org/maven2/com/jcraft/jsch.agentproxy.usocket-nc/0.0.6/jsch.agentproxy.usocket-nc-0.0.6.pom
[INFO] Downloaded: http://repo.maven.apache.org/maven2/com/jcraft/jsch.agentproxy.usocket-nc/0.0.6/jsch.agentproxy.usocket-nc-0.0.6.pom
(996 B at 139.0 KB/sec)
[INFO] Downloading: http://repo.maven.apache.org/maven2/com/jcraft/jsch.agentproxy.sshagent/0.0.6/jsch.agentproxy.sshagent-0.0.6.pom
[INFO] Downloaded: http://repo.maven.apache.org/maven2/com/jcraft/jsch.agentproxy.sshagent/0.0.6/jsch.agentproxy.sshagent-0.0.6.pom
(971 B at 135.5 KB/sec)
[INFO] Downloading: http://repo.maven.apache.org/maven2/com/jcraft/jsch.agentproxy.pageant/0.0.6/jsch.agentproxy.pageant-0.0.6.pom
[INFO] Downloaded: http://repo.maven.apache.org/maven2/com/jcraft/jsch.agentproxy.pageant/0.0.6/jsch.agentproxy.pageant-0.0.6.pom
(2 KB at 179.5 KB/sec)
[INFO] Downloading: http://repo.maven.apache.org/maven2/com/jcraft/jsch.agentproxy.jsch/0.0.6/jsch.agentproxy.jsch-0.0.6.pom
[INFO] Downloaded: http://repo.maven.apache.org/maven2/com/jcraft/jsch.agentproxy.jsch/0.0.6/jsch.agentproxy.jsch-0.0.6.pom
(2 KB at 153.6 KB/sec)
[INFO] Downloading: http://repo.maven.apache.org/maven2/com/jcraft/jsch/0.1.49/jsch-0.1.49.pom
[INFO] Downloaded: http://repo.maven.apache.org/maven2/com/jcraft/jsch/0.1.49/jsch-0.1.49.pom
(4 KB at 451.3 KB/sec)
[INFO] Downloading: http://repo.maven.apache.org/maven2/org/apache/maven/wagon/wagon-ssh-common/2.8/wagon-ssh-common-2.8.pom
[INFO] Downloaded: http://repo.maven.apache.org/maven2/org/apache/maven/wagon/wagon-ssh-common/2.8/wagon-ssh-common-2.8.pom
(2 KB at 199.3 KB/sec)
[INFO] Downloading: http://repo.maven.apache.org/maven2/org/apache/maven/wagon/wagon-provider-api/2.8/wagon-provider-api-2.8.pom
[INFO] Downloaded: http://repo.maven.apache.org/maven2/org/apache/maven/wagon/wagon-provider-api/2.8/wagon-provider-api-2.8.pom
(2 KB at 211.2 KB/sec)
[INFO] Downloading: http://repo.maven.apache.org/maven2/org/apache/maven/wagon/wagon-ssh/2.8/wagon-ssh-2.8.jar
[INFO] Downloading: http://repo.maven.apache.org/maven2/com/jcraft/jsch.agentproxy.connector-factory/0.0.6/jsch.agentproxy.connector-factory-0.0.6.jar
[INFO] Downloading: http://repo.maven.apache.org/maven2/com/jcraft/jsch/0.1.50/jsch-0.1.50.jar
[INFO] Downloading: http://repo.maven.apache.org/maven2/com/jcraft/jsch.agentproxy.core/0.0.6/jsch.agentproxy.core-0.0.6.jar
[INFO] Downloading: http://repo.maven.apache.org/maven2/com/jcraft/jsch.agentproxy.usocket-jna/0.0.6/jsch.agentproxy.usocket-jna-0.0.6.jar
[INFO] Downloaded: http://repo.maven.apache.org/maven2/com/jcraft/jsch.agentproxy.connector-factory/0.0.6/jsch.agentproxy.connector-factory-0.0.6.jar
(12 KB at 1311.2 KB/sec)
[INFO] Downloaded: http://repo.maven.apache.org/maven2/org/apache/maven/wagon/wagon-ssh/2.8/wagon-ssh-2.8.jar
(29 KB at 2894.2 KB/sec)
[INFO] Downloaded: http://repo.maven.apache.org/maven2/com/jcraft/jsch.agentproxy.core/0.0.6/jsch.agentproxy.core-0.0.6.jar
(10 KB at 1170.8 KB/sec)
[INFO] Downloaded: http://repo.maven.apache.org/maven2/com/jcraft/jsch.agentproxy.usocket-jna/0.0.6/jsch.agentproxy.usocket-jna-0.0.6.jar
(7 KB at 789.6 KB/sec)
[INFO] Downloading: http://repo.maven.apache.org/maven2/com/jcraft/jsch.agentproxy.usocket-nc/0.0.6/jsch.agentproxy.usocket-nc-0.0.6.jar
[INFO] Downloading: http://repo.maven.apache.org/maven2/com/jcraft/jsch.agentproxy.sshagent/0.0.6/jsch.agentproxy.sshagent-0.0.6.jar
[INFO] Downloading: http://repo.maven.apache.org/maven2/net/java/dev/jna/platform/3.4.0/platform-3.4.0.jar
[INFO] Downloading: http://repo.maven.apache.org/maven2/net/java/dev/jna/jna/3.4.0/jna-3.4.0.jar
[INFO] Downloaded: http://repo.maven.apache.org/maven2/com/jcraft/jsch/0.1.50/jsch-0.1.50.jar
(249 KB at 13802.5 KB/sec)
[INFO] Downloading: http://repo.maven.apache.org/maven2/com/jcraft/jsch.agentproxy.pageant/0.0.6/jsch.agentproxy.pageant-0.0.6.jar
[INFO] Downloaded: http://repo.maven.apache.org/maven2/com/jcraft/jsch.agentproxy.sshagent/0.0.6/jsch.agentproxy.sshagent-0.0.6.jar
(5 KB at 313.3 KB/sec)
[INFO] Downloading: http://repo.maven.apache.org/maven2/com/jcraft/jsch.agentproxy.jsch/0.0.6/jsch.agentproxy.jsch-0.0.6.jar
[INFO] Downloaded: http://repo.maven.apache.org/maven2/com/jcraft/jsch.agentproxy.usocket-nc/0.0.6/jsch.agentproxy.usocket-nc-0.0.6.jar
(6 KB at 371.5 KB/sec)
[INFO] Downloading: http://repo.maven.apache.org/maven2/org/apache/maven/wagon/wagon-ssh-common/2.8/wagon-ssh-common-2.8.jar
[INFO] Downloaded: http://repo.maven.apache.org/maven2/com/jcraft/jsch.agentproxy.pageant/0.0.6/jsch.agentproxy.pageant-0.0.6.jar
(8 KB at 1058.2 KB/sec)
[INFO] Downloaded: http://repo.maven.apache.org/maven2/com/jcraft/jsch.agentproxy.jsch/0.0.6/jsch.agentproxy.jsch-0.0.6.jar
(5 KB at 474.2 KB/sec)
[INFO] Downloaded: http://repo.maven.apache.org/maven2/org/apache/maven/wagon/wagon-ssh-common/2.8/wagon-ssh-common-2.8.jar
(25 KB at 2067.6 KB/sec)
[INFO] Downloaded: http://repo.maven.apache.org/maven2/net/java/dev/jna/platform/3.4.0/platform-3.4.0.jar
(893 KB at 23474.4 KB/sec)
[INFO] Downloaded: http://repo.maven.apache.org/maven2/net/java/dev/jna/jna/3.4.0/jna-3.4.0.jar
(986 KB at 21890.8 KB/sec)
[INFO] 
[INFO] >>> maven-javadoc-plugin:2.10.3:javadoc (create-javadoc-jar) @ commons-math4
>>>
[INFO] 
[INFO] --- maven-enforcer-plugin:1.3.1:enforce (enforce-maven-3) @ commons-math4 ---
[INFO] 
[INFO] --- build-helper-maven-plugin:1.7:parse-version (parse-version) @ commons-math4 ---
[INFO] 
[INFO] --- maven-antrun-plugin:1.7:run (javadoc.resources) @ commons-math4 ---
[INFO] Executing tasks

main:
[INFO] Executed tasks
[WARNING] Failed to getClass for org.apache.maven.plugin.javadoc.JavadocReport
[INFO] 
[INFO] <<< maven-javadoc-plugin:2.10.3:javadoc (create-javadoc-jar) @ commons-math4
<<<
[INFO] 
[INFO] --- maven-javadoc-plugin:2.10.3:javadoc (create-javadoc-jar) @ commons-math4 ---
[INFO] Downloading: http://repo.maven.apache.org/maven2/org/apache/maven/shared/maven-invoker/2.0.9/maven-invoker-2.0.9.pom
[INFO] Downloaded: http://repo.maven.apache.org/maven2/org/apache/maven/shared/maven-invoker/2.0.9/maven-invoker-2.0.9.pom
(6 KB at 626.8 KB/sec)
[INFO] Downloading: http://repo.maven.apache.org/maven2/org/codehaus/plexus/plexus-utils/1.4.9/plexus-utils-1.4.9.pom
[INFO] Downloaded: http://repo.maven.apache.org/maven2/org/codehaus/plexus/plexus-utils/1.4.9/plexus-utils-1.4.9.pom
(3 KB at 320.3 KB/sec)
[INFO] Downloading: http://repo.maven.apache.org/maven2/org/apache/maven/wagon/wagon-provider-api/1.0-beta-6/wagon-provider-api-1.0-beta-6.pom
[INFO] Downloaded: http://repo.maven.apache.org/maven2/org/apache/maven/wagon/wagon-provider-api/1.0-beta-6/wagon-provider-api-1.0-beta-6.pom
(2 KB at 191.0 KB/sec)
[INFO] Downloading: http://repo.maven.apache.org/maven2/org/apache/maven/wagon/wagon/1.0-beta-6/wagon-1.0-beta-6.pom
[INFO] Downloaded: http://repo.maven.apache.org/maven2/org/apache/maven/wagon/wagon/1.0-beta-6/wagon-1.0-beta-6.pom
(13 KB at 1344.0 KB/sec)
[INFO] Downloading: http://repo.maven.apache.org/maven2/org/apache/httpcomponents/httpclient/4.2.3/httpclient-4.2.3.pom
[INFO] Downloaded: http://repo.maven.apache.org/maven2/org/apache/httpcomponents/httpclient/4.2.3/httpclient-4.2.3.pom
(6 KB at 721.6 KB/sec)
[INFO] Downloading: http://repo.maven.apache.org/maven2/org/apache/httpcomponents/httpcomponents-client/4.2.3/httpcomponents-client-4.2.3.pom
[INFO] Downloaded: http://repo.maven.apache.org/maven2/org/apache/httpcomponents/httpcomponents-client/4.2.3/httpcomponents-client-4.2.3.pom
(15 KB at 1782.7 KB/sec)
[INFO] Downloading: http://repo.maven.apache.org/maven2/org/apache/httpcomponents/httpcore/4.2.2/httpcore-4.2.2.pom
[INFO] Downloaded: http://repo.maven.apache.org/maven2/org/apache/httpcomponents/httpcore/4.2.2/httpcore-4.2.2.pom
(6 KB at 693.8 KB/sec)
[INFO] Downloading: http://repo.maven.apache.org/maven2/org/apache/httpcomponents/httpcomponents-core/4.2.2/httpcomponents-core-4.2.2.pom
[INFO] Downloaded: http://repo.maven.apache.org/maven2/org/apache/httpcomponents/httpcomponents-core/4.2.2/httpcomponents-core-4.2.2.pom
(12 KB at 1400.5 KB/sec)
[INFO] Downloading: http://repo.maven.apache.org/maven2/log4j/log4j/1.2.14/log4j-1.2.14.pom
[INFO] Downloaded: http://repo.maven.apache.org/maven2/log4j/log4j/1.2.14/log4j-1.2.14.pom
(3 KB at 257.6 KB/sec)
[INFO] Downloading: http://repo.maven.apache.org/maven2/com/thoughtworks/qdox/qdox/1.12.1/qdox-1.12.1.pom
[INFO] Downloaded: http://repo.maven.apache.org/maven2/com/thoughtworks/qdox/qdox/1.12.1/qdox-1.12.1.pom
(18 KB at 2148.2 KB/sec)
[INFO] Downloading: http://repo.maven.apache.org/maven2/org/apache/maven/shared/maven-invoker/2.0.9/maven-invoker-2.0.9.jar
[INFO] Downloading: http://repo.maven.apache.org/maven2/org/apache/httpcomponents/httpclient/4.2.3/httpclient-4.2.3.jar
[INFO] Downloading: http://repo.maven.apache.org/maven2/org/apache/httpcomponents/httpcore/4.2.2/httpcore-4.2.2.jar
[INFO] Downloading: http://repo.maven.apache.org/maven2/log4j/log4j/1.2.14/log4j-1.2.14.jar
[INFO] Downloading: http://repo.maven.apache.org/maven2/com/thoughtworks/qdox/qdox/1.12.1/qdox-1.12.1.jar
[INFO] Downloaded: http://repo.maven.apache.org/maven2/org/apache/maven/shared/maven-invoker/2.0.9/maven-invoker-2.0.9.jar
(28 KB at 2510.8 KB/sec)
[INFO] Downloaded: http://repo.maven.apache.org/maven2/log4j/log4j/1.2.14/log4j-1.2.14.jar
(359 KB at 19935.1 KB/sec)
[INFO] Downloaded: http://repo.maven.apache.org/maven2/com/thoughtworks/qdox/qdox/1.12.1/qdox-1.12.1.jar
(176 KB at 9242.3 KB/sec)
[INFO] Downloaded: http://repo.maven.apache.org/maven2/org/apache/httpcomponents/httpcore/4.2.2/httpcore-4.2.2.jar
(219 KB at 9924.1 KB/sec)
[INFO] Downloaded: http://repo.maven.apache.org/maven2/org/apache/httpcomponents/httpclient/4.2.3/httpclient-4.2.3.jar
(423 KB at 15663.7 KB/sec)
[JENKINS] Archiving  javadoc
[INFO] 
[INFO] --- maven-javadoc-plugin:2.10.3:jar (create-javadoc-jar) @ commons-math4 ---
[INFO] Building jar: <https://builds.apache.org/job/Commons%20Math/ws/target/commons-math4-4.0-SNAPSHOT-javadoc.jar>
[INFO] 
[INFO] --- maven-assembly-plugin:2.5.5:single (default) @ commons-math4 ---
[INFO] Downloading: http://repo.maven.apache.org/maven2/org/codehaus/plexus/plexus-archiver/2.10.2/plexus-archiver-2.10.2.pom
[INFO] Downloaded: http://repo.maven.apache.org/maven2/org/codehaus/plexus/plexus-archiver/2.10.2/plexus-archiver-2.10.2.pom
(6 KB at 586.6 KB/sec)
[INFO] Downloading: http://repo.maven.apache.org/maven2/org/codehaus/plexus/plexus-archiver/2.10.2/plexus-archiver-2.10.2.jar
[INFO] Downloaded: http://repo.maven.apache.org/maven2/org/codehaus/plexus/plexus-archiver/2.10.2/plexus-archiver-2.10.2.jar
(365 KB at 22804.1 KB/sec)
[INFO] Reading assembly descriptor: src/assembly/src.xml
[INFO] Reading assembly descriptor: src/assembly/bin.xml
[INFO] Building tar: <https://builds.apache.org/job/Commons%20Math/ws/target/commons-math4-4.0-SNAPSHOT-src.tar.gz>
[INFO] Building zip: <https://builds.apache.org/job/Commons%20Math/ws/target/commons-math4-4.0-SNAPSHOT-src.zip>
[INFO] Building tar: <https://builds.apache.org/job/Commons%20Math/ws/target/commons-math4-4.0-SNAPSHOT-bin.tar.gz>
[INFO] Building zip: <https://builds.apache.org/job/Commons%20Math/ws/target/commons-math4-4.0-SNAPSHOT-bin.zip>
[INFO] 
[INFO] --- maven-antrun-plugin:1.7:run (default) @ commons-math4 ---
[INFO] Executing tasks

main:
      [jar] Building jar: <https://builds.apache.org/job/Commons%20Math/ws/target/commons-math4-4.0-SNAPSHOT-tools.jar>
[INFO] Executed tasks
[INFO] 
[INFO] >>> maven-source-plugin:2.4:jar (create-source-jar) @ commons-math4 >>>
[INFO] 
[INFO] --- maven-enforcer-plugin:1.3.1:enforce (enforce-maven-3) @ commons-math4 ---
[INFO] 
[INFO] --- build-helper-maven-plugin:1.7:parse-version (parse-version) @ commons-math4 ---
[INFO] 
[INFO] --- maven-antrun-plugin:1.7:run (javadoc.resources) @ commons-math4 ---
[INFO] Executing tasks

main:
[INFO] Executed tasks
[WARNING] Failed to getClass for org.apache.maven.plugin.source.SourceJarMojo
[INFO] 
[INFO] <<< maven-source-plugin:2.4:jar (create-source-jar) @ commons-math4 <<<
[INFO] 
[INFO] --- maven-source-plugin:2.4:jar (create-source-jar) @ commons-math4 ---
[INFO] Building jar: <https://builds.apache.org/job/Commons%20Math/ws/target/commons-math4-4.0-SNAPSHOT-sources.jar>
[INFO] 
[INFO] >>> maven-source-plugin:2.4:test-jar (create-source-jar) @ commons-math4 >>>
[INFO] 
[INFO] --- maven-enforcer-plugin:1.3.1:enforce (enforce-maven-3) @ commons-math4 ---
[INFO] 
[INFO] --- build-helper-maven-plugin:1.7:parse-version (parse-version) @ commons-math4 ---
[INFO] 
[INFO] --- maven-antrun-plugin:1.7:run (javadoc.resources) @ commons-math4 ---
[INFO] Executing tasks

main:
[INFO] Executed tasks
[WARNING] Failed to getClass for org.apache.maven.plugin.source.TestSourceJarMojo
[INFO] 
[INFO] <<< maven-source-plugin:2.4:test-jar (create-source-jar) @ commons-math4 <<<
[INFO] 
[INFO] --- maven-source-plugin:2.4:test-jar (create-source-jar) @ commons-math4 ---
[INFO] Building jar: <https://builds.apache.org/job/Commons%20Math/ws/target/commons-math4-4.0-SNAPSHOT-test-sources.jar>
[INFO] 
[INFO] --- maven-jar-plugin:2.6:test-jar (default) @ commons-math4 ---
[INFO] Building jar: <https://builds.apache.org/job/Commons%20Math/ws/target/commons-math4-4.0-SNAPSHOT-tests.jar>
[INFO] 
[INFO] --- build-helper-maven-plugin:1.7:attach-artifact (attach-artifacts) @ commons-math4
---
[INFO] 
[INFO] --- maven-gpg-plugin:1.6:sign (sign-artifacts) @ commons-math4 ---
[INFO] Downloading: http://repo.maven.apache.org/maven2/org/sonatype/plexus/plexus-sec-dispatcher/1.4/plexus-sec-dispatcher-1.4.pom
[INFO] Downloaded: http://repo.maven.apache.org/maven2/org/sonatype/plexus/plexus-sec-dispatcher/1.4/plexus-sec-dispatcher-1.4.pom
(3 KB at 321.3 KB/sec)
[INFO] Downloading: http://repo.maven.apache.org/maven2/org/sonatype/plexus/plexus-sec-dispatcher/1.4/plexus-sec-dispatcher-1.4.jar
[INFO] Downloaded: http://repo.maven.apache.org/maven2/org/sonatype/plexus/plexus-sec-dispatcher/1.4/plexus-sec-dispatcher-1.4.jar
(28 KB at 3381.7 KB/sec)
[INFO] 
[INFO] --- jacoco-maven-plugin:0.7.5.201505241946:check (check) @ commons-math4 ---
[INFO] Analyzed bundle 'Apache Commons Math' with 945 classes
[INFO] All coverage checks have been met.
[INFO] 
[INFO] --- maven-install-plugin:2.5.2:install (default-install) @ commons-math4 ---
[INFO] Installing <https://builds.apache.org/job/Commons%20Math/ws/target/commons-math4-4.0-SNAPSHOT.jar>
to /home/jenkins/jenkins-slave/maven-repositories/0/org/apache/commons/commons-math4/4.0-SNAPSHOT/commons-math4-4.0-SNAPSHOT.jar
[INFO] Installing <https://builds.apache.org/job/Commons%20Math/ws/pom.xml> to /home/jenkins/jenkins-slave/maven-repositories/0/org/apache/commons/commons-math4/4.0-SNAPSHOT/commons-math4-4.0-SNAPSHOT.pom
[INFO] Installing <https://builds.apache.org/job/Commons%20Math/ws/target/commons-math4-4.0-SNAPSHOT-javadoc.jar>
to /home/jenkins/jenkins-slave/maven-repositories/0/org/apache/commons/commons-math4/4.0-SNAPSHOT/commons-math4-4.0-SNAPSHOT-javadoc.jar
[INFO] Installing <https://builds.apache.org/job/Commons%20Math/ws/target/commons-math4-4.0-SNAPSHOT-src.tar.gz>
to /home/jenkins/jenkins-slave/maven-repositories/0/org/apache/commons/commons-math4/4.0-SNAPSHOT/commons-math4-4.0-SNAPSHOT-src.tar.gz
[INFO] Installing <https://builds.apache.org/job/Commons%20Math/ws/target/commons-math4-4.0-SNAPSHOT-src.zip>
to /home/jenkins/jenkins-slave/maven-repositories/0/org/apache/commons/commons-math4/4.0-SNAPSHOT/commons-math4-4.0-SNAPSHOT-src.zip
[INFO] Installing <https://builds.apache.org/job/Commons%20Math/ws/target/commons-math4-4.0-SNAPSHOT-bin.tar.gz>
to /home/jenkins/jenkins-slave/maven-repositories/0/org/apache/commons/commons-math4/4.0-SNAPSHOT/commons-math4-4.0-SNAPSHOT-bin.tar.gz
[INFO] Installing <https://builds.apache.org/job/Commons%20Math/ws/target/commons-math4-4.0-SNAPSHOT-bin.zip>
to /home/jenkins/jenkins-slave/maven-repositories/0/org/apache/commons/commons-math4/4.0-SNAPSHOT/commons-math4-4.0-SNAPSHOT-bin.zip
[INFO] Installing <https://builds.apache.org/job/Commons%20Math/ws/target/commons-math4-4.0-SNAPSHOT-sources.jar>
to /home/jenkins/jenkins-slave/maven-repositories/0/org/apache/commons/commons-math4/4.0-SNAPSHOT/commons-math4-4.0-SNAPSHOT-sources.jar
[INFO] Installing <https://builds.apache.org/job/Commons%20Math/ws/target/commons-math4-4.0-SNAPSHOT-test-sources.jar>
to /home/jenkins/jenkins-slave/maven-repositories/0/org/apache/commons/commons-math4/4.0-SNAPSHOT/commons-math4-4.0-SNAPSHOT-test-sources.jar
[INFO] Installing <https://builds.apache.org/job/Commons%20Math/ws/target/commons-math4-4.0-SNAPSHOT-tests.jar>
to /home/jenkins/jenkins-slave/maven-repositories/0/org/apache/commons/commons-math4/4.0-SNAPSHOT/commons-math4-4.0-SNAPSHOT-tests.jar
[INFO] Installing <https://builds.apache.org/job/Commons%20Math/ws/target/commons-math4-4.0-SNAPSHOT-tools.jar>
to /home/jenkins/jenkins-slave/maven-repositories/0/org/apache/commons/commons-math4/4.0-SNAPSHOT/commons-math4-4.0-SNAPSHOT-tools.jar
[INFO] 
[INFO] --- maven-deploy-plugin:2.8.2:deploy (default-deploy) @ commons-math4 ---
[INFO] Downloading: https://repository.apache.org/content/repositories/snapshots/org/apache/commons/commons-math4/4.0-SNAPSHOT/maven-metadata.xml
[INFO] Downloaded: https://repository.apache.org/content/repositories/snapshots/org/apache/commons/commons-math4/4.0-SNAPSHOT/maven-metadata.xml
(3 KB at 2.0 KB/sec)
[INFO] Uploading: https://repository.apache.org/content/repositories/snapshots/org/apache/commons/commons-math4/4.0-SNAPSHOT/commons-math4-4.0-20160419.001620-567.jar
[INFO] Uploading: https://repository.apache.org/content/repositories/snapshots/org/apache/commons/commons-math4/4.0-SNAPSHOT/commons-math4-4.0-20160419.001620-567.pom
[INFO] ------------------------------------------------------------------------
[INFO] BUILD FAILURE
[INFO] ------------------------------------------------------------------------
[INFO] Total time: 5:45.779s
[INFO] Finished at: Tue Apr 19 00:16:28 UTC 2016
[INFO] Final Memory: 44M/435M
[INFO] ------------------------------------------------------------------------
Waiting for Jenkins to finish collecting data[ERROR] Failed to execute goal org.apache.maven.plugins:maven-deploy-plugin:2.8.2:deploy
(default-deploy) on project commons-math4: Failed to deploy artifacts: Could not transfer
artifact org.apache.commons:commons-math4:jar:4.0-20160419.001620-567 from/to apache.snapshots.https
(https://repository.apache.org/content/repositories/snapshots): Failed to transfer file: https://repository.apache.org/content/repositories/snapshots/org/apache/commons/commons-math4/4.0-SNAPSHOT/commons-math4-4.0-20160419.001620-567.jar.
Return code is: 401, ReasonPhrase: Unauthorized. -> [Help 1]

[ERROR] 
[ERROR] To see the full stack trace of the errors, re-run Maven with the -e switch.
[ERROR] Re-run Maven using the -X switch to enable full debug logging.
[ERROR] 
[ERROR] For more information about the errors and possible solutions, please read the following
articles:
[ERROR] [Help 1] http://cwiki.apache.org/confluence/display/MAVEN/MojoExecutionException
[JENKINS] Archiving <https://builds.apache.org/job/Commons%20Math/ws/pom.xml> to org.apache.commons/commons-math4/4.0-SNAPSHOT/commons-math4-4.0-SNAPSHOT.pom
[JENKINS] Archiving <https://builds.apache.org/job/Commons%20Math/ws/target/commons-math4-4.0-SNAPSHOT.jar>
to org.apache.commons/commons-math4/4.0-SNAPSHOT/commons-math4-4.0-SNAPSHOT.jar
[JENKINS] Archiving <https://builds.apache.org/job/Commons%20Math/ws/target/commons-math4-4.0-SNAPSHOT-javadoc.jar>
to org.apache.commons/commons-math4/4.0-SNAPSHOT/commons-math4-4.0-SNAPSHOT-javadoc.jar
[JENKINS] Archiving <https://builds.apache.org/job/Commons%20Math/ws/target/commons-math4-4.0-SNAPSHOT-src.tar.gz>
to org.apache.commons/commons-math4/4.0-SNAPSHOT/commons-math4-4.0-SNAPSHOT-src.tar.gz
[JENKINS] Archiving <https://builds.apache.org/job/Commons%20Math/ws/target/commons-math4-4.0-SNAPSHOT-src.zip>
to org.apache.commons/commons-math4/4.0-SNAPSHOT/commons-math4-4.0-SNAPSHOT-src.zip
[JENKINS] Archiving <https://builds.apache.org/job/Commons%20Math/ws/target/commons-math4-4.0-SNAPSHOT-bin.tar.gz>
to org.apache.commons/commons-math4/4.0-SNAPSHOT/commons-math4-4.0-SNAPSHOT-bin.tar.gz
[JENKINS] Archiving <https://builds.apache.org/job/Commons%20Math/ws/target/commons-math4-4.0-SNAPSHOT-bin.zip>
to org.apache.commons/commons-math4/4.0-SNAPSHOT/commons-math4-4.0-SNAPSHOT-bin.zip
[JENKINS] Archiving <https://builds.apache.org/job/Commons%20Math/ws/target/commons-math4-4.0-SNAPSHOT-sources.jar>
to org.apache.commons/commons-math4/4.0-SNAPSHOT/commons-math4-4.0-SNAPSHOT-sources.jar
[JENKINS] Archiving <https://builds.apache.org/job/Commons%20Math/ws/target/commons-math4-4.0-SNAPSHOT-test-sources.jar>
to org.apache.commons/commons-math4/4.0-SNAPSHOT/commons-math4-4.0-SNAPSHOT-test-sources.jar
[JENKINS] Archiving <https://builds.apache.org/job/Commons%20Math/ws/target/commons-math4-4.0-SNAPSHOT-tests.jar>
to org.apache.commons/commons-math4/4.0-SNAPSHOT/commons-math4-4.0-SNAPSHOT-tests.jar
[JENKINS] Archiving <https://builds.apache.org/job/Commons%20Math/ws/target/commons-math4-4.0-SNAPSHOT-tools.jar>
to org.apache.commons/commons-math4/4.0-SNAPSHOT/commons-math4-4.0-SNAPSHOT-tools.jar
channel stopped

Mime
View raw message