commons-commits mailing list archives

Site index · List index
Message view « Date » · « Thread »
Top « Date » · « Thread »
From Apache Continuum <...@continuum.apache.org>
Subject [continuum] BUILD FAILURE: Apache Commons JCS - Apache Commons ((Group) Build with Java 7 (Maven 3.0.5))
Date Sun, 07 Feb 2016 12:25:58 GMT
Online report : https://continuum-ci.apache.org/continuum/buildResult.action?buildId=40886&projectId=286

Build statistics:
  State: Failed
  Previous State: Failed
  Started at: Sun 7 Feb 2016 12:21:03 +0000
  Finished at: Sun 7 Feb 2016 12:25:57 +0000
  Total time: 4m 54s
  Build Trigger: Schedule
  Build Number: 25
  Exit code: 1
  Building machine hostname: continuum-vm
  Operating system : Linux(unknown)
  Java Home version : 
          java version "1.7.0_65"
          OpenJDK Runtime Environment (IcedTea 2.5.3) (7u71-2.5.3-0ubuntu0.12.04.1)
          OpenJDK 64-Bit Server VM (build 24.65-b04, mixed mode)
        
  Builder version :
          Apache Maven 3.0.5 (r01de14724cdef164cd33c7c8c2fe155faf9602da; 2013-02-19 13:51:28+0000)
          Maven home: /opt/apache-maven-3.0.5
          Java version: 1.7.0_65, vendor: Oracle Corporation
          Java home: /usr/lib/jvm/java-7-openjdk-amd64/jre
          Default locale: en_US, platform encoding: ANSI_X3.4-1968
          OS name: "linux", version: "3.2.0-75-generic", arch: "amd64", family: "unix"
    
****************************************************************************
SCM Changes:
****************************************************************************
Changed: tv @ Sun 7 Feb 2016 11:29:17 +0000
Comment: JCS-78 Fix: RemoteCacheStartupServlet can't start with config outside classpath
Files changed:
  /commons/proper/jcs/trunk/commons-jcs-core/src/main/java/org/apache/commons/jcs/auxiliary/remote/RemoteUtils.java
( 1728947 )
  /commons/proper/jcs/trunk/commons-jcs-core/src/main/java/org/apache/commons/jcs/auxiliary/remote/server/RemoteCacheStartupServlet.java
( 1728947 )
  /commons/proper/jcs/trunk/src/changes/changes.xml ( 1728947 )

****************************************************************************
Dependencies Changes:
****************************************************************************
No dependencies changed


****************************************************************************
Build Definition:
****************************************************************************
POM filename: pom.xml
Goals: clean deploy   
Arguments: --batch-mode -Pjava-1.7 -Dgpg.skip -Prelease
Build Fresh: false
Always Build: false
Default Build Definition: true
Schedule: COMMONS_SCHEDULE
Profile Name: Maven 3.0.5 with Java 7
Description: (Group) Build with Java 7 (Maven 3.0.5)

****************************************************************************
Test Summary:
****************************************************************************
Tests: 429
Failures: 5
Errors: 0
Success Rate: 98
Total time: 208.09402

****************************************************************************
Test Failures:
****************************************************************************

BasicRemoteCacheClientServerUnitTest
    test1SinglePut :
  java.lang.AssertionError
  java.lang.AssertionError: Cache is alive expected:<ALIVE> but was:<ERROR>
	at org.junit.Assert.fail(Assert.java:88)
	at org.junit.Assert.failNotEquals(Assert.java:743)
	at org.junit.Assert.assertEquals(Assert.java:118)
	at org.apache.commons.jcs.auxiliary.remote.server.BasicRemoteCacheClientServerUnitTest.test1SinglePut(BasicRemoteCacheClientServerUnitTest.java:162)


    test2PutRemove :
  java.lang.AssertionError
  java.lang.AssertionError: Cache is alive expected:<ALIVE> but was:<ERROR>
	at org.junit.Assert.fail(Assert.java:88)
	at org.junit.Assert.failNotEquals(Assert.java:743)
	at org.junit.Assert.assertEquals(Assert.java:118)
	at org.apache.commons.jcs.auxiliary.remote.server.BasicRemoteCacheClientServerUnitTest.test2PutRemove(BasicRemoteCacheClientServerUnitTest.java:211)


    test3PutAndListen :
  java.lang.AssertionError
  java.lang.AssertionError: Cache is alive expected:<ALIVE> but was:<ERROR>
	at org.junit.Assert.fail(Assert.java:88)
	at org.junit.Assert.failNotEquals(Assert.java:743)
	at org.junit.Assert.assertEquals(Assert.java:118)
	at org.apache.commons.jcs.auxiliary.remote.server.BasicRemoteCacheClientServerUnitTest.test3PutAndListen(BasicRemoteCacheClientServerUnitTest.java:268)


    test4PutaMultipleAndListen :
  java.lang.AssertionError
  java.lang.AssertionError: Cache is alive expected:<ALIVE> but was:<ERROR>
	at org.junit.Assert.fail(Assert.java:88)
	at org.junit.Assert.failNotEquals(Assert.java:743)
	at org.junit.Assert.assertEquals(Assert.java:118)
	at org.apache.commons.jcs.auxiliary.remote.server.BasicRemoteCacheClientServerUnitTest.test4PutaMultipleAndListen(BasicRemoteCacheClientServerUnitTest.java:321)


  IndexedDiskCacheConcurrentUnitTest
    testIndexedDiskCache3 :
  junit.framework.AssertionFailedError
  junit.framework.AssertionFailedError: Removed key should be null: 28:key
 stats Region Name = indexedRegion3
HitCountRam = 111
HitCountAux = 893
---------------------------Memory Cache
List Size = 0
Map Size = 0
Put Count = 1395
Hit Count = 111
Miss Count = 1046
---------------------------Indexed Disk Cache
Is Alive = true
Key Map Size = 1
Data File Length = 99275
Max Key Size = 5000
Hit Count = 92
Bytes Free = 98782
Optimize Operation Count = 0
Times Optimized = 0
Recycle Count = 37
Recycle Bin Size = 200
Startup Size = 0
Purgatory Hits = 801
Purgatory Size = 0
Working = true
Alive = true
Empty = true
Size = 0
	at junit.framework.Assert.fail(Assert.java:57)
	at junit.framework.Assert.assertTrue(Assert.java:22)
	at junit.framework.Assert.assertNull(Assert.java:277)
	at junit.framework.TestCase.assertNull(TestCase.java:447)
	at org.apache.commons.jcs.auxiliary.disk.indexed.IndexedDiskCacheConcurrentUnitTest.runTestForRegion(IndexedDiskCacheConcurrentUnitTest.java:184)
	at org.apache.commons.jcs.auxiliary.disk.indexed.IndexedDiskCacheConcurrentUnitTest$3.runTest(IndexedDiskCacheConcurrentUnitTest.java:104)

  


Mime
View raw message