commons-commits mailing list archives

Site index · List index
Message view « Date » · « Thread »
Top « Date » · « Thread »
From Apache Continuum <...@continuum.apache.org>
Subject [continuum] BUILD FAILURE: Apache Commons Email - Apache Commons ((Group) Build with Java 7 (Maven 3.0.5))
Date Mon, 01 Feb 2016 22:22:03 GMT
Online report : https://continuum-ci.apache.org/continuum/buildResult.action?buildId=40865&projectId=79

Build statistics:
  State: Failed
  Previous State: Ok
  Started at: Mon 1 Feb 2016 22:20:28 +0000
  Finished at: Mon 1 Feb 2016 22:22:03 +0000
  Total time: 1m 35s
  Build Trigger: Schedule
  Build Number: 136
  Exit code: 1
  Building machine hostname: continuum-vm
  Operating system : Linux(unknown)
  Java Home version : 
          java version "1.7.0_65"
          OpenJDK Runtime Environment (IcedTea 2.5.3) (7u71-2.5.3-0ubuntu0.12.04.1)
          OpenJDK 64-Bit Server VM (build 24.65-b04, mixed mode)
        
  Builder version :
          Apache Maven 3.0.5 (r01de14724cdef164cd33c7c8c2fe155faf9602da; 2013-02-19 13:51:28+0000)
          Maven home: /opt/apache-maven-3.0.5
          Java version: 1.7.0_65, vendor: Oracle Corporation
          Java home: /usr/lib/jvm/java-7-openjdk-amd64/jre
          Default locale: en_US, platform encoding: ANSI_X3.4-1968
          OS name: "linux", version: "3.2.0-75-generic", arch: "amd64", family: "unix"
    
****************************************************************************
SCM Changes:
****************************************************************************
Changed: sgoeschl @ Mon 1 Feb 2016 21:25:23 +0000
Comment: [EMAIL-160] Add Support for International Domain Names - this change requires JDK
1.6+
Files changed:
  /commons/proper/email/trunk/.gitignore ( 1728011 )
  /commons/proper/email/trunk/pom.xml ( 1728011 )
  /commons/proper/email/trunk/src/changes/changes.xml ( 1728011 )
  /commons/proper/email/trunk/src/main/java/org/apache/commons/mail/Email.java ( 1728011 )
  /commons/proper/email/trunk/src/main/java/org/apache/commons/mail/util/IDNEmailAddressConverter.java
( 1728011 )
  /commons/proper/email/trunk/src/test/java/org/apache/commons/mail/EmailTest.java ( 1728011
)
  /commons/proper/email/trunk/src/test/java/org/apache/commons/mail/util/IDNEmailAddressConverterTest.java
( 1728011 )

Changed: sgoeschl @ Mon 1 Feb 2016 21:35:08 +0000
Comment: [EMAIL-161] Remove "javax.activation" dependency
Files changed:
  /commons/proper/email/trunk/pom.xml ( 1728012 )
  /commons/proper/email/trunk/src/changes/changes.xml ( 1728012 )
  /commons/proper/email/trunk/src/test/java/org/apache/commons/mail/InvalidInternetAddressTest.java
( 1728012 )

Changed: sgoeschl @ Mon 1 Feb 2016 21:40:50 +0000
Comment: [EMAIL-160] Add Support for International Domain Names - highlight that JDK 1.6+
is required now
Files changed:
  /commons/proper/email/trunk/src/changes/changes.xml ( 1728013 )

Changed: sgoeschl @ Mon 1 Feb 2016 21:50:39 +0000
Comment: [EMAIL-162] Remove usage of deprecated constants in Email.java
Files changed:
  /commons/proper/email/trunk/src/main/java/org/apache/commons/mail/Email.java ( 1728015 )

****************************************************************************
Dependencies Changes:
****************************************************************************
No dependencies changed


****************************************************************************
Build Definition:
****************************************************************************
POM filename: pom.xml
Goals: clean deploy   
Arguments: --batch-mode -Pjava-1.7 -Dgpg.skip -Prelease
Build Fresh: false
Always Build: false
Default Build Definition: true
Schedule: COMMONS_SCHEDULE
Profile Name: Maven 3.0.5 with Java 7
Description: (Group) Build with Java 7 (Maven 3.0.5)

****************************************************************************
Test Summary:
****************************************************************************
Tests: 187
Failures: 1
Errors: 0
Success Rate: 99
Total time: 17.486

****************************************************************************
Test Failures:
****************************************************************************

SendWithAttachmentsTest
    testSendWAttachments :
  java.lang.AssertionError
  java.lang.AssertionError: didn't find expected message content in message body
	at org.junit.Assert.fail(Assert.java:88)
	at org.junit.Assert.assertTrue(Assert.java:41)
	at org.apache.commons.mail.AbstractEmailTest.validateSend(AbstractEmailTest.java:384)
	at org.apache.commons.mail.SendWithAttachmentsTest.testSendWAttachments(SendWithAttachmentsTest.java:174)


  


Mime
View raw message