commons-commits mailing list archives

Site index · List index
Message view « Date » · « Thread »
Top « Date » · « Thread »
From Apache Continuum <...@continuum.apache.org>
Subject [continuum] BUILD FAILURE: Apache Commons JCS - Apache Commons ((Group) Build with Java 7 (Maven 3.0.5))
Date Wed, 09 Dec 2015 15:26:42 GMT
Online report : https://continuum-ci.apache.org/continuum/buildResult.action?buildId=40644&projectId=286

Build statistics:
  State: Failed
  Previous State: Failed
  Started at: Wed 9 Dec 2015 15:21:42 +0000
  Finished at: Wed 9 Dec 2015 15:26:35 +0000
  Total time: 4m 53s
  Build Trigger: Schedule
  Build Number: 25
  Exit code: 1
  Building machine hostname: continuum-vm
  Operating system : Linux(unknown)
  Java Home version : 
          java version "1.7.0_65"
          OpenJDK Runtime Environment (IcedTea 2.5.3) (7u71-2.5.3-0ubuntu0.12.04.1)
          OpenJDK 64-Bit Server VM (build 24.65-b04, mixed mode)
        
  Builder version :
          Apache Maven 3.0.5 (r01de14724cdef164cd33c7c8c2fe155faf9602da; 2013-02-19 13:51:28+0000)
          Maven home: /opt/apache-maven-3.0.5
          Java version: 1.7.0_65, vendor: Oracle Corporation
          Java home: /usr/lib/jvm/java-7-openjdk-amd64/jre
          Default locale: en_US, platform encoding: ANSI_X3.4-1968
          OS name: "linux", version: "3.2.0-75-generic", arch: "amd64", family: "unix"
    
****************************************************************************
SCM Changes:
****************************************************************************
Changed: tv @ Wed 9 Dec 2015 15:12:16 +0000
Comment: Fix test
Files changed:
  /commons/proper/jcs/trunk/commons-jcs-core/src/test/java/org/apache/commons/jcs/engine/memory/fifo/FIFOMemoryCacheUnitTest.java
( 1718879 )

****************************************************************************
Dependencies Changes:
****************************************************************************
No dependencies changed


****************************************************************************
Build Definition:
****************************************************************************
POM filename: pom.xml
Goals: clean deploy   
Arguments: --batch-mode -Pjava-1.7 -Dgpg.skip -Prelease
Build Fresh: false
Always Build: false
Default Build Definition: true
Schedule: COMMONS_SCHEDULE
Profile Name: Maven 3.0.5 with Java 7
Description: (Group) Build with Java 7 (Maven 3.0.5)

****************************************************************************
Test Summary:
****************************************************************************
Tests: 427
Failures: 6
Errors: 0
Success Rate: 98
Total time: 195.36302

****************************************************************************
Test Failures:
****************************************************************************

BasicRemoteCacheClientServerUnitTest
    test1SinglePut :
  java.lang.AssertionError
  java.lang.AssertionError: Cache is alive expected:<ALIVE> but was:<ERROR>
	at org.junit.Assert.fail(Assert.java:88)
	at org.junit.Assert.failNotEquals(Assert.java:743)
	at org.junit.Assert.assertEquals(Assert.java:118)
	at org.apache.commons.jcs.auxiliary.remote.server.BasicRemoteCacheClientServerUnitTest.test1SinglePut(BasicRemoteCacheClientServerUnitTest.java:153)


    test2PutRemove :
  java.lang.AssertionError
  java.lang.AssertionError: Cache is alive expected:<ALIVE> but was:<ERROR>
	at org.junit.Assert.fail(Assert.java:88)
	at org.junit.Assert.failNotEquals(Assert.java:743)
	at org.junit.Assert.assertEquals(Assert.java:118)
	at org.apache.commons.jcs.auxiliary.remote.server.BasicRemoteCacheClientServerUnitTest.test2PutRemove(BasicRemoteCacheClientServerUnitTest.java:203)


    test3PutAndListen :
  java.lang.AssertionError
  java.lang.AssertionError: Cache is alive expected:<ALIVE> but was:<ERROR>
	at org.junit.Assert.fail(Assert.java:88)
	at org.junit.Assert.failNotEquals(Assert.java:743)
	at org.junit.Assert.assertEquals(Assert.java:118)
	at org.apache.commons.jcs.auxiliary.remote.server.BasicRemoteCacheClientServerUnitTest.test3PutAndListen(BasicRemoteCacheClientServerUnitTest.java:261)


    test4PutaMultipleAndListen :
  java.lang.AssertionError
  java.lang.AssertionError: Cache is alive expected:<ALIVE> but was:<ERROR>
	at org.junit.Assert.fail(Assert.java:88)
	at org.junit.Assert.failNotEquals(Assert.java:743)
	at org.junit.Assert.assertEquals(Assert.java:118)
	at org.apache.commons.jcs.auxiliary.remote.server.BasicRemoteCacheClientServerUnitTest.test4PutaMultipleAndListen(BasicRemoteCacheClientServerUnitTest.java:315)


  MySQLDiskCacheHsqlBackedUnitTest
    warning :
  junit.framework.AssertionFailedError
  junit.framework.AssertionFailedError: Exception in constructor: testPutGetMatchingWithHSQL
(java.sql.SQLException: Table already exists: JCS_STORE_MYSQL in statement [CREATE CACHED
TABLE JCS_STORE_MYSQL]
	at org.hsqldb.jdbc.Util.sqlException(Unknown Source)
	at org.hsqldb.jdbc.jdbcStatement.fetchResult(Unknown Source)
	at org.hsqldb.jdbc.jdbcStatement.execute(Unknown Source)
	at org.apache.commons.jcs.auxiliary.disk.jdbc.mysql.MySQLDiskCacheHsqlBackedUnitTest.setupTABLE(MySQLDiskCacheHsqlBackedUnitTest.java:201)
	at org.apache.commons.jcs.auxiliary.disk.jdbc.mysql.MySQLDiskCacheHsqlBackedUnitTest.<init>(MySQLDiskCacheHsqlBackedUnitTest.java:63)
	at sun.reflect.NativeConstructorAccessorImpl.newInstance0(Native Method)
	at sun.reflect.NativeConstructorAccessorImpl.newInstance(NativeConstructorAccessorImpl.java:57)
	at sun.reflect.DelegatingConstructorAccessorImpl.newInstance(DelegatingConstructorAccessorImpl.java:45)
	at java.lang.reflect.Constructor.newInstance(Constructor.java:526)
	at junit.framework.TestSuite.createTest(TestSuite.java:63)
	at junit.framework.TestSuite.addTestMethod(TestSuite.java:310)
	at junit.framework.TestSuite.addTestsFromTestCase(TestSuite.java:153)
	at junit.framework.TestSuite.<init>(TestSuite.java:132)
	at org.junit.internal.runners.JUnit38ClassRunner.<init>(JUnit38ClassRunner.java:72)
	at org.junit.internal.builders.JUnit3Builder.runnerForClass(JUnit3Builder.java:11)
	at org.junit.runners.model.RunnerBuilder.safeRunnerForClass(RunnerBuilder.java:59)
	at org.junit.internal.builders.AllDefaultPossibilitiesBuilder.runnerForClass(AllDefaultPossibilitiesBuilder.java:26)
	at org.junit.runners.model.RunnerBuilder.safeRunnerForClass(RunnerBuilder.java:59)
	at org.junit.internal.requests.ClassRequest.getRunner(ClassRequest.java:26)
	at org.apache.maven.surefire.junit4.JUnit4Provider.execute(JUnit4Provider.java:283)
	at org.apache.maven.surefire.junit4.JUnit4Provider.executeWithRerun(JUnit4Provider.java:173)
	at org.apache.maven.surefire.junit4.JUnit4Provider.executeTestSet(JUnit4Provider.java:153)
	at org.apache.maven.surefire.junit4.JUnit4Provider.invoke(JUnit4Provider.java:128)
	at org.apache.maven.surefire.booter.ForkedBooter.invokeProviderInSameClassLoader(ForkedBooter.java:203)
	at org.apache.maven.surefire.booter.ForkedBooter.runSuitesInProcess(ForkedBooter.java:155)
	at org.apache.maven.surefire.booter.ForkedBooter.main(ForkedBooter.java:103)
)
	at junit.framework.Assert.fail(Assert.java:57)
	at junit.framework.TestCase.fail(TestCase.java:227)
	at junit.framework.TestSuite$1.runTest(TestSuite.java:100)


    warning :
  junit.framework.AssertionFailedError
  junit.framework.AssertionFailedError: Exception in constructor: testSimpleJDBCPutGetWithHSQL
(java.sql.SQLException: Table already exists: JCS_STORE_MYSQL in statement [CREATE CACHED
TABLE JCS_STORE_MYSQL]
	at org.hsqldb.jdbc.Util.sqlException(Unknown Source)
	at org.hsqldb.jdbc.jdbcStatement.fetchResult(Unknown Source)
	at org.hsqldb.jdbc.jdbcStatement.execute(Unknown Source)
	at org.apache.commons.jcs.auxiliary.disk.jdbc.mysql.MySQLDiskCacheHsqlBackedUnitTest.setupTABLE(MySQLDiskCacheHsqlBackedUnitTest.java:201)
	at org.apache.commons.jcs.auxiliary.disk.jdbc.mysql.MySQLDiskCacheHsqlBackedUnitTest.<init>(MySQLDiskCacheHsqlBackedUnitTest.java:63)
	at sun.reflect.NativeConstructorAccessorImpl.newInstance0(Native Method)
	at sun.reflect.NativeConstructorAccessorImpl.newInstance(NativeConstructorAccessorImpl.java:57)
	at sun.reflect.DelegatingConstructorAccessorImpl.newInstance(DelegatingConstructorAccessorImpl.java:45)
	at java.lang.reflect.Constructor.newInstance(Constructor.java:526)
	at junit.framework.TestSuite.createTest(TestSuite.java:63)
	at junit.framework.TestSuite.addTestMethod(TestSuite.java:310)
	at junit.framework.TestSuite.addTestsFromTestCase(TestSuite.java:153)
	at junit.framework.TestSuite.<init>(TestSuite.java:132)
	at org.junit.internal.runners.JUnit38ClassRunner.<init>(JUnit38ClassRunner.java:72)
	at org.junit.internal.builders.JUnit3Builder.runnerForClass(JUnit3Builder.java:11)
	at org.junit.runners.model.RunnerBuilder.safeRunnerForClass(RunnerBuilder.java:59)
	at org.junit.internal.builders.AllDefaultPossibilitiesBuilder.runnerForClass(AllDefaultPossibilitiesBuilder.java:26)
	at org.junit.runners.model.RunnerBuilder.safeRunnerForClass(RunnerBuilder.java:59)
	at org.junit.internal.requests.ClassRequest.getRunner(ClassRequest.java:26)
	at org.apache.maven.surefire.junit4.JUnit4Provider.execute(JUnit4Provider.java:283)
	at org.apache.maven.surefire.junit4.JUnit4Provider.executeWithRerun(JUnit4Provider.java:173)
	at org.apache.maven.surefire.junit4.JUnit4Provider.executeTestSet(JUnit4Provider.java:153)
	at org.apache.maven.surefire.junit4.JUnit4Provider.invoke(JUnit4Provider.java:128)
	at org.apache.maven.surefire.booter.ForkedBooter.invokeProviderInSameClassLoader(ForkedBooter.java:203)
	at org.apache.maven.surefire.booter.ForkedBooter.runSuitesInProcess(ForkedBooter.java:155)
	at org.apache.maven.surefire.booter.ForkedBooter.main(ForkedBooter.java:103)
)
	at junit.framework.Assert.fail(Assert.java:57)
	at junit.framework.TestCase.fail(TestCase.java:227)
	at junit.framework.TestSuite$1.runTest(TestSuite.java:100)


  


Mime
View raw message