commons-commits mailing list archives

Site index · List index
Message view « Date » · « Thread »
Top « Date » · « Thread »
From Apache Continuum <...@continuum.apache.org>
Subject [continuum] BUILD FAILURE: Apache Commons JCS - Apache Commons ((Group) Build with Java 7 (Maven 3.0.5))
Date Fri, 20 Nov 2015 13:24:37 GMT
Online report : https://continuum-ci.apache.org/continuum/buildResult.action?buildId=40562&projectId=286

Build statistics:
  State: Failed
  Previous State: Ok
  Started at: Fri 20 Nov 2015 13:20:45 +0000
  Finished at: Fri 20 Nov 2015 13:24:31 +0000
  Total time: 3m 46s
  Build Trigger: Schedule
  Build Number: 25
  Exit code: 1
  Building machine hostname: continuum-vm
  Operating system : Linux(unknown)
  Java Home version : 
          java version "1.7.0_65"
          OpenJDK Runtime Environment (IcedTea 2.5.3) (7u71-2.5.3-0ubuntu0.12.04.1)
          OpenJDK 64-Bit Server VM (build 24.65-b04, mixed mode)
        
  Builder version :
          Apache Maven 3.0.5 (r01de14724cdef164cd33c7c8c2fe155faf9602da; 2013-02-19 13:51:28+0000)
          Maven home: /opt/apache-maven-3.0.5
          Java version: 1.7.0_65, vendor: Oracle Corporation
          Java home: /usr/lib/jvm/java-7-openjdk-amd64/jre
          Default locale: en_US, platform encoding: ANSI_X3.4-1968
          OS name: "linux", version: "3.2.0-75-generic", arch: "amd64", family: "unix"
    
****************************************************************************
SCM Changes:
****************************************************************************
Changed: tv @ Fri 20 Nov 2015 13:18:08 +0000
Comment: No longer serializable
Files changed:
  /commons/proper/jcs/trunk/commons-jcs-core/src/test/java/org/apache/commons/jcs/auxiliary/MockAuxiliaryCache.java
( 1715348 )
  /commons/proper/jcs/trunk/commons-jcs-core/src/test/java/org/apache/commons/jcs/auxiliary/lateral/socket/tcp/MockLateralCache.java
( 1715348 )
  /commons/proper/jcs/trunk/commons-jcs-core/src/test/java/org/apache/commons/jcs/auxiliary/remote/MockRemoteCacheClient.java
( 1715348 )

Changed: tv @ Fri 20 Nov 2015 13:18:39 +0000
Comment: No longer serializable
Files changed:
  /commons/proper/jcs/trunk/commons-jcs-core/src/test/java/org/apache/commons/jcs/engine/control/CompositeCacheDiskUsageUnitTest.java
( 1715349 )

Changed: tv @ Fri 20 Nov 2015 13:19:06 +0000
Comment: No longer serializable
Files changed:
  /commons/proper/jcs/trunk/commons-jcs-core/src/test/java/org/apache/commons/jcs/auxiliary/disk/AbstractDiskCacheUnitTest.java
( 1715350 )

Changed: tv @ Fri 20 Nov 2015 13:20:24 +0000
Comment: Support schedulers in cache factories
Files changed:
  /commons/proper/jcs/trunk/commons-jcs-core/src/main/java/org/apache/commons/jcs/engine/control/CompositeCacheConfigurator.java
( 1715351 )

****************************************************************************
Dependencies Changes:
****************************************************************************
No dependencies changed


****************************************************************************
Build Definition:
****************************************************************************
POM filename: pom.xml
Goals: clean deploy   
Arguments: --batch-mode -Pjava-1.7 -Dgpg.skip -Prelease
Build Fresh: false
Always Build: false
Default Build Definition: true
Schedule: COMMONS_SCHEDULE
Profile Name: Maven 3.0.5 with Java 7
Description: (Group) Build with Java 7 (Maven 3.0.5)

****************************************************************************
Test Summary:
****************************************************************************
Tests: 361
Failures: 4
Errors: 0
Success Rate: 98
Total time: 165.92203

****************************************************************************
Test Failures:
****************************************************************************

BasicRemoteCacheClientServerUnitTest
    test1SinglePut :
  java.lang.AssertionError
  java.lang.AssertionError: Cache is alive expected:<ALIVE> but was:<ERROR>
	at org.junit.Assert.fail(Assert.java:88)
	at org.junit.Assert.failNotEquals(Assert.java:743)
	at org.junit.Assert.assertEquals(Assert.java:118)
	at org.apache.commons.jcs.auxiliary.remote.server.BasicRemoteCacheClientServerUnitTest.test1SinglePut(BasicRemoteCacheClientServerUnitTest.java:153)


    test2PutRemove :
  java.lang.AssertionError
  java.lang.AssertionError: Cache is alive expected:<ALIVE> but was:<ERROR>
	at org.junit.Assert.fail(Assert.java:88)
	at org.junit.Assert.failNotEquals(Assert.java:743)
	at org.junit.Assert.assertEquals(Assert.java:118)
	at org.apache.commons.jcs.auxiliary.remote.server.BasicRemoteCacheClientServerUnitTest.test2PutRemove(BasicRemoteCacheClientServerUnitTest.java:203)


    test3PutAndListen :
  java.lang.AssertionError
  java.lang.AssertionError: Cache is alive expected:<ALIVE> but was:<ERROR>
	at org.junit.Assert.fail(Assert.java:88)
	at org.junit.Assert.failNotEquals(Assert.java:743)
	at org.junit.Assert.assertEquals(Assert.java:118)
	at org.apache.commons.jcs.auxiliary.remote.server.BasicRemoteCacheClientServerUnitTest.test3PutAndListen(BasicRemoteCacheClientServerUnitTest.java:261)


    test4PutaMultipleAndListen :
  java.lang.AssertionError
  java.lang.AssertionError: Cache is alive expected:<ALIVE> but was:<ERROR>
	at org.junit.Assert.fail(Assert.java:88)
	at org.junit.Assert.failNotEquals(Assert.java:743)
	at org.junit.Assert.assertEquals(Assert.java:118)
	at org.apache.commons.jcs.auxiliary.remote.server.BasicRemoteCacheClientServerUnitTest.test4PutaMultipleAndListen(BasicRemoteCacheClientServerUnitTest.java:315)


  


Mime
View raw message