commons-commits mailing list archives

Site index · List index
Message view « Date » · « Thread »
Top « Date » · « Thread »
From Apache Continuum <...@continuum.apache.org>
Subject [continuum] BUILD FAILURE: Apache Commons JCS - Apache Commons ((Group) Build with Java 7 (Maven 3.0.5))
Date Thu, 26 Nov 2015 18:32:25 GMT
Online report : https://continuum-ci.apache.org/continuum/buildResult.action?buildId=40605&projectId=286

Build statistics:
  State: Failed
  Previous State: Failed
  Started at: Thu 26 Nov 2015 18:28:11 +0000
  Finished at: Thu 26 Nov 2015 18:32:20 +0000
  Total time: 4m 8s
  Build Trigger: Schedule
  Build Number: 25
  Exit code: 1
  Building machine hostname: continuum-vm
  Operating system : Linux(unknown)
  Java Home version : 
          java version "1.7.0_65"
          OpenJDK Runtime Environment (IcedTea 2.5.3) (7u71-2.5.3-0ubuntu0.12.04.1)
          OpenJDK 64-Bit Server VM (build 24.65-b04, mixed mode)
        
  Builder version :
          Apache Maven 3.0.5 (r01de14724cdef164cd33c7c8c2fe155faf9602da; 2013-02-19 13:51:28+0000)
          Maven home: /opt/apache-maven-3.0.5
          Java version: 1.7.0_65, vendor: Oracle Corporation
          Java home: /usr/lib/jvm/java-7-openjdk-amd64/jre
          Default locale: en_US, platform encoding: ANSI_X3.4-1968
          OS name: "linux", version: "3.2.0-75-generic", arch: "amd64", family: "unix"
    
****************************************************************************
SCM Changes:
****************************************************************************
Changed: sebb @ Thu 26 Nov 2015 18:11:02 +0000
Comment: Releases
Files changed:
  /commons/proper/jcs/trunk/doap_jcs.rdf ( 1716752 )
  /commons/proper/vfs/trunk/doap_vfs.rdf ( 1716752 )

****************************************************************************
Dependencies Changes:
****************************************************************************
No dependencies changed


****************************************************************************
Build Definition:
****************************************************************************
POM filename: pom.xml
Goals: clean deploy   
Arguments: --batch-mode -Pjava-1.7 -Dgpg.skip -Prelease
Build Fresh: false
Always Build: false
Default Build Definition: true
Schedule: COMMONS_SCHEDULE
Profile Name: Maven 3.0.5 with Java 7
Description: (Group) Build with Java 7 (Maven 3.0.5)

****************************************************************************
Test Summary:
****************************************************************************
Tests: 428
Failures: 4
Errors: 0
Success Rate: 99
Total time: 190.71101

****************************************************************************
Test Failures:
****************************************************************************

BasicRemoteCacheClientServerUnitTest
    test1SinglePut :
  java.lang.AssertionError
  java.lang.AssertionError: Cache is alive expected:<ALIVE> but was:<ERROR>
	at org.junit.Assert.fail(Assert.java:88)
	at org.junit.Assert.failNotEquals(Assert.java:743)
	at org.junit.Assert.assertEquals(Assert.java:118)
	at org.apache.commons.jcs.auxiliary.remote.server.BasicRemoteCacheClientServerUnitTest.test1SinglePut(BasicRemoteCacheClientServerUnitTest.java:153)


    test2PutRemove :
  java.lang.AssertionError
  java.lang.AssertionError: Cache is alive expected:<ALIVE> but was:<ERROR>
	at org.junit.Assert.fail(Assert.java:88)
	at org.junit.Assert.failNotEquals(Assert.java:743)
	at org.junit.Assert.assertEquals(Assert.java:118)
	at org.apache.commons.jcs.auxiliary.remote.server.BasicRemoteCacheClientServerUnitTest.test2PutRemove(BasicRemoteCacheClientServerUnitTest.java:203)


    test3PutAndListen :
  java.lang.AssertionError
  java.lang.AssertionError: Cache is alive expected:<ALIVE> but was:<ERROR>
	at org.junit.Assert.fail(Assert.java:88)
	at org.junit.Assert.failNotEquals(Assert.java:743)
	at org.junit.Assert.assertEquals(Assert.java:118)
	at org.apache.commons.jcs.auxiliary.remote.server.BasicRemoteCacheClientServerUnitTest.test3PutAndListen(BasicRemoteCacheClientServerUnitTest.java:261)


    test4PutaMultipleAndListen :
  java.lang.AssertionError
  java.lang.AssertionError: Cache is alive expected:<ALIVE> but was:<ERROR>
	at org.junit.Assert.fail(Assert.java:88)
	at org.junit.Assert.failNotEquals(Assert.java:743)
	at org.junit.Assert.assertEquals(Assert.java:118)
	at org.apache.commons.jcs.auxiliary.remote.server.BasicRemoteCacheClientServerUnitTest.test4PutaMultipleAndListen(BasicRemoteCacheClientServerUnitTest.java:315)


  


Mime
View raw message