commons-commits mailing list archives

Site index · List index
Message view « Date » · « Thread »
Top « Date » · « Thread »
From Apache Continuum <...@continuum.apache.org>
Subject [continuum] BUILD FAILURE: Apache Commons Math - Apache Commons (Build with Java 7)
Date Fri, 10 Jul 2015 14:24:38 GMT
Online report : https://continuum-ci.apache.org/continuum/buildResult.action?buildId=40049&projectId=317

Build statistics:
  State: Failed
  Previous State: Ok
  Started at: Fri 10 Jul 2015 14:20:31 +0000
  Finished at: Fri 10 Jul 2015 14:24:36 +0000
  Total time: 4m 5s
  Build Trigger: Schedule
  Build Number: 75
  Exit code: 1
  Building machine hostname: continuum-vm
  Operating system : Linux(unknown)
  Java Home version : 
          java version "1.7.0_65"
          OpenJDK Runtime Environment (IcedTea 2.5.3) (7u71-2.5.3-0ubuntu0.12.04.1)
          OpenJDK 64-Bit Server VM (build 24.65-b04, mixed mode)
        
  Builder version :
          Apache Maven 3.0.5 (r01de14724cdef164cd33c7c8c2fe155faf9602da; 2013-02-19 13:51:28+0000)
          Maven home: /opt/apache-maven-3.0.5
          Java version: 1.7.0_65, vendor: Oracle Corporation
          Java home: /usr/lib/jvm/java-7-openjdk-amd64/jre
          Default locale: en_US, platform encoding: ANSI_X3.4-1968
          OS name: "linux", version: "3.2.0-75-generic", arch: "amd64", family: "unix"
    
****************************************************************************
SCM Changes:
****************************************************************************
Changed: no author @ no date
Comment: no comment
Files changed:
  .../geometry/euclidean/threed/PolyhedronsSet.java ( no revision )
  .../math4/geometry/euclidean/twod/Line.java ( no revision )
  .../math4/geometry/euclidean/twod/LineTest.java ( no revision )

****************************************************************************
Dependencies Changes:
****************************************************************************
No dependencies changed


****************************************************************************
Build Definition:
****************************************************************************
POM filename: pom.xml
Goals: clean deploy   
Arguments: --batch-mode -Pjava-1.7 -Dgpg.skip -Prelease
Build Fresh: false
Always Build: false
Default Build Definition: true
Schedule: COMMONS_SCHEDULE
Profile Name: Maven 3.0.5 with Java 7
Description: Build with Java 7

****************************************************************************
Test Summary:
****************************************************************************
Tests: 5830
Failures: 1
Errors: 0
Success Rate: 99
Total time: 166.34306

****************************************************************************
Test Failures:
****************************************************************************

CorrelatedRandomVectorGeneratorTest
    testSampleWithZeroCovariance :
  java.lang.AssertionError
  java.lang.AssertionError: Array comparison failure
 Elements at index 3 differ.  expected = 0.019023866 observed = 0.017970833621719577
	at org.junit.Assert.fail(Assert.java:88)
	at org.apache.commons.math4.TestUtils.assertEquals(TestUtils.java:364)
	at org.apache.commons.math4.TestUtils.assertEquals(TestUtils.java:101)
	at org.apache.commons.math4.random.CorrelatedRandomVectorGeneratorTest.testSampler(CorrelatedRandomVectorGeneratorTest.java:197)
	at org.apache.commons.math4.random.CorrelatedRandomVectorGeneratorTest.testSampleWithZeroCovariance(CorrelatedRandomVectorGeneratorTest.java:173)


  


Mime
View raw message