commons-commits mailing list archives

Site index · List index
Message view « Date » · « Thread »
Top « Date » · « Thread »
From Apache Continuum <...@continuum.apache.org>
Subject [continuum] BUILD FAILURE: Apache Commons Collections - Apache Commons ((Group) Build with Java 6 (Maven 3.0.5))
Date Sat, 13 Jun 2015 19:21:34 GMT
Online report : https://continuum-ci.apache.org/continuum/buildResult.action?buildId=39962&projectId=71

Build statistics:
  State: Failed
  Previous State: Ok
  Started at: Sat 13 Jun 2015 19:20:10 +0000
  Finished at: Sat 13 Jun 2015 19:21:32 +0000
  Total time: 1m 21s
  Build Trigger: Schedule
  Build Number: 358
  Exit code: 1
  Building machine hostname: continuum-vm
  Operating system : Linux(unknown)
  Java Home version : 
          java version "1.6.0_34"
          OpenJDK Runtime Environment (IcedTea6 1.13.6) (6b34-1.13.6-1ubuntu0.12.04.1)
          OpenJDK 64-Bit Server VM (build 23.25-b01, mixed mode)
        
  Builder version :
          Apache Maven 3.0.5 (r01de14724cdef164cd33c7c8c2fe155faf9602da; 2013-02-19 13:51:28+0000)
          Maven home: /opt/apache-maven-3.0.5
          Java version: 1.6.0_34, vendor: Sun Microsystems Inc.
          Java home: /usr/lib/jvm/java-6-openjdk-amd64/jre
          Default locale: en_US, platform encoding: ANSI_X3.4-1968
          OS name: "linux", version: "3.2.0-75-generic", arch: "amd64", family: "unix"
    
****************************************************************************
SCM Changes:
****************************************************************************
Changed: tn @ Sat 13 Jun 2015 18:27:11 +0000
Comment: Continue review of multimap package.
Files changed:
  /commons/proper/collections/trunk/src/main/java/org/apache/commons/collections4/ListValuedMap.java
( 1685299 )
  /commons/proper/collections/trunk/src/main/java/org/apache/commons/collections4/MultiMapUtils.java
( 1685299 )
  /commons/proper/collections/trunk/src/main/java/org/apache/commons/collections4/MultiValuedMap.java
( 1685299 )
  /commons/proper/collections/trunk/src/main/java/org/apache/commons/collections4/SetValuedMap.java
( 1685299 )
  /commons/proper/collections/trunk/src/main/java/org/apache/commons/collections4/multimap/AbstractListValuedMap.java
( 1685299 )
  /commons/proper/collections/trunk/src/main/java/org/apache/commons/collections4/multimap/AbstractMultiValuedMap.java
( 1685299 )
  /commons/proper/collections/trunk/src/main/java/org/apache/commons/collections4/multimap/AbstractMultiValuedMapDecorator.java
( 1685299 )
  /commons/proper/collections/trunk/src/main/java/org/apache/commons/collections4/multimap/AbstractSetValuedMap.java
( 1685299 )
  /commons/proper/collections/trunk/src/main/java/org/apache/commons/collections4/multimap/MultiValuedHashMap.java
( 1685299 )
  /commons/proper/collections/trunk/src/main/java/org/apache/commons/collections4/multimap/TransformedMultiValuedMap.java
( 1685299 )
  /commons/proper/collections/trunk/src/main/java/org/apache/commons/collections4/multimap/UnmodifiableMultiValuedMap.java
( 1685299 )
  /commons/proper/collections/trunk/src/test/java/org/apache/commons/collections4/multimap/AbstractMultiValuedMapTest.java
( 1685299 )
  /commons/proper/collections/trunk/src/test/java/org/apache/commons/collections4/multimap/MultiValuedHashMapTest.java
( 1685299 )
  /commons/proper/collections/trunk/src/test/java/org/apache/commons/collections4/multimap/TransformedMultiValuedMapTest.java
( 1685299 )
  /commons/proper/collections/trunk/src/test/resources/data/test/MultiValuedHashMap.emptyCollection.version4.1.obj
( 1685299 )
  /commons/proper/collections/trunk/src/test/resources/data/test/MultiValuedHashMap.fullCollection.version4.1.obj
( 1685299 )
  /commons/proper/collections/trunk/src/test/resources/data/test/TransformedMultiValuedMap.emptyCollection.version4.1.obj
( 1685299 )
  /commons/proper/collections/trunk/src/test/resources/data/test/TransformedMultiValuedMap.fullCollection.version4.1.obj
( 1685299 )
  /commons/proper/collections/trunk/src/test/resources/data/test/UnmodifiableMultiValuedMap.emptyCollection.version4.1.obj
( 1685299 )
  /commons/proper/collections/trunk/src/test/resources/data/test/UnmodifiableMultiValuedMap.fullCollection.version4.1.obj
( 1685299 )

****************************************************************************
Dependencies Changes:
****************************************************************************
No dependencies changed


****************************************************************************
Build Definition:
****************************************************************************
POM filename: pom.xml
Goals: clean deploy   
Arguments: --batch-mode -Pjava-1.6 -Dgpg.skip -Prelease
Build Fresh: false
Always Build: false
Default Build Definition: true
Schedule: COMMONS_SCHEDULE
Profile Name: Maven 3.0.5
Description: (Group) Build with Java 6 (Maven 3.0.5)

****************************************************************************
Test Summary:
****************************************************************************
Tests: 15429
Failures: 1
Errors: 0
Success Rate: 99
Total time: 23.528997

****************************************************************************
Test Failures:
****************************************************************************

MultiMapUtilsTest
    testGetCollection :
  java.lang.AssertionError
  java.lang.AssertionError: expected null, but was:<[]>
	at org.junit.Assert.fail(Assert.java:88)
	at org.junit.Assert.failNotNull(Assert.java:664)
	at org.junit.Assert.assertNull(Assert.java:646)
	at org.junit.Assert.assertNull(Assert.java:656)
	at org.apache.commons.collections4.MultiMapUtilsTest.testGetCollection(MultiMapUtilsTest.java:93)


  


Mime
View raw message