commons-commits mailing list archives

Site index · List index
Message view « Date » · « Thread »
Top « Date » · « Thread »
From Apache Jenkins Server <jenk...@builds.apache.org>
Subject Build failed in Jenkins: Commons Math #149
Date Mon, 06 Apr 2015 15:15:11 GMT
See <https://builds.apache.org/job/Commons%20Math/149/>

------------------------------------------
[...truncated 1039 lines...]
[WARNING] <https://builds.apache.org/job/Commons%20Math/ws/src/main/java/org/apache/commons/math4/random/RandomDataGenerator.java>:275:
warning - @inheritDoc used but nextSecureHexString(int) does not override or implement any
method.
[WARNING] <https://builds.apache.org/job/Commons%20Math/ws/src/main/java/org/apache/commons/math4/random/RandomDataGenerator.java>:325:
warning - @inheritDoc used but nextSecureInt(int, int) does not override or implement any
method.
[WARNING] <https://builds.apache.org/job/Commons%20Math/ws/src/main/java/org/apache/commons/math4/random/RandomDataGenerator.java>:330:
warning - @inheritDoc used but nextSecureLong(long, long) does not override or implement any
method.
[WARNING] <https://builds.apache.org/job/Commons%20Math/ws/src/main/java/org/apache/commons/math4/random/RandomDataGenerator.java>:369:
warning - @inheritDoc used but nextPoisson(double) does not override or implement any method.
[WARNING] <https://builds.apache.org/job/Commons%20Math/ws/src/main/java/org/apache/commons/math4/random/RandomDataGenerator.java>:376:
warning - @inheritDoc used but nextGaussian(double, double) does not override or implement
any method.
[WARNING] <https://builds.apache.org/job/Commons%20Math/ws/src/main/java/org/apache/commons/math4/random/RandomDataGenerator.java>:394:
warning - @inheritDoc used but nextExponential(double) does not override or implement any
method.
[WARNING] <https://builds.apache.org/job/Commons%20Math/ws/src/main/java/org/apache/commons/math4/random/RandomDataGenerator.java>:569:
warning - @inheritDoc used but nextUniform(double, double) does not override or implement
any method.
[WARNING] <https://builds.apache.org/job/Commons%20Math/ws/src/main/java/org/apache/commons/math4/random/RandomDataGenerator.java>:589:
warning - @inheritDoc used but nextUniform(double, double, boolean) does not override or implement
any method.
[WARNING] <https://builds.apache.org/job/Commons%20Math/ws/src/main/java/org/apache/commons/math4/random/RandomDataGenerator.java>:629:
warning - @inheritDoc used but nextPermutation(int, int) does not override or implement any
method.
[WARNING] <https://builds.apache.org/job/Commons%20Math/ws/src/main/java/org/apache/commons/math4/random/RandomDataGenerator.java>:653:
warning - @inheritDoc used but nextSample(Collection<?>, int) does not override or implement
any method.
[WARNING] <https://builds.apache.org/job/Commons%20Math/ws/src/main/java/org/apache/commons/math4/random/ValueServer.java>:353:
warning - Tag @link: reference not found: RandomDataImpl
[WARNING] <https://builds.apache.org/job/Commons%20Math/ws/src/main/java/org/apache/commons/math4/geometry/euclidean/twod/PolygonsSet.java>:150:
warning - Tag @link: can't find PolygonsSet(Collection) in org.apache.commons.math4.geometry.euclidean.twod.PolygonsSet
[WARNING] <https://builds.apache.org/job/Commons%20Math/ws/src/main/java/org/apache/commons/math4/linear/ArrayFieldVector.java>:61:
warning - Tag @link: can't find ArrayFieldVector(ArrayFieldVector, ArrayFieldVector) in org.apache.commons.math4.linear.ArrayFieldVector
[WARNING] <https://builds.apache.org/job/Commons%20Math/ws/src/main/java/org/apache/commons/math4/optim/nonlinear/scalar/MultivariateFunctionMappingAdapter.java>:80:
warning - Tag @link: reference not found: org.apache.commons.math4.optimization.BaseMultivariateOptimizer#optimize(int,
[WARNING] MultivariateFunction, org.apache.commons.math4.optimization.GoalType, double[])
[WARNING] <https://builds.apache.org/job/Commons%20Math/ws/src/main/java/org/apache/commons/math4/optim/univariate/SimpleUnivariateValueChecker.java>:40:
warning - Tag @link: reference not found: org.apache.commons.math4.optimization.ConvergenceChecker
[WARNING] <https://builds.apache.org/job/Commons%20Math/ws/src/main/java/org/apache/commons/math4/fitting/WeightedObservedPoint.java>:27:
warning - Tag @link: reference not found: CurveFitter curve fitting
[WARNING] <https://builds.apache.org/job/Commons%20Math/ws/src/main/java/org/apache/commons/math4/optim/univariate/SimpleUnivariateValueChecker.java>:40:
warning - Tag @link: reference not found: org.apache.commons.math4.optimization.ConvergenceChecker
[WARNING] <https://builds.apache.org/job/Commons%20Math/ws/src/main/java/org/apache/commons/math4/random/RandomDataGenerator.java>:569:
warning - @inheritDoc used but nextUniform(double, double) does not override or implement
any method.
[WARNING] <https://builds.apache.org/job/Commons%20Math/ws/src/main/java/org/apache/commons/math4/random/RandomDataGenerator.java>:589:
warning - @inheritDoc used but nextUniform(double, double, boolean) does not override or implement
any method.
[WARNING] <https://builds.apache.org/job/Commons%20Math/ws/src/main/java/org/apache/commons/math4/random/RandomDataGenerator.java>:394:
warning - @inheritDoc used but nextExponential(double) does not override or implement any
method.
[WARNING] <https://builds.apache.org/job/Commons%20Math/ws/src/main/java/org/apache/commons/math4/random/RandomDataGenerator.java>:376:
warning - @inheritDoc used but nextGaussian(double, double) does not override or implement
any method.
[WARNING] <https://builds.apache.org/job/Commons%20Math/ws/src/main/java/org/apache/commons/math4/random/RandomDataGenerator.java>:161:
warning - @inheritDoc used but nextHexString(int) does not override or implement any method.
[WARNING] <https://builds.apache.org/job/Commons%20Math/ws/src/main/java/org/apache/commons/math4/random/RandomDataGenerator.java>:629:
warning - @inheritDoc used but nextPermutation(int, int) does not override or implement any
method.
[WARNING] <https://builds.apache.org/job/Commons%20Math/ws/src/main/java/org/apache/commons/math4/random/RandomDataGenerator.java>:369:
warning - @inheritDoc used but nextPoisson(double) does not override or implement any method.
[WARNING] <https://builds.apache.org/job/Commons%20Math/ws/src/main/java/org/apache/commons/math4/random/RandomDataGenerator.java>:653:
warning - @inheritDoc used but nextSample(Collection<?>, int) does not override or implement
any method.
[WARNING] <https://builds.apache.org/job/Commons%20Math/ws/src/main/java/org/apache/commons/math4/random/RandomDataGenerator.java>:275:
warning - @inheritDoc used but nextSecureHexString(int) does not override or implement any
method.
[WARNING] <https://builds.apache.org/job/Commons%20Math/ws/src/main/java/org/apache/commons/math4/random/RandomDataGenerator.java>:197:
warning - @inheritDoc used but nextInt(int, int) does not override or implement any method.
[WARNING] <https://builds.apache.org/job/Commons%20Math/ws/src/main/java/org/apache/commons/math4/random/RandomDataGenerator.java>:202:
warning - @inheritDoc used but nextLong(long, long) does not override or implement any method.
[WARNING] <https://builds.apache.org/job/Commons%20Math/ws/src/main/java/org/apache/commons/math4/random/RandomDataGenerator.java>:629:
warning - @inheritDoc used but nextPermutation(int, int) does not override or implement any
method.
[WARNING] <https://builds.apache.org/job/Commons%20Math/ws/src/main/java/org/apache/commons/math4/random/RandomDataGenerator.java>:653:
warning - @inheritDoc used but nextSample(Collection<?>, int) does not override or implement
any method.
[WARNING] <https://builds.apache.org/job/Commons%20Math/ws/src/main/java/org/apache/commons/math4/random/RandomDataGenerator.java>:325:
warning - @inheritDoc used but nextSecureInt(int, int) does not override or implement any
method.
[WARNING] <https://builds.apache.org/job/Commons%20Math/ws/src/main/java/org/apache/commons/math4/random/RandomDataGenerator.java>:330:
warning - @inheritDoc used but nextSecureLong(long, long) does not override or implement any
method.
[WARNING] <https://builds.apache.org/job/Commons%20Math/ws/src/main/java/org/apache/commons/math4/random/RandomDataGenerator.java>:569:
warning - @inheritDoc used but nextUniform(double, double) does not override or implement
any method.
[WARNING] <https://builds.apache.org/job/Commons%20Math/ws/src/main/java/org/apache/commons/math4/random/RandomDataGenerator.java>:589:
warning - @inheritDoc used but nextUniform(double, double, boolean) does not override or implement
any method.
[WARNING] <https://builds.apache.org/job/Commons%20Math/ws/src/main/java/org/apache/commons/math4/random/RandomDataGenerator.java>:569:
warning - @inheritDoc used but nextUniform(double, double) does not override or implement
any method.
[WARNING] <https://builds.apache.org/job/Commons%20Math/ws/src/main/java/org/apache/commons/math4/random/RandomDataGenerator.java>:589:
warning - @inheritDoc used but nextUniform(double, double, boolean) does not override or implement
any method.
[WARNING] <https://builds.apache.org/job/Commons%20Math/ws/src/main/java/org/apache/commons/math4/optim/univariate/SimpleUnivariateValueChecker.java>:40:
warning - Tag @link: reference not found: org.apache.commons.math4.optimization.ConvergenceChecker
[WARNING] <https://builds.apache.org/job/Commons%20Math/ws/src/main/java/org/apache/commons/math4/optim/univariate/SimpleUnivariateValueChecker.java>:40:
warning - Tag @link: reference not found: org.apache.commons.math4.optimization.ConvergenceChecker
[WARNING] <https://builds.apache.org/job/Commons%20Math/ws/src/main/java/org/apache/commons/math4/fitting/WeightedObservedPoint.java>:27:
warning - Tag @link: reference not found: CurveFitter curve fitting
[WARNING] <https://builds.apache.org/job/Commons%20Math/ws/src/main/java/org/apache/commons/math4/random/RandomDataGenerator.java>:394:
warning - @inheritDoc used but nextExponential(double) does not override or implement any
method.
[WARNING] <https://builds.apache.org/job/Commons%20Math/ws/src/main/java/org/apache/commons/math4/random/RandomDataGenerator.java>:376:
warning - @inheritDoc used but nextGaussian(double, double) does not override or implement
any method.
[WARNING] <https://builds.apache.org/job/Commons%20Math/ws/src/main/java/org/apache/commons/math4/random/RandomDataGenerator.java>:161:
warning - @inheritDoc used but nextHexString(int) does not override or implement any method.
[WARNING] <https://builds.apache.org/job/Commons%20Math/ws/src/main/java/org/apache/commons/math4/random/RandomDataGenerator.java>:197:
warning - @inheritDoc used but nextInt(int, int) does not override or implement any method.
[WARNING] <https://builds.apache.org/job/Commons%20Math/ws/src/main/java/org/apache/commons/math4/random/RandomDataGenerator.java>:202:
warning - @inheritDoc used but nextLong(long, long) does not override or implement any method.
[WARNING] <https://builds.apache.org/job/Commons%20Math/ws/src/main/java/org/apache/commons/math4/random/RandomDataGenerator.java>:629:
warning - @inheritDoc used but nextPermutation(int, int) does not override or implement any
method.
[WARNING] <https://builds.apache.org/job/Commons%20Math/ws/src/main/java/org/apache/commons/math4/random/RandomDataGenerator.java>:369:
warning - @inheritDoc used but nextPoisson(double) does not override or implement any method.
[WARNING] <https://builds.apache.org/job/Commons%20Math/ws/src/main/java/org/apache/commons/math4/random/RandomDataGenerator.java>:653:
warning - @inheritDoc used but nextSample(Collection<?>, int) does not override or implement
any method.
[WARNING] <https://builds.apache.org/job/Commons%20Math/ws/src/main/java/org/apache/commons/math4/random/RandomDataGenerator.java>:275:
warning - @inheritDoc used but nextSecureHexString(int) does not override or implement any
method.
[WARNING] <https://builds.apache.org/job/Commons%20Math/ws/src/main/java/org/apache/commons/math4/random/RandomDataGenerator.java>:325:
warning - @inheritDoc used but nextSecureInt(int, int) does not override or implement any
method.
[WARNING] <https://builds.apache.org/job/Commons%20Math/ws/src/main/java/org/apache/commons/math4/random/RandomDataGenerator.java>:330:
warning - @inheritDoc used but nextSecureLong(long, long) does not override or implement any
method.
[WARNING] <https://builds.apache.org/job/Commons%20Math/ws/src/main/java/org/apache/commons/math4/random/RandomDataGenerator.java>:569:
warning - @inheritDoc used but nextUniform(double, double) does not override or implement
any method.
[WARNING] <https://builds.apache.org/job/Commons%20Math/ws/src/main/java/org/apache/commons/math4/random/RandomDataGenerator.java>:589:
warning - @inheritDoc used but nextUniform(double, double, boolean) does not override or implement
any method.
[WARNING] <https://builds.apache.org/job/Commons%20Math/ws/src/main/java/org/apache/commons/math4/optim/univariate/SimpleUnivariateValueChecker.java>:40:
warning - Tag @link: reference not found: org.apache.commons.math4.optimization.ConvergenceChecker
[WARNING] <https://builds.apache.org/job/Commons%20Math/ws/src/main/java/org/apache/commons/math4/fitting/WeightedObservedPoint.java>:27:
warning - Tag @link: reference not found: CurveFitter curve fitting
[JENKINS] Archiving  javadoc
[INFO] 
[INFO] --- maven-javadoc-plugin:2.10.1:jar (create-javadoc-jar) @ commons-math4 ---
[INFO] 
71 warnings
[WARNING] Javadoc Warnings
[WARNING] <https://builds.apache.org/job/Commons%20Math/ws/src/main/java/org/apache/commons/math4/fitting/WeightedObservedPoint.java>:27:
warning - Tag @link: reference not found: CurveFitter curve fitting
[WARNING] <https://builds.apache.org/job/Commons%20Math/ws/src/main/java/org/apache/commons/math4/random/RandomDataGenerator.java>:394:
warning - @inheritDoc used but nextExponential(double) does not override or implement any
method.
[WARNING] <https://builds.apache.org/job/Commons%20Math/ws/src/main/java/org/apache/commons/math4/random/RandomDataGenerator.java>:376:
warning - @inheritDoc used but nextGaussian(double, double) does not override or implement
any method.
[WARNING] <https://builds.apache.org/job/Commons%20Math/ws/src/main/java/org/apache/commons/math4/random/RandomDataGenerator.java>:161:
warning - @inheritDoc used but nextHexString(int) does not override or implement any method.
[WARNING] <https://builds.apache.org/job/Commons%20Math/ws/src/main/java/org/apache/commons/math4/random/RandomDataGenerator.java>:197:
warning - @inheritDoc used but nextInt(int, int) does not override or implement any method.
[WARNING] <https://builds.apache.org/job/Commons%20Math/ws/src/main/java/org/apache/commons/math4/random/RandomDataGenerator.java>:202:
warning - @inheritDoc used but nextLong(long, long) does not override or implement any method.
[WARNING] <https://builds.apache.org/job/Commons%20Math/ws/src/main/java/org/apache/commons/math4/random/RandomDataGenerator.java>:629:
warning - @inheritDoc used but nextPermutation(int, int) does not override or implement any
method.
[WARNING] <https://builds.apache.org/job/Commons%20Math/ws/src/main/java/org/apache/commons/math4/random/RandomDataGenerator.java>:369:
warning - @inheritDoc used but nextPoisson(double) does not override or implement any method.
[WARNING] <https://builds.apache.org/job/Commons%20Math/ws/src/main/java/org/apache/commons/math4/random/RandomDataGenerator.java>:653:
warning - @inheritDoc used but nextSample(Collection<?>, int) does not override or implement
any method.
[WARNING] <https://builds.apache.org/job/Commons%20Math/ws/src/main/java/org/apache/commons/math4/random/RandomDataGenerator.java>:275:
warning - @inheritDoc used but nextSecureHexString(int) does not override or implement any
method.
[WARNING] <https://builds.apache.org/job/Commons%20Math/ws/src/main/java/org/apache/commons/math4/random/RandomDataGenerator.java>:325:
warning - @inheritDoc used but nextSecureInt(int, int) does not override or implement any
method.
[WARNING] <https://builds.apache.org/job/Commons%20Math/ws/src/main/java/org/apache/commons/math4/random/RandomDataGenerator.java>:330:
warning - @inheritDoc used but nextSecureLong(long, long) does not override or implement any
method.
[WARNING] <https://builds.apache.org/job/Commons%20Math/ws/src/main/java/org/apache/commons/math4/random/RandomDataGenerator.java>:569:
warning - @inheritDoc used but nextUniform(double, double) does not override or implement
any method.
[WARNING] <https://builds.apache.org/job/Commons%20Math/ws/src/main/java/org/apache/commons/math4/random/RandomDataGenerator.java>:589:
warning - @inheritDoc used but nextUniform(double, double, boolean) does not override or implement
any method.
[WARNING] <https://builds.apache.org/job/Commons%20Math/ws/src/main/java/org/apache/commons/math4/random/RandomDataGenerator.java>:161:
warning - @inheritDoc used but nextHexString(int) does not override or implement any method.
[WARNING] <https://builds.apache.org/job/Commons%20Math/ws/src/main/java/org/apache/commons/math4/random/RandomDataGenerator.java>:197:
warning - @inheritDoc used but nextInt(int, int) does not override or implement any method.
[WARNING] <https://builds.apache.org/job/Commons%20Math/ws/src/main/java/org/apache/commons/math4/random/RandomDataGenerator.java>:202:
warning - @inheritDoc used but nextLong(long, long) does not override or implement any method.
[WARNING] <https://builds.apache.org/job/Commons%20Math/ws/src/main/java/org/apache/commons/math4/random/RandomDataGenerator.java>:275:
warning - @inheritDoc used but nextSecureHexString(int) does not override or implement any
method.
[WARNING] <https://builds.apache.org/job/Commons%20Math/ws/src/main/java/org/apache/commons/math4/random/RandomDataGenerator.java>:325:
warning - @inheritDoc used but nextSecureInt(int, int) does not override or implement any
method.
[WARNING] <https://builds.apache.org/job/Commons%20Math/ws/src/main/java/org/apache/commons/math4/random/RandomDataGenerator.java>:330:
warning - @inheritDoc used but nextSecureLong(long, long) does not override or implement any
method.
[WARNING] <https://builds.apache.org/job/Commons%20Math/ws/src/main/java/org/apache/commons/math4/random/RandomDataGenerator.java>:369:
warning - @inheritDoc used but nextPoisson(double) does not override or implement any method.
[WARNING] <https://builds.apache.org/job/Commons%20Math/ws/src/main/java/org/apache/commons/math4/random/RandomDataGenerator.java>:376:
warning - @inheritDoc used but nextGaussian(double, double) does not override or implement
any method.
[WARNING] <https://builds.apache.org/job/Commons%20Math/ws/src/main/java/org/apache/commons/math4/random/RandomDataGenerator.java>:394:
warning - @inheritDoc used but nextExponential(double) does not override or implement any
method.
[WARNING] <https://builds.apache.org/job/Commons%20Math/ws/src/main/java/org/apache/commons/math4/random/RandomDataGenerator.java>:569:
warning - @inheritDoc used but nextUniform(double, double) does not override or implement
any method.
[WARNING] <https://builds.apache.org/job/Commons%20Math/ws/src/main/java/org/apache/commons/math4/random/RandomDataGenerator.java>:589:
warning - @inheritDoc used but nextUniform(double, double, boolean) does not override or implement
any method.
[WARNING] <https://builds.apache.org/job/Commons%20Math/ws/src/main/java/org/apache/commons/math4/random/RandomDataGenerator.java>:629:
warning - @inheritDoc used but nextPermutation(int, int) does not override or implement any
method.
[WARNING] <https://builds.apache.org/job/Commons%20Math/ws/src/main/java/org/apache/commons/math4/random/RandomDataGenerator.java>:653:
warning - @inheritDoc used but nextSample(Collection<?>, int) does not override or implement
any method.
[WARNING] <https://builds.apache.org/job/Commons%20Math/ws/src/main/java/org/apache/commons/math4/random/ValueServer.java>:353:
warning - Tag @link: reference not found: RandomDataImpl
[WARNING] <https://builds.apache.org/job/Commons%20Math/ws/src/main/java/org/apache/commons/math4/geometry/euclidean/twod/PolygonsSet.java>:150:
warning - Tag @link: can't find PolygonsSet(Collection) in org.apache.commons.math4.geometry.euclidean.twod.PolygonsSet
[WARNING] <https://builds.apache.org/job/Commons%20Math/ws/src/main/java/org/apache/commons/math4/linear/ArrayFieldVector.java>:61:
warning - Tag @link: can't find ArrayFieldVector(ArrayFieldVector, ArrayFieldVector) in org.apache.commons.math4.linear.ArrayFieldVector
[WARNING] <https://builds.apache.org/job/Commons%20Math/ws/src/main/java/org/apache/commons/math4/optim/nonlinear/scalar/MultivariateFunctionMappingAdapter.java>:80:
warning - Tag @link: reference not found: org.apache.commons.math4.optimization.BaseMultivariateOptimizer#optimize(int,
[WARNING] MultivariateFunction, org.apache.commons.math4.optimization.GoalType, double[])
[WARNING] <https://builds.apache.org/job/Commons%20Math/ws/src/main/java/org/apache/commons/math4/optim/univariate/SimpleUnivariateValueChecker.java>:40:
warning - Tag @link: reference not found: org.apache.commons.math4.optimization.ConvergenceChecker
[WARNING] <https://builds.apache.org/job/Commons%20Math/ws/src/main/java/org/apache/commons/math4/fitting/WeightedObservedPoint.java>:27:
warning - Tag @link: reference not found: CurveFitter curve fitting
[WARNING] <https://builds.apache.org/job/Commons%20Math/ws/src/main/java/org/apache/commons/math4/optim/univariate/SimpleUnivariateValueChecker.java>:40:
warning - Tag @link: reference not found: org.apache.commons.math4.optimization.ConvergenceChecker
[WARNING] <https://builds.apache.org/job/Commons%20Math/ws/src/main/java/org/apache/commons/math4/random/RandomDataGenerator.java>:569:
warning - @inheritDoc used but nextUniform(double, double) does not override or implement
any method.
[WARNING] <https://builds.apache.org/job/Commons%20Math/ws/src/main/java/org/apache/commons/math4/random/RandomDataGenerator.java>:589:
warning - @inheritDoc used but nextUniform(double, double, boolean) does not override or implement
any method.
[WARNING] <https://builds.apache.org/job/Commons%20Math/ws/src/main/java/org/apache/commons/math4/random/RandomDataGenerator.java>:394:
warning - @inheritDoc used but nextExponential(double) does not override or implement any
method.
[WARNING] <https://builds.apache.org/job/Commons%20Math/ws/src/main/java/org/apache/commons/math4/random/RandomDataGenerator.java>:376:
warning - @inheritDoc used but nextGaussian(double, double) does not override or implement
any method.
[WARNING] <https://builds.apache.org/job/Commons%20Math/ws/src/main/java/org/apache/commons/math4/random/RandomDataGenerator.java>:161:
warning - @inheritDoc used but nextHexString(int) does not override or implement any method.
[WARNING] <https://builds.apache.org/job/Commons%20Math/ws/src/main/java/org/apache/commons/math4/random/RandomDataGenerator.java>:629:
warning - @inheritDoc used but nextPermutation(int, int) does not override or implement any
method.
[WARNING] <https://builds.apache.org/job/Commons%20Math/ws/src/main/java/org/apache/commons/math4/random/RandomDataGenerator.java>:369:
warning - @inheritDoc used but nextPoisson(double) does not override or implement any method.
[WARNING] <https://builds.apache.org/job/Commons%20Math/ws/src/main/java/org/apache/commons/math4/random/RandomDataGenerator.java>:653:
warning - @inheritDoc used but nextSample(Collection<?>, int) does not override or implement
any method.
[WARNING] <https://builds.apache.org/job/Commons%20Math/ws/src/main/java/org/apache/commons/math4/random/RandomDataGenerator.java>:275:
warning - @inheritDoc used but nextSecureHexString(int) does not override or implement any
method.
[WARNING] <https://builds.apache.org/job/Commons%20Math/ws/src/main/java/org/apache/commons/math4/random/RandomDataGenerator.java>:197:
warning - @inheritDoc used but nextInt(int, int) does not override or implement any method.
[WARNING] <https://builds.apache.org/job/Commons%20Math/ws/src/main/java/org/apache/commons/math4/random/RandomDataGenerator.java>:202:
warning - @inheritDoc used but nextLong(long, long) does not override or implement any method.
[WARNING] <https://builds.apache.org/job/Commons%20Math/ws/src/main/java/org/apache/commons/math4/random/RandomDataGenerator.java>:629:
warning - @inheritDoc used but nextPermutation(int, int) does not override or implement any
method.
[WARNING] <https://builds.apache.org/job/Commons%20Math/ws/src/main/java/org/apache/commons/math4/random/RandomDataGenerator.java>:653:
warning - @inheritDoc used but nextSample(Collection<?>, int) does not override or implement
any method.
[WARNING] <https://builds.apache.org/job/Commons%20Math/ws/src/main/java/org/apache/commons/math4/random/RandomDataGenerator.java>:325:
warning - @inheritDoc used but nextSecureInt(int, int) does not override or implement any
method.
[WARNING] <https://builds.apache.org/job/Commons%20Math/ws/src/main/java/org/apache/commons/math4/random/RandomDataGenerator.java>:330:
warning - @inheritDoc used but nextSecureLong(long, long) does not override or implement any
method.
[WARNING] <https://builds.apache.org/job/Commons%20Math/ws/src/main/java/org/apache/commons/math4/random/RandomDataGenerator.java>:569:
warning - @inheritDoc used but nextUniform(double, double) does not override or implement
any method.
[WARNING] <https://builds.apache.org/job/Commons%20Math/ws/src/main/java/org/apache/commons/math4/random/RandomDataGenerator.java>:589:
warning - @inheritDoc used but nextUniform(double, double, boolean) does not override or implement
any method.
[WARNING] <https://builds.apache.org/job/Commons%20Math/ws/src/main/java/org/apache/commons/math4/random/RandomDataGenerator.java>:569:
warning - @inheritDoc used but nextUniform(double, double) does not override or implement
any method.
[WARNING] <https://builds.apache.org/job/Commons%20Math/ws/src/main/java/org/apache/commons/math4/random/RandomDataGenerator.java>:589:
warning - @inheritDoc used but nextUniform(double, double, boolean) does not override or implement
any method.
[WARNING] <https://builds.apache.org/job/Commons%20Math/ws/src/main/java/org/apache/commons/math4/optim/univariate/SimpleUnivariateValueChecker.java>:40:
warning - Tag @link: reference not found: org.apache.commons.math4.optimization.ConvergenceChecker
[WARNING] <https://builds.apache.org/job/Commons%20Math/ws/src/main/java/org/apache/commons/math4/optim/univariate/SimpleUnivariateValueChecker.java>:40:
warning - Tag @link: reference not found: org.apache.commons.math4.optimization.ConvergenceChecker
[WARNING] <https://builds.apache.org/job/Commons%20Math/ws/src/main/java/org/apache/commons/math4/fitting/WeightedObservedPoint.java>:27:
warning - Tag @link: reference not found: CurveFitter curve fitting
[WARNING] <https://builds.apache.org/job/Commons%20Math/ws/src/main/java/org/apache/commons/math4/random/RandomDataGenerator.java>:394:
warning - @inheritDoc used but nextExponential(double) does not override or implement any
method.
[WARNING] <https://builds.apache.org/job/Commons%20Math/ws/src/main/java/org/apache/commons/math4/random/RandomDataGenerator.java>:376:
warning - @inheritDoc used but nextGaussian(double, double) does not override or implement
any method.
[WARNING] <https://builds.apache.org/job/Commons%20Math/ws/src/main/java/org/apache/commons/math4/random/RandomDataGenerator.java>:161:
warning - @inheritDoc used but nextHexString(int) does not override or implement any method.
[WARNING] <https://builds.apache.org/job/Commons%20Math/ws/src/main/java/org/apache/commons/math4/random/RandomDataGenerator.java>:197:
warning - @inheritDoc used but nextInt(int, int) does not override or implement any method.
[WARNING] <https://builds.apache.org/job/Commons%20Math/ws/src/main/java/org/apache/commons/math4/random/RandomDataGenerator.java>:202:
warning - @inheritDoc used but nextLong(long, long) does not override or implement any method.
[WARNING] <https://builds.apache.org/job/Commons%20Math/ws/src/main/java/org/apache/commons/math4/random/RandomDataGenerator.java>:629:
warning - @inheritDoc used but nextPermutation(int, int) does not override or implement any
method.
[WARNING] <https://builds.apache.org/job/Commons%20Math/ws/src/main/java/org/apache/commons/math4/random/RandomDataGenerator.java>:369:
warning - @inheritDoc used but nextPoisson(double) does not override or implement any method.
[WARNING] <https://builds.apache.org/job/Commons%20Math/ws/src/main/java/org/apache/commons/math4/random/RandomDataGenerator.java>:653:
warning - @inheritDoc used but nextSample(Collection<?>, int) does not override or implement
any method.
[WARNING] <https://builds.apache.org/job/Commons%20Math/ws/src/main/java/org/apache/commons/math4/random/RandomDataGenerator.java>:275:
warning - @inheritDoc used but nextSecureHexString(int) does not override or implement any
method.
[WARNING] <https://builds.apache.org/job/Commons%20Math/ws/src/main/java/org/apache/commons/math4/random/RandomDataGenerator.java>:325:
warning - @inheritDoc used but nextSecureInt(int, int) does not override or implement any
method.
[WARNING] <https://builds.apache.org/job/Commons%20Math/ws/src/main/java/org/apache/commons/math4/random/RandomDataGenerator.java>:330:
warning - @inheritDoc used but nextSecureLong(long, long) does not override or implement any
method.
[WARNING] <https://builds.apache.org/job/Commons%20Math/ws/src/main/java/org/apache/commons/math4/random/RandomDataGenerator.java>:569:
warning - @inheritDoc used but nextUniform(double, double) does not override or implement
any method.
[WARNING] <https://builds.apache.org/job/Commons%20Math/ws/src/main/java/org/apache/commons/math4/random/RandomDataGenerator.java>:589:
warning - @inheritDoc used but nextUniform(double, double, boolean) does not override or implement
any method.
[WARNING] <https://builds.apache.org/job/Commons%20Math/ws/src/main/java/org/apache/commons/math4/optim/univariate/SimpleUnivariateValueChecker.java>:40:
warning - Tag @link: reference not found: org.apache.commons.math4.optimization.ConvergenceChecker
[WARNING] <https://builds.apache.org/job/Commons%20Math/ws/src/main/java/org/apache/commons/math4/fitting/WeightedObservedPoint.java>:27:
warning - Tag @link: reference not found: CurveFitter curve fitting
[INFO] Building jar: <https://builds.apache.org/job/Commons%20Math/ws/target/commons-math4-4.0-SNAPSHOT-javadoc.jar>
[INFO] 
[INFO] --- maven-assembly-plugin:2.5.3:single (default) @ commons-math4 ---
[INFO] Reading assembly descriptor: src/main/assembly/src.xml
[INFO] Reading assembly descriptor: src/main/assembly/bin.xml
[INFO] Building tar: <https://builds.apache.org/job/Commons%20Math/ws/target/commons-math4-4.0-SNAPSHOT-src.tar.gz>
[INFO] Building zip: <https://builds.apache.org/job/Commons%20Math/ws/target/commons-math4-4.0-SNAPSHOT-src.zip>
[INFO] Building tar: <https://builds.apache.org/job/Commons%20Math/ws/target/commons-math4-4.0-SNAPSHOT-bin.tar.gz>
[INFO] Building zip: <https://builds.apache.org/job/Commons%20Math/ws/target/commons-math4-4.0-SNAPSHOT-bin.zip>
[INFO] 
[INFO] --- maven-antrun-plugin:1.7:run (default) @ commons-math4 ---
[INFO] Executing tasks

main:
      [jar] Building jar: <https://builds.apache.org/job/Commons%20Math/ws/target/commons-math4-4.0-SNAPSHOT-tools.jar>
[INFO] Executed tasks
[INFO] 
[INFO] >>> maven-source-plugin:2.4:jar (create-source-jar) @ commons-math4 >>>
[INFO] 
[INFO] --- maven-enforcer-plugin:1.3.1:enforce (enforce-maven-3) @ commons-math4 ---
[INFO] 
[INFO] --- build-helper-maven-plugin:1.7:parse-version (parse-version) @ commons-math4 ---
[INFO] 
[INFO] --- maven-antrun-plugin:1.7:run (javadoc.resources) @ commons-math4 ---
[INFO] Executing tasks

main:
[INFO] Executed tasks
[WARNING] Failed to getClass for org.apache.maven.plugin.source.SourceJarMojo
[INFO] 
[INFO] <<< maven-source-plugin:2.4:jar (create-source-jar) @ commons-math4 <<<
[INFO] 
[INFO] --- maven-source-plugin:2.4:jar (create-source-jar) @ commons-math4 ---
[INFO] Building jar: <https://builds.apache.org/job/Commons%20Math/ws/target/commons-math4-4.0-SNAPSHOT-sources.jar>
[INFO] 
[INFO] >>> maven-source-plugin:2.4:test-jar (create-source-jar) @ commons-math4 >>>
[INFO] 
[INFO] --- maven-enforcer-plugin:1.3.1:enforce (enforce-maven-3) @ commons-math4 ---
[INFO] 
[INFO] --- build-helper-maven-plugin:1.7:parse-version (parse-version) @ commons-math4 ---
[INFO] 
[INFO] --- maven-antrun-plugin:1.7:run (javadoc.resources) @ commons-math4 ---
[INFO] Executing tasks

main:
[INFO] Executed tasks
[WARNING] Failed to getClass for org.apache.maven.plugin.source.TestSourceJarMojo
[INFO] 
[INFO] <<< maven-source-plugin:2.4:test-jar (create-source-jar) @ commons-math4 <<<
[INFO] 
[INFO] --- maven-source-plugin:2.4:test-jar (create-source-jar) @ commons-math4 ---
[INFO] Building jar: <https://builds.apache.org/job/Commons%20Math/ws/target/commons-math4-4.0-SNAPSHOT-test-sources.jar>
[INFO] 
[INFO] --- maven-jar-plugin:2.5:test-jar (default) @ commons-math4 ---
[INFO] Building jar: <https://builds.apache.org/job/Commons%20Math/ws/target/commons-math4-4.0-SNAPSHOT-tests.jar>
[INFO] 
[INFO] --- build-helper-maven-plugin:1.7:attach-artifact (attach-artifacts) @ commons-math4
---
[INFO] 
[INFO] --- maven-gpg-plugin:1.6:sign (sign-artifacts) @ commons-math4 ---
[INFO] 
[INFO] --- jacoco-maven-plugin:0.7.2.201409121644:check (check) @ commons-math4 ---
[INFO] Analyzed bundle 'Apache Commons Math' with 902 classes
[WARNING] Rule violated for bundle Apache Commons Math: classes covered ratio is 0.95, but
expected minimum is 0.96
[WARNING] Coverage checks have not been met. See log for details.
[INFO] 
[INFO] --- maven-install-plugin:2.5.2:install (default-install) @ commons-math4 ---
[INFO] Installing <https://builds.apache.org/job/Commons%20Math/ws/target/commons-math4-4.0-SNAPSHOT.jar>
to /home/jenkins/jenkins-slave/maven-repositories/1/org/apache/commons/commons-math4/4.0-SNAPSHOT/commons-math4-4.0-SNAPSHOT.jar
[INFO] Installing <https://builds.apache.org/job/Commons%20Math/ws/pom.xml> to /home/jenkins/jenkins-slave/maven-repositories/1/org/apache/commons/commons-math4/4.0-SNAPSHOT/commons-math4-4.0-SNAPSHOT.pom
[INFO] Installing <https://builds.apache.org/job/Commons%20Math/ws/target/commons-math4-4.0-SNAPSHOT-javadoc.jar>
to /home/jenkins/jenkins-slave/maven-repositories/1/org/apache/commons/commons-math4/4.0-SNAPSHOT/commons-math4-4.0-SNAPSHOT-javadoc.jar
[INFO] Installing <https://builds.apache.org/job/Commons%20Math/ws/target/commons-math4-4.0-SNAPSHOT-src.tar.gz>
to /home/jenkins/jenkins-slave/maven-repositories/1/org/apache/commons/commons-math4/4.0-SNAPSHOT/commons-math4-4.0-SNAPSHOT-src.tar.gz
[INFO] Installing <https://builds.apache.org/job/Commons%20Math/ws/target/commons-math4-4.0-SNAPSHOT-src.zip>
to /home/jenkins/jenkins-slave/maven-repositories/1/org/apache/commons/commons-math4/4.0-SNAPSHOT/commons-math4-4.0-SNAPSHOT-src.zip
[INFO] Installing <https://builds.apache.org/job/Commons%20Math/ws/target/commons-math4-4.0-SNAPSHOT-bin.tar.gz>
to /home/jenkins/jenkins-slave/maven-repositories/1/org/apache/commons/commons-math4/4.0-SNAPSHOT/commons-math4-4.0-SNAPSHOT-bin.tar.gz
[INFO] Installing <https://builds.apache.org/job/Commons%20Math/ws/target/commons-math4-4.0-SNAPSHOT-bin.zip>
to /home/jenkins/jenkins-slave/maven-repositories/1/org/apache/commons/commons-math4/4.0-SNAPSHOT/commons-math4-4.0-SNAPSHOT-bin.zip
[INFO] Installing <https://builds.apache.org/job/Commons%20Math/ws/target/commons-math4-4.0-SNAPSHOT-sources.jar>
to /home/jenkins/jenkins-slave/maven-repositories/1/org/apache/commons/commons-math4/4.0-SNAPSHOT/commons-math4-4.0-SNAPSHOT-sources.jar
[INFO] Installing <https://builds.apache.org/job/Commons%20Math/ws/target/commons-math4-4.0-SNAPSHOT-test-sources.jar>
to /home/jenkins/jenkins-slave/maven-repositories/1/org/apache/commons/commons-math4/4.0-SNAPSHOT/commons-math4-4.0-SNAPSHOT-test-sources.jar
[INFO] Installing <https://builds.apache.org/job/Commons%20Math/ws/target/commons-math4-4.0-SNAPSHOT-tests.jar>
to /home/jenkins/jenkins-slave/maven-repositories/1/org/apache/commons/commons-math4/4.0-SNAPSHOT/commons-math4-4.0-SNAPSHOT-tests.jar
[INFO] Installing <https://builds.apache.org/job/Commons%20Math/ws/target/commons-math4-4.0-SNAPSHOT-tools.jar>
to /home/jenkins/jenkins-slave/maven-repositories/1/org/apache/commons/commons-math4/4.0-SNAPSHOT/commons-math4-4.0-SNAPSHOT-tools.jar
[INFO] 
[INFO] --- maven-deploy-plugin:2.8.2:deploy (default-deploy) @ commons-math4 ---
[INFO] Downloading: https://repository.apache.org/content/repositories/snapshots/org/apache/commons/commons-math4/4.0-SNAPSHOT/maven-metadata.xml
[INFO] Downloaded: https://repository.apache.org/content/repositories/snapshots/org/apache/commons/commons-math4/4.0-SNAPSHOT/maven-metadata.xml
(3 KB at 0.1 KB/sec)
[INFO] Uploading: https://repository.apache.org/content/repositories/snapshots/org/apache/commons/commons-math4/4.0-SNAPSHOT/commons-math4-4.0-20150406.151112-92.jar
[INFO] Uploading: https://repository.apache.org/content/repositories/snapshots/org/apache/commons/commons-math4/4.0-SNAPSHOT/commons-math4-4.0-20150406.151112-92.pom
[INFO] Uploaded: https://repository.apache.org/content/repositories/snapshots/org/apache/commons/commons-math4/4.0-SNAPSHOT/commons-math4-4.0-20150406.151112-92.pom
(27 KB at 0.5 KB/sec)
[INFO] ------------------------------------------------------------------------
[INFO] BUILD FAILURE
[INFO] ------------------------------------------------------------------------
[INFO] Total time: 7:13.213s
[INFO] Finished at: Mon Apr 06 15:13:16 UTC 2015
[INFO] Final Memory: 42M/264M
[INFO] ------------------------------------------------------------------------
[ERROR] Failed to execute goal org.apache.maven.plugins:maven-deploy-plugin:2.8.2:deploy (default-deploy)
on project commons-math4: Failed to deploy artifacts: Could not transfer artifact org.apache.commons:commons-math4:jar:4.0-20150406.151112-92
from/to apache.snapshots.https (https://repository.apache.org/content/repositories/snapshots):
Failed to transfer file: https://repository.apache.org/content/repositories/snapshots/org/apache/commons/commons-math4/4.0-SNAPSHOT/commons-math4-4.0-20150406.151112-92.jar.
Return code is: 502, ReasonPhrase: Proxy Error. -> [Help 1]
[ERROR] 
[ERROR] To see the full stack trace of the errors, re-run Maven with the -e switch.
[ERROR] Re-run Maven using the -X switch to enable full debug logging.
[ERROR] 
[ERROR] For more information about the errors and possible solutions, please read the following
articles:
[ERROR] [Help 1] http://cwiki.apache.org/confluence/display/MAVEN/MojoExecutionException
[JENKINS] Archiving <https://builds.apache.org/job/Commons%20Math/ws/pom.xml> to org.apache.commons/commons-math4/4.0-SNAPSHOT/commons-math4-4.0-SNAPSHOT.pom
[JENKINS] Archiving <https://builds.apache.org/job/Commons%20Math/ws/target/commons-math4-4.0-SNAPSHOT.jar>
to org.apache.commons/commons-math4/4.0-SNAPSHOT/commons-math4-4.0-SNAPSHOT.jar
[JENKINS] Archiving <https://builds.apache.org/job/Commons%20Math/ws/target/commons-math4-4.0-SNAPSHOT-javadoc.jar>
to org.apache.commons/commons-math4/4.0-SNAPSHOT/commons-math4-4.0-SNAPSHOT-javadoc.jar
[JENKINS] Archiving <https://builds.apache.org/job/Commons%20Math/ws/target/commons-math4-4.0-SNAPSHOT-src.tar.gz>
to org.apache.commons/commons-math4/4.0-SNAPSHOT/commons-math4-4.0-SNAPSHOT-src.tar.gz
[JENKINS] Archiving <https://builds.apache.org/job/Commons%20Math/ws/target/commons-math4-4.0-SNAPSHOT-src.zip>
to org.apache.commons/commons-math4/4.0-SNAPSHOT/commons-math4-4.0-SNAPSHOT-src.zip
[JENKINS] Archiving <https://builds.apache.org/job/Commons%20Math/ws/target/commons-math4-4.0-SNAPSHOT-bin.tar.gz>
to org.apache.commons/commons-math4/4.0-SNAPSHOT/commons-math4-4.0-SNAPSHOT-bin.tar.gz
[JENKINS] Archiving <https://builds.apache.org/job/Commons%20Math/ws/target/commons-math4-4.0-SNAPSHOT-bin.zip>
to org.apache.commons/commons-math4/4.0-SNAPSHOT/commons-math4-4.0-SNAPSHOT-bin.zip
[JENKINS] Archiving <https://builds.apache.org/job/Commons%20Math/ws/target/commons-math4-4.0-SNAPSHOT-sources.jar>
to org.apache.commons/commons-math4/4.0-SNAPSHOT/commons-math4-4.0-SNAPSHOT-sources.jar
[JENKINS] Archiving <https://builds.apache.org/job/Commons%20Math/ws/target/commons-math4-4.0-SNAPSHOT-test-sources.jar>
to org.apache.commons/commons-math4/4.0-SNAPSHOT/commons-math4-4.0-SNAPSHOT-test-sources.jar
[JENKINS] Archiving <https://builds.apache.org/job/Commons%20Math/ws/target/commons-math4-4.0-SNAPSHOT-tests.jar>
to org.apache.commons/commons-math4/4.0-SNAPSHOT/commons-math4-4.0-SNAPSHOT-tests.jar
[JENKINS] Archiving <https://builds.apache.org/job/Commons%20Math/ws/target/commons-math4-4.0-SNAPSHOT-tools.jar>
to org.apache.commons/commons-math4/4.0-SNAPSHOT/commons-math4-4.0-SNAPSHOT-tools.jar
Sending artifact delta relative to Commons Math ยป Apache Commons Math #148
Archived 11 artifacts
Archive block size is 32768
Received 53 blocks and 42694410 bytes
Compression is 3.9%
Took 16 sec
channel stopped

Mime
View raw message