commons-commits mailing list archives

Site index · List index
Message view « Date » · « Thread »
Top « Date » · « Thread »
From Apache Continuum <...@continuum.apache.org>
Subject [continuum] BUILD FAILURE: Apache Commons Math - Apache Commons (Build with Java 7)
Date Sun, 08 Mar 2015 21:24:56 GMT
Online report : https://continuum-ci.apache.org/continuum/buildResult.action?buildId=39533&projectId=317

Build statistics:
  State: Failed
  Previous State: Ok
  Started at: Sun 8 Mar 2015 21:20:36 +0000
  Finished at: Sun 8 Mar 2015 21:24:54 +0000
  Total time: 4m 17s
  Build Trigger: Schedule
  Build Number: 14
  Exit code: 1
  Building machine hostname: continuum-vm
  Operating system : Linux(unknown)
  Java Home version : 
          java version "1.7.0_65"
          OpenJDK Runtime Environment (IcedTea 2.5.3) (7u71-2.5.3-0ubuntu0.12.04.1)
          OpenJDK 64-Bit Server VM (build 24.65-b04, mixed mode)
        
  Builder version :
          Apache Maven 3.0.5 (r01de14724cdef164cd33c7c8c2fe155faf9602da; 2013-02-19 13:51:28+0000)
          Maven home: /opt/apache-maven-3.0.5
          Java version: 1.7.0_65, vendor: Oracle Corporation
          Java home: /usr/lib/jvm/java-7-openjdk-amd64/jre
          Default locale: en_US, platform encoding: ANSI_X3.4-1968
          OS name: "linux", version: "3.2.0-75-generic", arch: "amd64", family: "unix"
    
****************************************************************************
SCM Changes:
****************************************************************************
Changed: Phil Steitz <phil.steitz@gmail.com> @ Sun 8 Mar 2015 21:10:25 +0000
Comment: Made getKernel return a constant distribution for zero variance bins.  JIRA: MATH-1203.
Files changed:
  src/changes/changes.xml ( 4aa4c6d31f98d8cd80ccbcf99ded77bfc6de25c5 )
  src/main/java/org/apache/commons/math4/random/EmpiricalDistribution.java ( 4aa4c6d31f98d8cd80ccbcf99ded77bfc6de25c5
)
  src/test/java/org/apache/commons/math4/random/EmpiricalDistributionTest.java ( 4aa4c6d31f98d8cd80ccbcf99ded77bfc6de25c5
)

****************************************************************************
Dependencies Changes:
****************************************************************************
No dependencies changed


****************************************************************************
Build Definition:
****************************************************************************
POM filename: pom.xml
Goals: clean deploy   
Arguments: --batch-mode -Pjava-1.7 -Dgpg.skip -Prelease
Build Fresh: false
Always Build: false
Default Build Definition: true
Schedule: COMMONS_SCHEDULE
Profile Name: Maven 3.0.5 with Java 7
Description: Build with Java 7

****************************************************************************
Test Summary:
****************************************************************************
Tests: 5863
Failures: 1
Errors: 0
Success Rate: 99
Total time: 168.93503

****************************************************************************
Test Failures:
****************************************************************************

KohonenUpdateActionTest
    testUpdate :
  java.lang.AssertionError
  java.lang.AssertionError: expected:<0.0> but was:<5.551115123125783E-17>
	at org.junit.Assert.fail(Assert.java:88)
	at org.junit.Assert.failNotEquals(Assert.java:743)
	at org.junit.Assert.assertEquals(Assert.java:494)
	at org.junit.Assert.assertEquals(Assert.java:592)
	at org.apache.commons.math4.ml.neuralnet.sofm.KohonenUpdateActionTest.testUpdate(KohonenUpdateActionTest.java:90)


  


Mime
View raw message