commons-commits mailing list archives

Site index · List index
Message view « Date » · « Thread »
Top « Date » · « Thread »
From Apache Continuum <...@continuum.apache.org>
Subject [continuum] BUILD FAILURE: Apache Commons Math - Apache Commons (Build with Java 7)
Date Mon, 23 Feb 2015 23:04:53 GMT
Online report : https://continuum-ci.apache.org/continuum/buildResult.action?buildId=39456&projectId=317

Build statistics:
  State: Failed
  Previous State: Failed
  Started at: Mon 23 Feb 2015 22:59:14 +0000
  Finished at: Mon 23 Feb 2015 23:04:51 +0000
  Total time: 5m 36s
  Build Trigger: Forced
  Build Number: 6
  Exit code: 1
  Building machine hostname: continuum-vm
  Operating system : Linux(unknown)
  Java Home version : 
          java version "1.7.0_65"
          OpenJDK Runtime Environment (IcedTea 2.5.3) (7u71-2.5.3-0ubuntu0.12.04.1)
          OpenJDK 64-Bit Server VM (build 24.65-b04, mixed mode)
        
  Builder version :
          Apache Maven 3.0.5 (r01de14724cdef164cd33c7c8c2fe155faf9602da; 2013-02-19 13:51:28+0000)
          Maven home: /opt/apache-maven-3.0.5
          Java version: 1.7.0_65, vendor: Oracle Corporation
          Java home: /usr/lib/jvm/java-7-openjdk-amd64/jre
          Default locale: en_US, platform encoding: ANSI_X3.4-1968
          OS name: "linux", version: "3.2.0-67-generic", arch: "amd64", family: "unix"
    
****************************************************************************
SCM Changes:
****************************************************************************
Changed: no author @ no date
Comment: no comment
Files changed:
  .../commons/math4/linear/ArrayFieldVectorTest.java ( no revision )
  .../commons/math4/linear/BlockFieldMatrixTest.java ( no revision )
  .../commons/math4/linear/FieldMatrixImplTest.java ( no revision )
  .../math4/linear/SparseFieldMatrixTest.java ( no revision )

****************************************************************************
Dependencies Changes:
****************************************************************************
No dependencies changed


****************************************************************************
Build Definition:
****************************************************************************
POM filename: pom.xml
Goals: clean deploy   
Arguments: --batch-mode -Pjava-1.7 -Dgpg.skip -Prelease
Build Fresh: false
Always Build: false
Default Build Definition: true
Schedule: DEFAULT_SCHEDULE
Profile Name: Maven 3.0.5 with Java 7
Description: Build with Java 7

****************************************************************************
Test Summary:
****************************************************************************
Tests: 6193
Failures: 1
Errors: 0
Success Rate: 99
Total time: 249.22908

****************************************************************************
Test Failures:
****************************************************************************

CMAESOptimizerTest
    testAckley :
  java.lang.AssertionError
  java.lang.AssertionError: expected:<0.0> but was:<1.0058472717737672>
	at org.junit.Assert.fail(Assert.java:88)
	at org.junit.Assert.failNotEquals(Assert.java:743)
	at org.junit.Assert.assertEquals(Assert.java:494)
	at org.junit.Assert.assertEquals(Assert.java:592)
	at org.apache.commons.math4.optimization.direct.CMAESOptimizerTest.doTest(CMAESOptimizerTest.java:476)
	at org.apache.commons.math4.optimization.direct.CMAESOptimizerTest.testAckley(CMAESOptimizerTest.java:316)


  


Mime
View raw message