commons-commits mailing list archives

Site index · List index
Message view « Date » · « Thread »
Top « Date » · « Thread »
From Apache Continuum <...@continuum.apache.org>
Subject [continuum] BUILD FAILURE: Apache Commons VFS - Apache Commons (Group (shared) Maven 3 Build Definition (Java 1.6))
Date Wed, 11 Feb 2015 02:25:41 GMT
Online report : https://continuum-ci.apache.org/continuum/buildResult.action?buildId=39361&projectId=129

Build statistics:
  State: Failed
  Previous State: Ok
  Started at: Wed 11 Feb 2015 02:20:34 +0000
  Finished at: Wed 11 Feb 2015 02:25:40 +0000
  Total time: 5m 5s
  Build Trigger: Schedule
  Build Number: 375
  Exit code: 1
  Building machine hostname: continuum-vm
  Operating system : Linux(unknown)
  Java Home version : 
          java version "1.6.0_34"
          OpenJDK Runtime Environment (IcedTea6 1.13.6) (6b34-1.13.6-1ubuntu0.12.04.1)
          OpenJDK 64-Bit Server VM (build 23.25-b01, mixed mode)
        
  Builder version :
          Apache Maven 3.0.5 (r01de14724cdef164cd33c7c8c2fe155faf9602da; 2013-02-19 13:51:28+0000)
          Maven home: /opt/apache-maven-3.0.5
          Java version: 1.6.0_34, vendor: Sun Microsystems Inc.
          Java home: /usr/lib/jvm/java-6-openjdk-amd64/jre
          Default locale: en_US, platform encoding: ANSI_X3.4-1968
          OS name: "linux", version: "3.2.0-67-generic", arch: "amd64", family: "unix"
    
****************************************************************************
SCM Changes:
****************************************************************************
Changed: ecki @ Wed 11 Feb 2015 02:15:41 +0000
Comment: [tests] more seperate last modified tests, added todo for VFS-563
Files changed:
  /commons/proper/vfs/trunk/core/src/test/java/org/apache/commons/vfs2/test/LastModifiedTests.java
( 1658868 )

****************************************************************************
Dependencies Changes:
****************************************************************************
No dependencies changed


****************************************************************************
Build Definition:
****************************************************************************
POM filename: pom.xml
Goals: clean deploy   
Arguments: --batch-mode -Pjava-1.6 -Dgpg.skip -Prelease
Build Fresh: false
Always Build: false
Default Build Definition: true
Schedule: COMMONS_SCHEDULE
Profile Name: Maven 3.0.5
Description: Group (shared) Maven 3 Build Definition (Java 1.6)

****************************************************************************
Test Summary:
****************************************************************************
Tests: 2124
Failures: 8
Errors: 0
Success Rate: 99
Total time: 100.124

****************************************************************************
Test Failures:
****************************************************************************

LocalProviderTestCase
    testSetLastModifiedFolder :
  java.lang.AssertionError
  java.lang.AssertionError: set/getLastModified on Folder expected=1423535063284 (Tue Feb
10 02:24:23 UTC 2015), actual=1423535063000 (Tue Feb 10 02:24:23 UTC 2015), delta=0
	at org.junit.Assert.fail(Assert.java:88)
	at org.apache.commons.vfs2.test.LastModifiedTests.assertDelta(LastModifiedTests.java:41)
	at org.apache.commons.vfs2.test.LastModifiedTests.testSetLastModifiedFolder(LastModifiedTests.java:104)
	at sun.reflect.NativeMethodAccessorImpl.invoke0(Native Method)
	at sun.reflect.NativeMethodAccessorImpl.invoke(NativeMethodAccessorImpl.java:57)
	at sun.reflect.DelegatingMethodAccessorImpl.invoke(DelegatingMethodAccessorImpl.java:43)
	at java.lang.reflect.Method.invoke(Method.java:622)
	at org.apache.commons.vfs2.test.AbstractProviderTestCase.runTest(AbstractProviderTestCase.java:218)
	at junit.framework.TestCase.runBare(TestCase.java:141)
	at junit.framework.TestResult$1.protect(TestResult.java:122)
	at junit.framework.TestResult.runProtected(TestResult.java:142)
	at junit.framework.TestResult.run(TestResult.java:125)
	at junit.framework.TestCase.run(TestCase.java:129)
	at junit.framework.TestSuite.runTest(TestSuite.java:252)
	at junit.framework.TestSuite.run(TestSuite.java:247)
	at junit.extensions.TestDecorator.basicRun(TestDecorator.java:23)
	at org.apache.commons.vfs2.test.AbstractTestSuite$1.protect(AbstractTestSuite.java:149)
	at junit.framework.TestResult.runProtected(TestResult.java:142)
	at org.apache.commons.vfs2.test.AbstractTestSuite.run(AbstractTestSuite.java:154)
	at org.junit.internal.runners.JUnit38ClassRunner.run(JUnit38ClassRunner.java:86)
	at org.apache.maven.surefire.junit4.JUnit4Provider.execute(JUnit4Provider.java:283)
	at org.apache.maven.surefire.junit4.JUnit4Provider.executeWithRerun(JUnit4Provider.java:173)
	at org.apache.maven.surefire.junit4.JUnit4Provider.executeTestSet(JUnit4Provider.java:153)
	at org.apache.maven.surefire.junit4.JUnit4Provider.invoke(JUnit4Provider.java:128)
	at org.apache.maven.surefire.booter.ForkedBooter.invokeProviderInSameClassLoader(ForkedBooter.java:203)
	at org.apache.maven.surefire.booter.ForkedBooter.runSuitesInProcess(ForkedBooter.java:155)
	at org.apache.maven.surefire.booter.ForkedBooter.main(ForkedBooter.java:103)

    testSetLastModifiedFile :
  java.lang.AssertionError
  java.lang.AssertionError: set/getLastModified on File expected=1423535063290 (Tue Feb 10
02:24:23 UTC 2015), actual=1423535063000 (Tue Feb 10 02:24:23 UTC 2015), delta=0
	at org.junit.Assert.fail(Assert.java:88)
	at org.apache.commons.vfs2.test.LastModifiedTests.assertDelta(LastModifiedTests.java:41)
	at org.apache.commons.vfs2.test.LastModifiedTests.testSetLastModifiedFile(LastModifiedTests.java:124)
	at sun.reflect.NativeMethodAccessorImpl.invoke0(Native Method)
	at sun.reflect.NativeMethodAccessorImpl.invoke(NativeMethodAccessorImpl.java:57)
	at sun.reflect.DelegatingMethodAccessorImpl.invoke(DelegatingMethodAccessorImpl.java:43)
	at java.lang.reflect.Method.invoke(Method.java:622)
	at org.apache.commons.vfs2.test.AbstractProviderTestCase.runTest(AbstractProviderTestCase.java:218)
	at junit.framework.TestCase.runBare(TestCase.java:141)
	at junit.framework.TestResult$1.protect(TestResult.java:122)
	at junit.framework.TestResult.runProtected(TestResult.java:142)
	at junit.framework.TestResult.run(TestResult.java:125)
	at junit.framework.TestCase.run(TestCase.java:129)
	at junit.framework.TestSuite.runTest(TestSuite.java:252)
	at junit.framework.TestSuite.run(TestSuite.java:247)
	at junit.extensions.TestDecorator.basicRun(TestDecorator.java:23)
	at org.apache.commons.vfs2.test.AbstractTestSuite$1.protect(AbstractTestSuite.java:149)
	at junit.framework.TestResult.runProtected(TestResult.java:142)
	at org.apache.commons.vfs2.test.AbstractTestSuite.run(AbstractTestSuite.java:154)
	at org.junit.internal.runners.JUnit38ClassRunner.run(JUnit38ClassRunner.java:86)
	at org.apache.maven.surefire.junit4.JUnit4Provider.execute(JUnit4Provider.java:283)
	at org.apache.maven.surefire.junit4.JUnit4Provider.executeWithRerun(JUnit4Provider.java:173)
	at org.apache.maven.surefire.junit4.JUnit4Provider.executeTestSet(JUnit4Provider.java:153)
	at org.apache.maven.surefire.junit4.JUnit4Provider.invoke(JUnit4Provider.java:128)
	at org.apache.maven.surefire.booter.ForkedBooter.invokeProviderInSameClassLoader(ForkedBooter.java:203)
	at org.apache.maven.surefire.booter.ForkedBooter.runSuitesInProcess(ForkedBooter.java:155)
	at org.apache.maven.surefire.booter.ForkedBooter.main(ForkedBooter.java:103)


  UrlHttpProviderTestCase
    testSetLastModifiedFolder :
  java.lang.AssertionError
  java.lang.AssertionError: set/getLastModified on Folder expected=1423535072490 (Tue Feb
10 02:24:32 UTC 2015), actual=1423535072000 (Tue Feb 10 02:24:32 UTC 2015), delta=0
	at org.junit.Assert.fail(Assert.java:88)
	at org.apache.commons.vfs2.test.LastModifiedTests.assertDelta(LastModifiedTests.java:41)
	at org.apache.commons.vfs2.test.LastModifiedTests.testSetLastModifiedFolder(LastModifiedTests.java:104)
	at sun.reflect.GeneratedMethodAccessor52.invoke(Unknown Source)
	at sun.reflect.DelegatingMethodAccessorImpl.invoke(DelegatingMethodAccessorImpl.java:43)
	at java.lang.reflect.Method.invoke(Method.java:622)
	at org.apache.commons.vfs2.test.AbstractProviderTestCase.runTest(AbstractProviderTestCase.java:218)
	at junit.framework.TestCase.runBare(TestCase.java:141)
	at junit.framework.TestResult$1.protect(TestResult.java:122)
	at junit.framework.TestResult.runProtected(TestResult.java:142)
	at junit.framework.TestResult.run(TestResult.java:125)
	at junit.framework.TestCase.run(TestCase.java:129)
	at junit.framework.TestSuite.runTest(TestSuite.java:252)
	at junit.framework.TestSuite.run(TestSuite.java:247)
	at junit.extensions.TestDecorator.basicRun(TestDecorator.java:23)
	at org.apache.commons.vfs2.test.AbstractTestSuite$1.protect(AbstractTestSuite.java:149)
	at junit.framework.TestResult.runProtected(TestResult.java:142)
	at org.apache.commons.vfs2.test.AbstractTestSuite.run(AbstractTestSuite.java:154)
	at org.junit.internal.runners.JUnit38ClassRunner.run(JUnit38ClassRunner.java:86)
	at org.apache.maven.surefire.junit4.JUnit4Provider.execute(JUnit4Provider.java:283)
	at org.apache.maven.surefire.junit4.JUnit4Provider.executeWithRerun(JUnit4Provider.java:173)
	at org.apache.maven.surefire.junit4.JUnit4Provider.executeTestSet(JUnit4Provider.java:153)
	at org.apache.maven.surefire.junit4.JUnit4Provider.invoke(JUnit4Provider.java:128)
	at org.apache.maven.surefire.booter.ForkedBooter.invokeProviderInSameClassLoader(ForkedBooter.java:203)
	at org.apache.maven.surefire.booter.ForkedBooter.runSuitesInProcess(ForkedBooter.java:155)
	at org.apache.maven.surefire.booter.ForkedBooter.main(ForkedBooter.java:103)


    testSetLastModifiedFile :
  java.lang.AssertionError
  java.lang.AssertionError: set/getLastModified on File expected=1423535072491 (Tue Feb 10
02:24:32 UTC 2015), actual=1423535072000 (Tue Feb 10 02:24:32 UTC 2015), delta=0
	at org.junit.Assert.fail(Assert.java:88)
	at org.apache.commons.vfs2.test.LastModifiedTests.assertDelta(LastModifiedTests.java:41)
	at org.apache.commons.vfs2.test.LastModifiedTests.testSetLastModifiedFile(LastModifiedTests.java:124)
	at sun.reflect.GeneratedMethodAccessor53.invoke(Unknown Source)
	at sun.reflect.DelegatingMethodAccessorImpl.invoke(DelegatingMethodAccessorImpl.java:43)
	at java.lang.reflect.Method.invoke(Method.java:622)
	at org.apache.commons.vfs2.test.AbstractProviderTestCase.runTest(AbstractProviderTestCase.java:218)
	at junit.framework.TestCase.runBare(TestCase.java:141)
	at junit.framework.TestResult$1.protect(TestResult.java:122)
	at junit.framework.TestResult.runProtected(TestResult.java:142)
	at junit.framework.TestResult.run(TestResult.java:125)
	at junit.framework.TestCase.run(TestCase.java:129)
	at junit.framework.TestSuite.runTest(TestSuite.java:252)
	at junit.framework.TestSuite.run(TestSuite.java:247)
	at junit.extensions.TestDecorator.basicRun(TestDecorator.java:23)
	at org.apache.commons.vfs2.test.AbstractTestSuite$1.protect(AbstractTestSuite.java:149)
	at junit.framework.TestResult.runProtected(TestResult.java:142)
	at org.apache.commons.vfs2.test.AbstractTestSuite.run(AbstractTestSuite.java:154)
	at org.junit.internal.runners.JUnit38ClassRunner.run(JUnit38ClassRunner.java:86)
	at org.apache.maven.surefire.junit4.JUnit4Provider.execute(JUnit4Provider.java:283)
	at org.apache.maven.surefire.junit4.JUnit4Provider.executeWithRerun(JUnit4Provider.java:173)
	at org.apache.maven.surefire.junit4.JUnit4Provider.executeTestSet(JUnit4Provider.java:153)
	at org.apache.maven.surefire.junit4.JUnit4Provider.invoke(JUnit4Provider.java:128)
	at org.apache.maven.surefire.booter.ForkedBooter.invokeProviderInSameClassLoader(ForkedBooter.java:203)
	at org.apache.maven.surefire.booter.ForkedBooter.runSuitesInProcess(ForkedBooter.java:155)
	at org.apache.maven.surefire.booter.ForkedBooter.main(ForkedBooter.java:103)

  VirtualProviderTestCase
    testSetLastModifiedFolder :
  java.lang.AssertionError
  java.lang.AssertionError: set/getLastModified on Folder expected=1423535134741 (Tue Feb
10 02:25:34 UTC 2015), actual=1423535134000 (Tue Feb 10 02:25:34 UTC 2015), delta=0
	at org.junit.Assert.fail(Assert.java:88)
	at org.apache.commons.vfs2.test.LastModifiedTests.assertDelta(LastModifiedTests.java:41)
	at org.apache.commons.vfs2.test.LastModifiedTests.testSetLastModifiedFolder(LastModifiedTests.java:104)
	at sun.reflect.GeneratedMethodAccessor52.invoke(Unknown Source)
	at sun.reflect.DelegatingMethodAccessorImpl.invoke(DelegatingMethodAccessorImpl.java:43)
	at java.lang.reflect.Method.invoke(Method.java:622)
	at org.apache.commons.vfs2.test.AbstractProviderTestCase.runTest(AbstractProviderTestCase.java:218)
	at junit.framework.TestCase.runBare(TestCase.java:141)
	at junit.framework.TestResult$1.protect(TestResult.java:122)
	at junit.framework.TestResult.runProtected(TestResult.java:142)
	at junit.framework.TestResult.run(TestResult.java:125)
	at junit.framework.TestCase.run(TestCase.java:129)
	at junit.framework.TestSuite.runTest(TestSuite.java:252)
	at junit.framework.TestSuite.run(TestSuite.java:247)
	at junit.extensions.TestDecorator.basicRun(TestDecorator.java:23)
	at org.apache.commons.vfs2.test.AbstractTestSuite$1.protect(AbstractTestSuite.java:149)
	at junit.framework.TestResult.runProtected(TestResult.java:142)
	at org.apache.commons.vfs2.test.AbstractTestSuite.run(AbstractTestSuite.java:154)
	at org.junit.internal.runners.JUnit38ClassRunner.run(JUnit38ClassRunner.java:86)
	at org.apache.maven.surefire.junit4.JUnit4Provider.execute(JUnit4Provider.java:283)
	at org.apache.maven.surefire.junit4.JUnit4Provider.executeWithRerun(JUnit4Provider.java:173)
	at org.apache.maven.surefire.junit4.JUnit4Provider.executeTestSet(JUnit4Provider.java:153)
	at org.apache.maven.surefire.junit4.JUnit4Provider.invoke(JUnit4Provider.java:128)
	at org.apache.maven.surefire.booter.ForkedBooter.invokeProviderInSameClassLoader(ForkedBooter.java:203)
	at org.apache.maven.surefire.booter.ForkedBooter.runSuitesInProcess(ForkedBooter.java:155)
	at org.apache.maven.surefire.booter.ForkedBooter.main(ForkedBooter.java:103)


    testSetLastModifiedFile :
  java.lang.AssertionError
  java.lang.AssertionError: set/getLastModified on File expected=1423535134742 (Tue Feb 10
02:25:34 UTC 2015), actual=1423535134000 (Tue Feb 10 02:25:34 UTC 2015), delta=0
	at org.junit.Assert.fail(Assert.java:88)
	at org.apache.commons.vfs2.test.LastModifiedTests.assertDelta(LastModifiedTests.java:41)
	at org.apache.commons.vfs2.test.LastModifiedTests.testSetLastModifiedFile(LastModifiedTests.java:124)
	at sun.reflect.GeneratedMethodAccessor53.invoke(Unknown Source)
	at sun.reflect.DelegatingMethodAccessorImpl.invoke(DelegatingMethodAccessorImpl.java:43)
	at java.lang.reflect.Method.invoke(Method.java:622)
	at org.apache.commons.vfs2.test.AbstractProviderTestCase.runTest(AbstractProviderTestCase.java:218)
	at junit.framework.TestCase.runBare(TestCase.java:141)
	at junit.framework.TestResult$1.protect(TestResult.java:122)
	at junit.framework.TestResult.runProtected(TestResult.java:142)
	at junit.framework.TestResult.run(TestResult.java:125)
	at junit.framework.TestCase.run(TestCase.java:129)
	at junit.framework.TestSuite.runTest(TestSuite.java:252)
	at junit.framework.TestSuite.run(TestSuite.java:247)
	at junit.extensions.TestDecorator.basicRun(TestDecorator.java:23)
	at org.apache.commons.vfs2.test.AbstractTestSuite$1.protect(AbstractTestSuite.java:149)
	at junit.framework.TestResult.runProtected(TestResult.java:142)
	at org.apache.commons.vfs2.test.AbstractTestSuite.run(AbstractTestSuite.java:154)
	at org.junit.internal.runners.JUnit38ClassRunner.run(JUnit38ClassRunner.java:86)
	at org.apache.maven.surefire.junit4.JUnit4Provider.execute(JUnit4Provider.java:283)
	at org.apache.maven.surefire.junit4.JUnit4Provider.executeWithRerun(JUnit4Provider.java:173)
	at org.apache.maven.surefire.junit4.JUnit4Provider.executeTestSet(JUnit4Provider.java:153)
	at org.apache.maven.surefire.junit4.JUnit4Provider.invoke(JUnit4Provider.java:128)
	at org.apache.maven.surefire.booter.ForkedBooter.invokeProviderInSameClassLoader(ForkedBooter.java:203)
	at org.apache.maven.surefire.booter.ForkedBooter.runSuitesInProcess(ForkedBooter.java:155)
	at org.apache.maven.surefire.booter.ForkedBooter.main(ForkedBooter.java:103)

  TemporaryProviderTestCase
    testSetLastModifiedFolder :
  java.lang.AssertionError
  java.lang.AssertionError: set/getLastModified on Folder expected=1423535095628 (Tue Feb
10 02:24:55 UTC 2015), actual=1423535095000 (Tue Feb 10 02:24:55 UTC 2015), delta=0
	at org.junit.Assert.fail(Assert.java:88)
	at org.apache.commons.vfs2.test.LastModifiedTests.assertDelta(LastModifiedTests.java:41)
	at org.apache.commons.vfs2.test.LastModifiedTests.testSetLastModifiedFolder(LastModifiedTests.java:104)
	at sun.reflect.GeneratedMethodAccessor52.invoke(Unknown Source)
	at sun.reflect.DelegatingMethodAccessorImpl.invoke(DelegatingMethodAccessorImpl.java:43)
	at java.lang.reflect.Method.invoke(Method.java:622)
	at org.apache.commons.vfs2.test.AbstractProviderTestCase.runTest(AbstractProviderTestCase.java:218)
	at junit.framework.TestCase.runBare(TestCase.java:141)
	at junit.framework.TestResult$1.protect(TestResult.java:122)
	at junit.framework.TestResult.runProtected(TestResult.java:142)
	at junit.framework.TestResult.run(TestResult.java:125)
	at junit.framework.TestCase.run(TestCase.java:129)
	at junit.framework.TestSuite.runTest(TestSuite.java:252)
	at junit.framework.TestSuite.run(TestSuite.java:247)
	at junit.extensions.TestDecorator.basicRun(TestDecorator.java:23)
	at org.apache.commons.vfs2.test.AbstractTestSuite$1.protect(AbstractTestSuite.java:149)
	at junit.framework.TestResult.runProtected(TestResult.java:142)
	at org.apache.commons.vfs2.test.AbstractTestSuite.run(AbstractTestSuite.java:154)
	at org.junit.internal.runners.JUnit38ClassRunner.run(JUnit38ClassRunner.java:86)
	at org.apache.maven.surefire.junit4.JUnit4Provider.execute(JUnit4Provider.java:283)
	at org.apache.maven.surefire.junit4.JUnit4Provider.executeWithRerun(JUnit4Provider.java:173)
	at org.apache.maven.surefire.junit4.JUnit4Provider.executeTestSet(JUnit4Provider.java:153)
	at org.apache.maven.surefire.junit4.JUnit4Provider.invoke(JUnit4Provider.java:128)
	at org.apache.maven.surefire.booter.ForkedBooter.invokeProviderInSameClassLoader(ForkedBooter.java:203)
	at org.apache.maven.surefire.booter.ForkedBooter.runSuitesInProcess(ForkedBooter.java:155)
	at org.apache.maven.surefire.booter.ForkedBooter.main(ForkedBooter.java:103)


    testSetLastModifiedFile :
  java.lang.AssertionError
  java.lang.AssertionError: set/getLastModified on File expected=1423535095629 (Tue Feb 10
02:24:55 UTC 2015), actual=1423535095000 (Tue Feb 10 02:24:55 UTC 2015), delta=0
	at org.junit.Assert.fail(Assert.java:88)
	at org.apache.commons.vfs2.test.LastModifiedTests.assertDelta(LastModifiedTests.java:41)
	at org.apache.commons.vfs2.test.LastModifiedTests.testSetLastModifiedFile(LastModifiedTests.java:124)
	at sun.reflect.GeneratedMethodAccessor53.invoke(Unknown Source)
	at sun.reflect.DelegatingMethodAccessorImpl.invoke(DelegatingMethodAccessorImpl.java:43)
	at java.lang.reflect.Method.invoke(Method.java:622)
	at org.apache.commons.vfs2.test.AbstractProviderTestCase.runTest(AbstractProviderTestCase.java:218)
	at junit.framework.TestCase.runBare(TestCase.java:141)
	at junit.framework.TestResult$1.protect(TestResult.java:122)
	at junit.framework.TestResult.runProtected(TestResult.java:142)
	at junit.framework.TestResult.run(TestResult.java:125)
	at junit.framework.TestCase.run(TestCase.java:129)
	at junit.framework.TestSuite.runTest(TestSuite.java:252)
	at junit.framework.TestSuite.run(TestSuite.java:247)
	at junit.extensions.TestDecorator.basicRun(TestDecorator.java:23)
	at org.apache.commons.vfs2.test.AbstractTestSuite$1.protect(AbstractTestSuite.java:149)
	at junit.framework.TestResult.runProtected(TestResult.java:142)
	at org.apache.commons.vfs2.test.AbstractTestSuite.run(AbstractTestSuite.java:154)
	at org.junit.internal.runners.JUnit38ClassRunner.run(JUnit38ClassRunner.java:86)
	at org.apache.maven.surefire.junit4.JUnit4Provider.execute(JUnit4Provider.java:283)
	at org.apache.maven.surefire.junit4.JUnit4Provider.executeWithRerun(JUnit4Provider.java:173)
	at org.apache.maven.surefire.junit4.JUnit4Provider.executeTestSet(JUnit4Provider.java:153)
	at org.apache.maven.surefire.junit4.JUnit4Provider.invoke(JUnit4Provider.java:128)
	at org.apache.maven.surefire.booter.ForkedBooter.invokeProviderInSameClassLoader(ForkedBooter.java:203)
	at org.apache.maven.surefire.booter.ForkedBooter.runSuitesInProcess(ForkedBooter.java:155)
	at org.apache.maven.surefire.booter.ForkedBooter.main(ForkedBooter.java:103)

  


Mime
View raw message