cocoon-users mailing list archives

Site index · List index
Message view « Date » · « Thread »
Top « Date » · « Thread »
From warrell harries <warrell.harr...@gmail.com>
Subject Re: Problems building cocoon-2.1.12
Date Sun, 15 Jun 2014 22:13:55 GMT
Hi Peter,

I can't say what your build problem is (except that the error message
indicates a missing file... dependencies again?).... but  I am surprised
you are still using Java 1.4. Is there a reason for not moving onto 1.7?
On 15 Jun 2014 16:56, "Peter Sparkes" <peter@didm.co.uk> wrote:

>  Hi
>
> I am having problems building  cocoon-2.1.12 on my 64 bit windows 7
> system, with j2sdk1.4.2_19
> I had no problems on my old 32 bit windows XP system
>
> I am getting
>
> cocoon-block-html-patch:
> Processing: D:\cocoon-2.1.12-wl -
> Copy\src\blocks\html\conf\html-transformer.xmap
> Processing: D:\cocoon-2.1.12-wl - Copy\src\blocks\html\conf\html.xmap
> Writing: D:\cocoon-2.1.12-wl - Copy\build\webapp\sitemap.xmap
>
> BUILD FAILED
> D:\cocoon-2.1.12-wl - Copy\tools\targets\webapp-build.xml:120: The
> following error occurred while executing this line:
> D:\cocoon-2.1.12-wl - Copy\build\cocoon\temp\blocks-build.xml:2088: The
> following error occurred while executing this line:
> D:\cocoon-2.1.12-wl - Copy\build\cocoon\temp\blocks-build.xml:171:
> FileNotFoundException: java.io.FileNotFoundException: D:\cocoon-2.1.12-wl -
> Copy\build\webapp\sitemap.xmap (The requested operation cannot be performed
> on a file with a user-mapped section open)
>
> Help please
>
> Peter
>

Mime
View raw message