cocoon-users mailing list archives

Site index · List index
Message view « Date » · « Thread »
Top « Date » · « Thread »
From Antonio Gallardo <agalla...@agssa.net>
Subject Re: Build is failing while installing cocoon 2.1.11
Date Thu, 28 May 2009 14:45:45 GMT
Hi,

A file is missing:

IOException: java.io.FileNotFoundException:
/usr/local/cocoon-2.1.11/build/webapp/WEB-INF/cocoon.xconf 

Would you explain how did you build?

Best Regards,

Antonio Gallardo.



kaushalbhardwaj escribió:
> hi 
>
> i have tired to build the cocoon in my Linux system but it is giving the
> following error
>
>
> BUILD FAILED
> /usr/local/cocoon-2.1.11/tools/targets/webapp-build.xml:120: The following
> error occurred while executing this line:
> /usr/local/cocoon-2.1.11/build/cocoon/temp/blocks-build.xml:1112: The
> following error occurred while executing this line:
> /usr/local/cocoon-2.1.11/build/cocoon/temp/blocks-build.xml:167:
> IOException: java.io.FileNotFoundException:
> /usr/local/cocoon-2.1.11/build/webapp/WEB-INF/cocoon.xconf (No such file or
> directory)
>
> i serched in the above files also but unable to understand it
> what to do 
> kindly help
>
> Kaushal
>   


---------------------------------------------------------------------
To unsubscribe, e-mail: users-unsubscribe@cocoon.apache.org
For additional commands, e-mail: users-help@cocoon.apache.org


Mime
View raw message