cocoon-users mailing list archives

Site index · List index
Message view « Date » · « Thread »
Top « Date » · « Thread »
From yosauron <yosauron.desarro...@gmail.com>
Subject RE: C22 - Maven artifact missing
Date Fri, 08 Aug 2008 08:20:15 GMT

Now I get the following test error:


[INFO]
------------------------------------------------------------------------
[INFO] Building Cocoon Core
[INFO]    task-segment: [install]
[INFO]
------------------------------------------------------------------------
[INFO] [enforcer:enforce-once {execution: enforce-maven}]
[INFO] [resources:resources]
[INFO] Using default encoding to copy filtered resources.
[INFO] [compiler:compile]
[INFO] Nothing to compile - all classes are up to date
[INFO] [resources:testResources]
[INFO] Using default encoding to copy filtered resources.
[INFO] [compiler:testCompile]
[INFO] Nothing to compile - all classes are up to date
[INFO] [surefire:test]
[INFO] Surefire report directory:
/home/caribdis/tmp/cocoon-2.2.0-683619/core/cocoon-core/target/surefire-reports

-------------------------------------------------------
 T E S T S
-------------------------------------------------------
Running org.apache.cocoon.selection.ResourceExistsSelectorTestCase
log4j:WARN No appenders could be found for logger
(org.springframework.beans.factory.support.DefaultListableBeanFactory).
log4j:WARN Please initialize the log4j system properly.
true
false
true
false
Tests run: 2, Failures: 0, Errors: 0, Skipped: 0, Time elapsed: 1.836 sec
Running org.apache.cocoon.matching.HeaderMatcherTestCase
{1=headerMatchTestCaseValue}
Tests run: 2, Failures: 0, Errors: 0, Skipped: 0, Time elapsed: 0.286 sec
Running org.apache.cocoon.matching.SessionAttributeMatcherTestCase
{1=sessionAttributeMatchTestCaseValue}
Tests run: 2, Failures: 0, Errors: 0, Skipped: 0, Time elapsed: 0.305 sec
Running org.apache.cocoon.core.container.util.PropertyHelperTestCase
Tests run: 1, Failures: 0, Errors: 0, Skipped: 0, Time elapsed: 0.007 sec
Running org.apache.cocoon.selection.SessionAttributeSelectorTestCase
true
false
true
false
false
Tests run: 3, Failures: 0, Errors: 0, Skipped: 0, Time elapsed: 0.405 sec
Running org.apache.cocoon.acting.LocaleActionTestCase
Tests run: 2, Failures: 0, Errors: 0, Skipped: 0, Time elapsed: 0.334 sec
Running org.apache.cocoon.selection.HeaderSelectorTestCase
true
false
true
false
Tests run: 2, Failures: 0, Errors: 0, Skipped: 0, Time elapsed: 0.232 sec
Running org.apache.cocoon.matching.RequestParameterMatcherTestCase
{1=requestParameterMatchTestCaseValue}
Tests run: 2, Failures: 0, Errors: 0, Skipped: 0, Time elapsed: 0.234 sec
Running org.apache.cocoon.transformation.EncodeURLTransformerTestCase
resultDocument
<?xml version="1.0" encoding="UTF-8"?><!--
  Licensed to the Apache Software Foundation (ASF) under one or more
  contributor license agreements.  See the NOTICE file distributed with
  this work for additional information regarding copyright ownership.
  The ASF licenses this file to You under the Apache License, Version 2.0
  (the "License"); you may not use this file except in compliance with
  the License.  You may obtain a copy of the License at

      http://www.apache.org/licenses/LICENSE-2.0

  Unless required by applicable law or agreed to in writing, software
  distributed under the License is distributed on an "AS IS" BASIS,
  WITHOUT WARRANTIES OR CONDITIONS OF ANY KIND, either express or implied.
  See the License for the specific language governing permissions and
  limitations under the License.
--><root><x>X</x> A  d  x x </root>
inputDocument
<?xml version="1.0" encoding="UTF-8"?><!--
  Licensed to the Apache Software Foundation (ASF) under one or more
  contributor license agreements.  See the NOTICE file distributed with
  this work for additional information regarding copyright ownership.
  The ASF licenses this file to You under the Apache License, Version 2.0
  (the "License"); you may not use this file except in compliance with
  the License.  You may obtain a copy of the License at

      http://www.apache.org/licenses/LICENSE-2.0

  Unless required by applicable law or agreed to in writing, software
  distributed under the License is distributed on an "AS IS" BASIS,
  WITHOUT WARRANTIES OR CONDITIONS OF ANY KIND, either express or implied.
  See the License for the specific language governing permissions and
  limitations under the License.
--><root><x>X</x> A  d  x x </root>
transformDocument
<?xml version="1.0" encoding="UTF-8"?><root><x>X</x> A  d  x x </root>
resultDocument
<?xml version="1.0" encoding="UTF-8"?><!--
  Licensed to the Apache Software Foundation (ASF) under one or more
  contributor license agreements.  See the NOTICE file distributed with
  this work for additional information regarding copyright ownership.
  The ASF licenses this file to You under the Apache License, Version 2.0
  (the "License"); you may not use this file except in compliance with
  the License.  You may obtain a copy of the License at

      http://www.apache.org/licenses/LICENSE-2.0

  Unless required by applicable law or agreed to in writing, software
  distributed under the License is distributed on an "AS IS" BASIS,
  WITHOUT WARRANTIES OR CONDITIONS OF ANY KIND, either express or implied.
  See the License for the specific language governing permissions and
  limitations under the License.
--><root><x>X</x> A  d  x?JSESSIONID=MockSession x  img/src must not
be
encoded  href must be encoded?JSESSIONID=MockSession <form action="action
must be encoded?JSESSIONID=MockSession"/></root>
inputDocument
<?xml version="1.0" encoding="UTF-8"?><!--
  Licensed to the Apache Software Foundation (ASF) under one or more
  contributor license agreements.  See the NOTICE file distributed with
  this work for additional information regarding copyright ownership.
  The ASF licenses this file to You under the Apache License, Version 2.0
  (the "License"); you may not use this file except in compliance with
  the License.  You may obtain a copy of the License at

      http://www.apache.org/licenses/LICENSE-2.0

  Unless required by applicable law or agreed to in writing, software
  distributed under the License is distributed on an "AS IS" BASIS,
  WITHOUT WARRANTIES OR CONDITIONS OF ANY KIND, either express or implied.
  See the License for the specific language governing permissions and
  limitations under the License.
--><root><x>X</x> A  d  x x  img/src must not be encoded  href must be
encoded <form action="action must be encoded"/></root>
transformDocument
<?xml version="1.0" encoding="UTF-8"?><root><x>X</x> A  d 
x?JSESSIONID=MockSession x  img/src must not be encoded  href must be
encoded?JSESSIONID=MockSession <form action="action must be
encoded?JSESSIONID=MockSession"/></root>
Tests run: 2, Failures: 0, Errors: 0, Skipped: 0, Time elapsed: 1.107 sec
Running org.apache.cocoon.selection.HostSelectorTestCase
true
false
false
false
Tests run: 2, Failures: 0, Errors: 0, Skipped: 0, Time elapsed: 0.228 sec
Running org.apache.cocoon.selection.BrowserSelectorTestCase
false
true
false
Tests run: 2, Failures: 0, Errors: 0, Skipped: 0, Time elapsed: 0.221 sec
Running org.apache.cocoon.transformation.TraxTransformerTestCase
Tests run: 2, Failures: 0, Errors: 0, Skipped: 0, Time elapsed: 5.48 sec
Running org.apache.cocoon.matching.WildcardURIMatcherTestCase
Tests run: 3, Failures: 0, Errors: 0, Skipped: 0, Time elapsed: 0.249 sec
Running org.apache.cocoon.selection.SimpleSelectorTestCase
false
false
true
false
Tests run: 2, Failures: 0, Errors: 0, Skipped: 0, Time elapsed: 0.22 sec
Running org.apache.cocoon.matching.RegexpURIMatcherTestCase
{2=null, 1=test/foo/bla/end, 0=test/foo/bla/end}
{3=null, 2=end, 1=test/foo, 0=test/foo/bla/end}
Tests run: 1, Failures: 0, Errors: 0, Skipped: 0, Time elapsed: 0.112 sec
Running org.apache.cocoon.selection.RequestParameterSelectorTestCase
true
false
true
false
Tests run: 2, Failures: 0, Errors: 0, Skipped: 0, Time elapsed: 0.195 sec
Running org.apache.cocoon.selection.CookieSelectorTestCase
true
false
true
false
Tests run: 2, Failures: 0, Errors: 0, Skipped: 0, Time elapsed: 0.186 sec
Running org.apache.cocoon.selection.RequestAttributeSelectorTestCase
true
false
true
false
Tests run: 2, Failures: 0, Errors: 0, Skipped: 0, Time elapsed: 0.451 sec
Running
org.apache.cocoon.components.treeprocessor.variables.PreparedVariableResolverTestCase
Tests run: 14, Failures: 0, Errors: 0, Skipped: 0, Time elapsed: 10.235 sec
Running org.apache.cocoon.matching.ParameterMatcherTestCase
{1=parameterMatchTestCaseValue}
Tests run: 2, Failures: 0, Errors: 0, Skipped: 0, Time elapsed: 0.179 sec
Running org.apache.cocoon.transformation.FilterTransformerTestCase
Tests run: 3, Failures: 0, Errors: 0, Skipped: 0, Time elapsed: 0.47 sec
Running org.apache.cocoon.transformation.I18NTransformerTestCase
Tests run: 2, Failures: 0, Errors: 0, Skipped: 0, Time elapsed: 0.446 sec
Running org.apache.cocoon.transformation.XIncludeTransformerTestCase
Tests run: 6, Failures: 0, Errors: 0, Skipped: 0, Time elapsed: 0.556 sec
Running org.apache.cocoon.acting.RequestParamActionTestCase
Tests run: 1, Failures: 0, Errors: 0, Skipped: 0, Time elapsed: 0.013 sec
Running org.apache.cocoon.selection.RegexpRequestParameterSelectorTestCase
true
false
false
false
true
false
Tests run: 2, Failures: 0, Errors: 0, Skipped: 0, Time elapsed: 0.213 sec
Running org.apache.cocoon.components.source.impl.ZipSourceTestCase
Tests run: 1, Failures: 0, Errors: 0, Skipped: 0, Time elapsed: 0.097 sec
Running org.apache.cocoon.matching.CookieMatcherTestCase
{1=cookieValue}
null
Tests run: 2, Failures: 0, Errors: 0, Skipped: 0, Time elapsed: 0.175 sec
Running org.apache.cocoon.transformation.XAbstractDOMTransformerTestCase
Tests run: 1, Failures: 0, Errors: 0, Skipped: 0, Time elapsed: 0.043 sec
Running org.apache.cocoon.xml.ParamSaxBufferTestCase
Tests run: 3, Failures: 0, Errors: 0, Skipped: 0, Time elapsed: 0.031 sec
Running org.apache.cocoon.generation.FileGeneratorBeanTestCase
Tests run: 1, Failures: 0, Errors: 0, Skipped: 0, Time elapsed: 0.125 sec
Running org.apache.cocoon.selection.ExceptionSelectorTestCase
true
false
false
true
false
true
Tests run: 4, Failures: 0, Errors: 0, Skipped: 0, Time elapsed: 0.676 sec
Running org.apache.cocoon.acting.ResourceExistsActionTestCase
Tests run: 2, Failures: 0, Errors: 0, Skipped: 0, Time elapsed: 0.052 sec
Running org.apache.cocoon.transformation.AugmentTransformerTestCase
resultDocument
<?xml version="1.0" encoding="UTF-8"?><!--
  Licensed to the Apache Software Foundation (ASF) under one or more
  contributor license agreements.  See the NOTICE file distributed with
  this work for additional information regarding copyright ownership.
  The ASF licenses this file to You under the Apache License, Version 2.0
  (the "License"); you may not use this file except in compliance with
  the License.  You may obtain a copy of the License at

      http://www.apache.org/licenses/LICENSE-2.0

  Unless required by applicable law or agreed to in writing, software
  distributed under the License is distributed on an "AS IS" BASIS,
  WITHOUT WARRANTIES OR CONDITIONS OF ANY KIND, either express or implied.
  See the License for the specific language governing permissions and
  limitations under the License.
--><root><x>X</x> A  d  http://null/portal1/sect1/x x </root>
inputDocument
<?xml version="1.0" encoding="UTF-8"?><!--
  Licensed to the Apache Software Foundation (ASF) under one or more
  contributor license agreements.  See the NOTICE file distributed with
  this work for additional information regarding copyright ownership.
  The ASF licenses this file to You under the Apache License, Version 2.0
  (the "License"); you may not use this file except in compliance with
  the License.  You may obtain a copy of the License at

      http://www.apache.org/licenses/LICENSE-2.0

  Unless required by applicable law or agreed to in writing, software
  distributed under the License is distributed on an "AS IS" BASIS,
  WITHOUT WARRANTIES OR CONDITIONS OF ANY KIND, either express or implied.
  See the License for the specific language governing permissions and
  limitations under the License.
--><root><x>X</x> A  d  x x </root>
transformDocument
<?xml version="1.0" encoding="UTF-8"?><root><x>X</x> A  d 
http://null/portal1/sect1/x x </root>
Tests run: 1, Failures: 0, Errors: 0, Skipped: 0, Time elapsed: 0.192 sec
Running org.apache.cocoon.matching.RequestAttributeMatcherTestCase
{1=requestAttributeMatchTestCaseValue}
Tests run: 2, Failures: 0, Errors: 0, Skipped: 0, Time elapsed: 0.162 sec
Running org.apache.cocoon.selection.RegexpHeaderSelectorTestCase
true
false
false
false
false
true
false
Tests run: 2, Failures: 0, Errors: 0, Skipped: 0, Time elapsed: 0.205 sec
Running org.apache.cocoon.transformation.CIncludeTransformerTestCase
Tests run: 3, Failures: 0, Errors: 0, Skipped: 0, Time elapsed: 0.575 sec
Running org.apache.cocoon.selection.RequestMethodSelectorTestCase
true
false
false
Tests run: 1, Failures: 0, Errors: 0, Skipped: 0, Time elapsed: 0.079 sec
Running org.apache.cocoon.selection.ParameterSelectorTestCase
true
false
false
false
Tests run: 2, Failures: 0, Errors: 0, Skipped: 0, Time elapsed: 0.165 sec
Running org.apache.cocoon.generation.FileGeneratorTestCase
Tests run: 1, Failures: 0, Errors: 0, Skipped: 0, Time elapsed: 0.053 sec
Running org.apache.cocoon.components.source.impl.CachingSourceTestCase
Tests run: 6, Failures: 2, Errors: 0, Skipped: 0, Time elapsed: 758.661 sec
<<< FAILURE!

Results :

Failed tests: 
 
testCachingURI(org.apache.cocoon.components.source.impl.CachingSourceTestCase)
 
testRefreshSyncURI(org.apache.cocoon.components.source.impl.CachingSourceTestCase)

Tests run: 98, Failures: 2, Errors: 0, Skipped: 0

[INFO]
------------------------------------------------------------------------
[ERROR] BUILD FAILURE
[INFO]
------------------------------------------------------------------------
[INFO] There are test failures.
[INFO]
------------------------------------------------------------------------
[INFO] For more information, run Maven with the -e switch
[INFO]
------------------------------------------------------------------------
[INFO] Total time: 17 minutes 30 seconds
[INFO] Finished at: Fri Aug 08 12:11:06 CEST 2008
[INFO] Final Memory: 98M/175M
[INFO]
------------------------------------------------------------------------

-- 
View this message in context: http://www.nabble.com/C22---Maven-artifact-missing-tp17780552p18887735.html
Sent from the Cocoon - Users mailing list archive at Nabble.com.


---------------------------------------------------------------------
To unsubscribe, e-mail: users-unsubscribe@cocoon.apache.org
For additional commands, e-mail: users-help@cocoon.apache.org


Mime
View raw message