cocoon-users mailing list archives

Site index · List index
Message view « Date » · « Thread »
Top « Date » · « Thread »
From "Murali Krishna" <murali.bhadrag...@valuelabs.net>
Subject Build problem
Date Tue, 11 Sep 2007 15:09:16 GMT
Sir,
While installing Cocoon on the Windows XP2002 with java version JDK 1.5.0_06 following the
instructions  provided in the install.txt of  cocoon-2.1.10 distribution,in the step (3) ,when
the "build" command is executed from the command prompt ,the control after executing number
of targets finally fails the build at a point.The following is the stack trace :


BUILD FAILED
C:\krish\workarea\cocoon-2.1.10\tools\targets\compile-build.xml:255: The follow
ng error occurred while executing this line:
C:\krish\workarea\cocoon-2.1.10\build\cocoon\temp\blocks-build.xml:2792: The fo
lowing error occurred while executing this line:
C:\krish\workarea\cocoon-2.1.10\build\cocoon\temp\blocks-build.xml:183: FileNot
oundException: java.io.FileNotFoundException: C:\krish\workarea\cocoon-2.1.10\b
ild\cocoon\classes\org\apache\cocoon\cocoon.roles (The requested operation cann
t be performed on a file with a user-mapped section open)


In my previous mail (with subject- "Installation Problem",dated-"11 September,2007") I was
given a solution for changing the folder of the Cocoon home .I tried with that also but it
didnt work.

Please help me out in configuring the cocoon.

Thanks and regards,
Murali krishna Bhadragiri




Mime
View raw message