cocoon-users mailing list archives

Site index · List index
Message view « Date » · « Thread »
Top « Date » · « Thread »
From "Antonio Gallardo" <agalla...@agsoftware.dnsalias.com>
Subject [2.1 CVS] - Build error
Date Tue, 03 Dec 2002 09:10:38 GMT
Hi!

I was currently downloading the lastest CVS of 2.1. I made a

./build.sh clean after download.

Now I am getting this error:

Error in:
xml-cocoon2/build/cocoon/blocks/databases/dest/db-modules-input.xconf

BUILD FAILED
file:xml-cocoon2/build.xml:1310: IOException: java.io.IOException: XPath
(/cocoon/input-modules) returned not one node, but 0 nodes

Regards,

Antonio Gallardo.



---------------------------------------------------------------------
Please check that your question  has not already been answered in the
FAQ before posting.     <http://xml.apache.org/cocoon/faq/index.html>

To unsubscribe, e-mail:     <cocoon-users-unsubscribe@xml.apache.org>
For additional commands, e-mail:   <cocoon-users-help@xml.apache.org>


Mime
View raw message