cocoon-docs mailing list archives

Site index · List index
Message view « Date » · « Thread »
Top « Date » · « Thread »
From "Continuum@cocoon.zones.apache.org" <d...@cocoon.apache.org>
Subject [continuum] BUILD FAILURE: $cdocs
Date Fri, 15 Dec 2006 17:05:57 GMT
Online report : http://cocoon.zones.apache.org:12000/continuum/servlet/continuum/target/ProjectBuild.vm/view/ProjectBuild/id/46/buildId/1093
Build statistics:
  State: Failed
  Previous State: Ok
  Started at: Fri, 15 Dec 2006 17:04:15 +0000
  Finished at: Fri, 15 Dec 2006 17:05:56 +0000
  Total time: 1m 41s
  Build Trigger: Forced
  Exit code: 1
  Building machine hostname: cocoon.zones.apache.org
  Operating system : SunOS(unknown)
  Java version : 1.4.2_06(Sun Microsystems Inc.)

Changes
      No files changed
  
****************************************************************************
Output:
****************************************************************************
[INFO] Scanning for projects...
[INFO] ----------------------------------------------------------------------------
[INFO] Building Apache Cocoon
[INFO]    task-segment: [install]
[INFO] ----------------------------------------------------------------------------
[INFO] [site:attach-descriptor]
[INFO] [install:install]
[INFO] Installing /home/maven/continuum-data/working-directory/46/pom.xml to /home/maven/.m2/repository/org/apache/cocoon/cocoon/3-SNAPSHOT/cocoon-3-SNAPSHOT.pom
[INFO] ------------------------------------------------------------------------
[INFO] BUILD SUCCESSFUL
[INFO] ------------------------------------------------------------------------
[INFO] Total time: 7 seconds
[INFO] Finished at: Fri Dec 15 17:04:28 GMT 2006
[INFO] Final Memory: 6M/11M
[INFO] ------------------------------------------------------------------------
[INFO] Scanning for projects...
[INFO] Reactor build order: 
[INFO]   Cocoon Site [modules]
[INFO]   Apache Cocoon Blocks Site
[INFO]   Apache Cocoon Core Modules Site
[INFO]   Apache Cocoon Main Site
[INFO]   Apache Cocoon Maven Plugins Site
[INFO]   Cocoon Core
[INFO]   Ajax Block Implementation
[INFO]   Cocoon Authentication Implementation
[INFO]   Captcha Block Implementation
[INFO]   Flowscript Block
[INFO]   FOP Block Implementation
[INFO]   Forms Block Implementation
[INFO]   Lucene Block Implementation
[INFO]   Mail Block Implementation
[INFO]   Portal Block Implementation
[INFO]   Serializers Block Implementation
[INFO]   Template framework implementation
[INFO] ----------------------------------------------------------------------------
[INFO] Building Cocoon Site [modules]
[INFO]    task-segment: [site-deploy]
[INFO] ----------------------------------------------------------------------------
[INFO] Setting property: classpath.resource.loader.class => 'org.codehaus.plexus.velocity.ContextClassLoaderResourceLoader'.
[INFO] Setting property: velocimacro.messages.on => 'false'.
[INFO] Setting property: resource.loader => 'classpath'.
[INFO] Setting property: resource.manager.logwhenfound => 'false'.
[INFO] Setting property: classpath.resource.loader.class => 'org.codehaus.plexus.velocity.ContextClassLoaderResourceLoader'.
[INFO] Setting property: velocimacro.messages.on => 'false'.
[INFO] Setting property: resource.loader => 'classpath'.
[INFO] Setting property: resource.manager.logwhenfound => 'false'.
[INFO] [site:site]
[WARNING] Unable to load parent project from repository: Could not find the model file '/home/maven/continuum-data/working-directory/46/site/../../pom.xml'.
[INFO] artifact org.apache.maven.skins:maven-default-skin: checking for updates from apache-cvs
[INFO] Generate "Project License" report.
[ERROR] VM #displayTree: error : too few arguments to macro. Wanted 2 got 0
[ERROR] VM #menuItem: error : too few arguments to macro. Wanted 1 got 0
[INFO] [site:deploy]
file:///home/config/cocoon.zone/dev-docs/site - Session: Opened  
file:///home/config/cocoon.zone/dev-docs/site - Session: Disconnecting  
file:///home/config/cocoon.zone/dev-docs/site - Session: Disconnected
[INFO] ----------------------------------------------------------------------------
[INFO] Building Apache Cocoon Blocks Site
[INFO]    task-segment: [site-deploy]
[INFO] ----------------------------------------------------------------------------
Downloading: http://ibiblio.org/maven2/daisy/daisy-repository-spi/1.5-M1/daisy-repository-spi-1.5-M1.pom
[WARNING] Unable to get resource from repository central (http://ibiblio.org/maven2)
Downloading: http://cocoondev.org/repository//daisy/poms/daisy-repository-spi-1.5-M1.pom
[WARNING] Unable to get resource from repository cocoon-dev (http://cocoondev.org/repository/)
Downloading: http://svn.apache.org/maven-snapshot-repository/daisy/daisy-repository-spi/1.5-M1/daisy-repository-spi-1.5-M1.pom
[WARNING] Unable to get resource from repository apache.snapshot (http://svn.apache.org/maven-snapshot-repository)
Downloading: http://ibiblio.org/maven2/daisy/daisy-repository-api/1.5-M1/daisy-repository-api-1.5-M1.pom
[WARNING] Unable to get resource from repository central (http://ibiblio.org/maven2)
Downloading: http://cocoondev.org/repository//daisy/poms/daisy-repository-api-1.5-M1.pom
[WARNING] Unable to get resource from repository cocoon-dev (http://cocoondev.org/repository/)
Downloading: http://svn.apache.org/maven-snapshot-repository/daisy/daisy-repository-api/1.5-M1/daisy-repository-api-1.5-M1.pom
[WARNING] Unable to get resource from repository apache.snapshot (http://svn.apache.org/maven-snapshot-repository)
Downloading: http://ibiblio.org/maven2/daisy/daisy-repository-client-impl/1.5-M1/daisy-repository-client-impl-1.5-M1.pom
[WARNING] Unable to get resource from repository central (http://ibiblio.org/maven2)
Downloading: http://cocoondev.org/repository//daisy/poms/daisy-repository-client-impl-1.5-M1.pom
[WARNING] Unable to get resource from repository cocoon-dev (http://cocoondev.org/repository/)
Downloading: http://svn.apache.org/maven-snapshot-repository/daisy/daisy-repository-client-impl/1.5-M1/daisy-repository-client-impl-1.5-M1.pom
[WARNING] Unable to get resource from repository apache.snapshot (http://svn.apache.org/maven-snapshot-repository)
Downloading: http://ibiblio.org/maven2/daisy/daisy-util/1.5-M1/daisy-util-1.5-M1.pom
[WARNING] Unable to get resource from repository central (http://ibiblio.org/maven2)
Downloading: http://cocoondev.org/repository//daisy/poms/daisy-util-1.5-M1.pom
[WARNING] Unable to get resource from repository cocoon-dev (http://cocoondev.org/repository/)
Downloading: http://svn.apache.org/maven-snapshot-repository/daisy/daisy-util/1.5-M1/daisy-util-1.5-M1.pom
[WARNING] Unable to get resource from repository apache.snapshot (http://svn.apache.org/maven-snapshot-repository)
Downloading: http://ibiblio.org/maven2/daisy/daisy-repository-common-impl/1.5-M1/daisy-repository-common-impl-1.5-M1.pom
[WARNING] Unable to get resource from repository central (http://ibiblio.org/maven2)
Downloading: http://cocoondev.org/repository//daisy/poms/daisy-repository-common-impl-1.5-M1.pom
[WARNING] Unable to get resource from repository cocoon-dev (http://cocoondev.org/repository/)
Downloading: http://svn.apache.org/maven-snapshot-repository/daisy/daisy-repository-common-impl/1.5-M1/daisy-repository-common-impl-1.5-M1.pom
[WARNING] Unable to get resource from repository apache.snapshot (http://svn.apache.org/maven-snapshot-repository)
Downloading: http://ibiblio.org/maven2/daisy/daisy-repository-xmlschema-bindings/1.5-M1/daisy-repository-xmlschema-bindings-1.5-M1.pom
[WARNING] Unable to get resource from repository central (http://ibiblio.org/maven2)
Downloading: http://cocoondev.org/repository//daisy/poms/daisy-repository-xmlschema-bindings-1.5-M1.pom
[WARNING] Unable to get resource from repository cocoon-dev (http://cocoondev.org/repository/)
Downloading: http://svn.apache.org/maven-snapshot-repository/daisy/daisy-repository-xmlschema-bindings/1.5-M1/daisy-repository-xmlschema-bindings-1.5-M1.pom
[WARNING] Unable to get resource from repository apache.snapshot (http://svn.apache.org/maven-snapshot-repository)
Downloading: http://ibiblio.org/maven2/daisy/daisy-jmsclient-api/1.5-M1/daisy-jmsclient-api-1.5-M1.pom
[WARNING] Unable to get resource from repository central (http://ibiblio.org/maven2)
Downloading: http://cocoondev.org/repository//daisy/poms/daisy-jmsclient-api-1.5-M1.pom
[WARNING] Unable to get resource from repository cocoon-dev (http://cocoondev.org/repository/)
Downloading: http://svn.apache.org/maven-snapshot-repository/daisy/daisy-jmsclient-api/1.5-M1/daisy-jmsclient-api-1.5-M1.pom
[WARNING] Unable to get resource from repository apache.snapshot (http://svn.apache.org/maven-snapshot-repository)
Downloading: http://ibiblio.org/maven2/daisy/daisy-publisher-xmlschema-bindings/1.5-M1/daisy-publisher-xmlschema-bindings-1.5-M1.pom
[WARNING] Unable to get resource from repository central (http://ibiblio.org/maven2)
Downloading: http://cocoondev.org/repository//daisy/poms/daisy-publisher-xmlschema-bindings-1.5-M1.pom
[WARNING] Unable to get resource from repository cocoon-dev (http://cocoondev.org/repository/)
Downloading: http://svn.apache.org/maven-snapshot-repository/daisy/daisy-publisher-xmlschema-bindings/1.5-M1/daisy-publisher-xmlschema-bindings-1.5-M1.pom
[WARNING] Unable to get resource from repository apache.snapshot (http://svn.apache.org/maven-snapshot-repository)
Downloading: http://ibiblio.org/maven2/daisy/daisy-textextraction-api/1.5-M1/daisy-textextraction-api-1.5-M1.pom
[WARNING] Unable to get resource from repository central (http://ibiblio.org/maven2)
Downloading: http://cocoondev.org/repository//daisy/poms/daisy-textextraction-api-1.5-M1.pom
[WARNING] Unable to get resource from repository cocoon-dev (http://cocoondev.org/repository/)
Downloading: http://svn.apache.org/maven-snapshot-repository/daisy/daisy-textextraction-api/1.5-M1/daisy-textextraction-api-1.5-M1.pom
[WARNING] Unable to get resource from repository apache.snapshot (http://svn.apache.org/maven-snapshot-repository)
Downloading: http://ibiblio.org/maven2/daisy/daisy-linkextractors/1.5-M1/daisy-linkextractors-1.5-M1.pom
[WARNING] Unable to get resource from repository central (http://ibiblio.org/maven2)
Downloading: http://cocoondev.org/repository//daisy/poms/daisy-linkextractors-1.5-M1.pom
[WARNING] Unable to get resource from repository cocoon-dev (http://cocoondev.org/repository/)
Downloading: http://svn.apache.org/maven-snapshot-repository/daisy/daisy-linkextractors/1.5-M1/daisy-linkextractors-1.5-M1.pom
[WARNING] Unable to get resource from repository apache.snapshot (http://svn.apache.org/maven-snapshot-repository)
[INFO] [daisy:cocoon {execution: default}]
[INFO] Deleting /home/maven/continuum-data/working-directory/46/site/cocoon-blocks-site/src/site/site.xml
log4j:WARN No appenders could be found for logger (org.apache.commons.httpclient.HttpClient).
log4j:WARN Please initialize the log4j system properly.
[INFO] Processing DaisyDocumentProxy[id=1204 branchId=1 languageId=1]
[INFO] Processing DaisyDocumentProxy[id=1220 branchId=1 languageId=1]
[INFO] Processing DaisyDocumentProxy[id=1236 branchId=1 languageId=1]
[INFO] Processing DaisyDocumentProxy[id=1238 branchId=1 languageId=1]
[INFO] Processing DaisyDocumentProxy[id=1217 branchId=1 languageId=1]
[INFO] Processing DaisyDocumentProxy[id=1240 branchId=1 languageId=1]
[INFO] Processing DaisyDocumentProxy[id=489 branchId=1 languageId=1]
[INFO] Processing DaisyDocumentProxy[id=1243 branchId=1 languageId=1]
[INFO] Processing DaisyDocumentProxy[id=1246 branchId=1 languageId=1]
[INFO] Processing DaisyDocumentProxy[id=1248 branchId=1 languageId=1]
[INFO] Processing DaisyDocumentProxy[id=1250 branchId=1 languageId=1]
[INFO] Skipping 1240 (not in the collection 'cdocs-site-blocks')
[INFO] Processing DaisyDocumentProxy[id=1215 branchId=1 languageId=1]
[INFO] Skipping 1217 (not in the collection 'cdocs-site-blocks')
[INFO] Processing DaisyDocumentProxy[id=1252 branchId=1 languageId=1]
[INFO] Skipping 1238 (not in the collection 'cdocs-site-blocks')
[INFO] Skipping 1236 (not in the collection 'cdocs-site-blocks')
[INFO] Skipping 1243 (not in the collection 'cdocs-site-blocks')
[INFO] Skipping 1215 (not in the collection 'cdocs-site-blocks')
[INFO] Skipping 1248 (not in the collection 'cdocs-site-blocks')
[INFO] Skipping 489 (not in the collection 'cdocs-site-blocks')
[INFO] Skipping 1246 (not in the collection 'cdocs-site-blocks')
[INFO] Skipping 1220 (not in the collection 'cdocs-site-blocks')
[INFO] Skipping 1250 (not in the collection 'cdocs-site-blocks')
[INFO] Skipping 1252 (not in the collection 'cdocs-site-blocks')
[INFO] [site:site]
[WARNING] Unable to load parent project from repository: Could not find the model file '/home/maven/continuum-data/working-directory/46/site/../../pom.xml'.
[INFO] Generate "Project License" report.
[INFO] [site:deploy]
file:///home/config/cocoon.zone/dev-docs/blocks/ - Session: Opened  
file:///home/config/cocoon.zone/dev-docs/blocks/ - Session: Disconnecting  
file:///home/config/cocoon.zone/dev-docs/blocks/ - Session: Disconnected
[INFO] ----------------------------------------------------------------------------
[INFO] Building Apache Cocoon Core Modules Site
[INFO]    task-segment: [site-deploy]
[INFO] ----------------------------------------------------------------------------
[INFO] [daisy:cocoon {execution: default}]
[INFO] Deleting /home/maven/continuum-data/working-directory/46/site/cocoon-core-site/src/site/site.xml
[INFO] Processing DaisyDocumentProxy[id=1210 branchId=1 languageId=1]
[INFO] Processing DaisyDocumentProxy[id=1270 branchId=1 languageId=1]
[INFO] Skipping 1270 (not in the collection 'cdocs-site-core-modules')
[INFO] [site:site]
[WARNING] Unable to load parent project from repository: Could not find the model file '/home/maven/continuum-data/working-directory/46/site/../../pom.xml'.
[INFO] Generate "Project License" report.
[INFO] [site:deploy]
file:///home/config/cocoon.zone/dev-docs/core-modules/ - Session: Opened  
file:///home/config/cocoon.zone/dev-docs/core-modules/ - Session: Disconnecting  
file:///home/config/cocoon.zone/dev-docs/core-modules/ - Session: Disconnected
[INFO] ----------------------------------------------------------------------------
[INFO] Building Apache Cocoon Main Site
[INFO]    task-segment: [site-deploy]
[INFO] ----------------------------------------------------------------------------
[INFO] [daisy:cocoon {execution: default}]
[INFO] Deleting /home/maven/continuum-data/working-directory/46/site/cocoon-main-site/src/site/site.xml
[INFO] Processing DaisyDocumentProxy[id=1213 branchId=1 languageId=1]
[INFO] Processing DaisyDocumentProxy[id=1273 branchId=1 languageId=1]
[INFO] Processing DaisyDocumentProxy[id=1178 branchId=1 languageId=1]
[INFO] Processing DaisyDocumentProxy[id=1274 branchId=1 languageId=1]
[INFO] Processing DaisyDocumentProxy[id=1272 branchId=1 languageId=1]
[INFO] Processing DaisyDocumentProxy[id=1271 branchId=1 languageId=1]
[INFO] Processing DaisyDocumentProxy[id=1159 branchId=1 languageId=1]
[INFO] Processing DaisyDocumentProxy[id=1181 branchId=1 languageId=1]
[INFO] Processing DaisyDocumentProxy[id=1275 branchId=1 languageId=1]
[INFO] Processing DaisyDocumentProxy[id=1276 branchId=1 languageId=1]
[INFO] Skipping 1181 (not in the collection 'cdocs-site-main')
[INFO] Processing DaisyDocumentProxy[id=1199 branchId=1 languageId=1]
[INFO] Processing DaisyDocumentProxy[id=1279 branchId=1 languageId=1]
[INFO] Processing DaisyDocumentProxy[id=1281 branchId=1 languageId=1]
[INFO] Processing DaisyDocumentProxy[id=1280 branchId=1 languageId=1]
[INFO] Processing DaisyDocumentProxy[id=1278 branchId=1 languageId=1]
[INFO] Processing DaisyDocumentProxy[id=1277 branchId=1 languageId=1]
[INFO] Skipping 1281 (not in the collection 'cdocs-site-main')
[INFO] Skipping 1280 (not in the collection 'cdocs-site-main')
[WARNING] Can't resolve link to DaisyLink[id=1281 branchId=1 languageId=1 parent=DaisyDocumentProxy[id=1213
branchId=1 languageId=1]]
[INFO] [site:site]
[WARNING] Unable to load parent project from repository: Could not find the model file '/home/maven/continuum-data/working-directory/46/site/../../pom.xml'.
[INFO] Generate "Continuous Integration" report.
[INFO] Generate "Issue Tracking" report.
[INFO] Generate "Project License" report.
[INFO] Generate "Mailing Lists" report.
[INFO] Generate "Project Team" report.
[INFO] [site:deploy]
file:///home/config/cocoon.zone/dev-docs - Session: Opened  
file:///home/config/cocoon.zone/dev-docs - Session: Disconnecting  
file:///home/config/cocoon.zone/dev-docs - Session: Disconnected
[INFO] ----------------------------------------------------------------------------
[INFO] Building Apache Cocoon Maven Plugins Site
[INFO]    task-segment: [site-deploy]
[INFO] ----------------------------------------------------------------------------
[INFO] [daisy:cocoon {execution: default}]
[INFO] Deleting /home/maven/continuum-data/working-directory/46/site/cocoon-maven-plugins-site/src/site/site.xml
[INFO] Processing DaisyDocumentProxy[id=1208 branchId=1 languageId=1]
[INFO] [site:site]
[WARNING] Unable to load parent project from repository: Could not find the model file '/home/maven/continuum-data/working-directory/46/site/../../pom.xml'.
[INFO] Generate "Project License" report.
[INFO] [site:deploy]
file:///home/config/cocoon.zone/dev-docs/maven-plugins/ - Session: Opened  
file:///home/config/cocoon.zone/dev-docs/maven-plugins/ - Session: Disconnecting  
file:///home/config/cocoon.zone/dev-docs/maven-plugins/ - Session: Disconnected
[INFO] ----------------------------------------------------------------------------
[INFO] Building Cocoon Core
[INFO]    task-segment: [site-deploy]
[INFO] ----------------------------------------------------------------------------
Downloading: http://repo1.maven.org/maven2/org/springframework/spring-beans/2.4.1/spring-beans-2.4.1.pom
[WARNING] Unable to get resource from repository central (http://repo1.maven.org/maven2)
Downloading: http://people.apache.org/repo/m2-snapshot-repository/org/springframework/spring-beans/2.4.1/spring-beans-2.4.1.pom
[WARNING] Unable to get resource from repository apache.snapshot (http://people.apache.org/repo/m2-snapshot-repository)
Downloading: http://people.apache.org/repo/m1-snapshot-repository/org.springframework/poms/spring-beans-2.4.1.pom
[WARNING] Unable to get resource from repository apache-cvs (http://people.apache.org/repo/m1-snapshot-repository)
Downloading: http://repo1.maven.org/maven2/org/springframework/spring-core/2.4.1/spring-core-2.4.1.pom
[WARNING] Unable to get resource from repository central (http://repo1.maven.org/maven2)
Downloading: http://people.apache.org/repo/m2-snapshot-repository/org/springframework/spring-core/2.4.1/spring-core-2.4.1.pom
[WARNING] Unable to get resource from repository apache.snapshot (http://people.apache.org/repo/m2-snapshot-repository)
Downloading: http://people.apache.org/repo/m1-snapshot-repository/org.springframework/poms/spring-core-2.4.1.pom
[WARNING] Unable to get resource from repository apache-cvs (http://people.apache.org/repo/m1-snapshot-repository)
Downloading: http://repo1.maven.org/maven2/org/springframework/spring-context/2.4.1/spring-context-2.4.1.pom
[WARNING] Unable to get resource from repository central (http://repo1.maven.org/maven2)
Downloading: http://people.apache.org/repo/m2-snapshot-repository/org/springframework/spring-context/2.4.1/spring-context-2.4.1.pom
[WARNING] Unable to get resource from repository apache.snapshot (http://people.apache.org/repo/m2-snapshot-repository)
Downloading: http://people.apache.org/repo/m1-snapshot-repository/org.springframework/poms/spring-context-2.4.1.pom
[WARNING] Unable to get resource from repository apache-cvs (http://people.apache.org/repo/m1-snapshot-repository)
[WARNING] 
	Artifact junit:junit:jar:3.8.2:test retains local scope 'test' overriding broader scope 'compile'
	given by a dependency. If this is not intended, modify or remove the local scope.

[WARNING] 
	Artifact javax.servlet:servlet-api:jar:2.4:provided retains local scope 'provided' overriding
broader scope 'compile'
	given by a dependency. If this is not intended, modify or remove the local scope.

[INFO] [daisy:cocoon {execution: default}]
[INFO] Deleting /home/maven/continuum-data/working-directory/46/site/../core/cocoon-core/src/site/site.xml
[INFO] Processing DaisyDocumentProxy[id=1258 branchId=1 languageId=1]
[INFO] Processing DaisyDocumentProxy[id=1270 branchId=1 languageId=1]
[INFO] Processing DaisyDocumentProxy[id=853 branchId=1 languageId=1]
[INFO] Processing DaisyDocumentProxy[id=1259 branchId=1 languageId=1]
[INFO] Processing DaisyDocumentProxy[id=1261 branchId=1 languageId=1]
[INFO] Processing DaisyDocumentProxy[id=1268 branchId=1 languageId=1]
[INFO] Processing DaisyDocumentProxy[id=1262 branchId=1 languageId=1]
[INFO] Processing DaisyDocumentProxy[id=1257 branchId=1 languageId=1]
[INFO] Processing DaisyDocumentProxy[id=1264 branchId=1 languageId=1]
[INFO] Processing DaisyDocumentProxy[id=1263 branchId=1 languageId=1]
[INFO] Processing DaisyDocumentProxy[id=1265 branchId=1 languageId=1]
[INFO] Processing DaisyDocumentProxy[id=1266 branchId=1 languageId=1]
[INFO] Processing DaisyDocumentProxy[id=1267 branchId=1 languageId=1]
[INFO] Processing DaisyDocumentProxy[id=1269 branchId=1 languageId=1]
[INFO] Processing DaisyDocumentProxy[id=1280 branchId=1 languageId=1]
[INFO] Setting property: file.resource.loader.class => 'org.apache.maven.plugin.resource.loader.ProjectResourceLoader'.
[INFO] Setting property: class.resource.loader.class => 'org.apache.velocity.runtime.resource.loader.ClasspathResourceLoader'.
[INFO] Setting property: resource.loader => 'file,class'.
[INFO] ************************************************************** 
[INFO] Starting Jakarta Velocity v1.4
[INFO] RuntimeInstance initializing.
[INFO] Default Properties File: org/apache/velocity/runtime/defaults/velocity.properties
[INFO] Default ResourceManager initializing. (class org.apache.velocity.runtime.resource.ResourceManagerImpl)
[INFO] Resource Loader Instantiated: org.apache.maven.plugin.resource.loader.ProjectResourceLoader
[INFO] ProjectResourceLoader : initialization starting.
[INFO] path :/home/maven/continuum-data/working-directory/46/site/src/main/resources/
[INFO] ProjectResourceLoader : adding path '/home/maven/continuum-data/working-directory/46/site/src/main/resources/'
[INFO] ProjectResourceLoader : initialization complete.
[INFO] Resource Loader Instantiated: org.apache.velocity.runtime.resource.loader.ClasspathResourceLoader
[INFO] ClasspathResourceLoader : initialization starting.
[INFO] ClasspathResourceLoader : initialization complete.
[INFO] ResourceCache : initialized. (class org.apache.velocity.runtime.resource.ResourceCacheImpl)
[INFO] Default ResourceManager initialization complete.
[INFO] Loaded System Directive: org.apache.velocity.runtime.directive.Literal
[INFO] Loaded System Directive: org.apache.velocity.runtime.directive.Macro
[INFO] Loaded System Directive: org.apache.velocity.runtime.directive.Parse
[INFO] Loaded System Directive: org.apache.velocity.runtime.directive.Include
[INFO] Loaded System Directive: org.apache.velocity.runtime.directive.Foreach
[INFO] Created: 20 parsers.
[INFO] Velocimacro : initialization starting.
[INFO] Velocimacro : adding VMs from VM library template : VM_global_library.vm
[ERROR] ResourceManager : unable to find resource 'VM_global_library.vm' in any resource loader.
[INFO] Velocimacro : error using  VM library template VM_global_library.vm : org.apache.velocity.exception.ResourceNotFoundException:
Unable to find resource 'VM_global_library.vm'
[INFO] Velocimacro :  VM library template macro registration complete.
[INFO] Velocimacro : allowInline = true : VMs can be defined inline in templates
[INFO] Velocimacro : allowInlineToOverride = false : VMs defined inline may NOT replace previous
VM definitions
[INFO] Velocimacro : allowInlineLocal = false : VMs defined inline will be  global in scope
if allowed.
[INFO] Velocimacro : messages on  : VM system will output logging messages
[INFO] Velocimacro : autoload off  : VM system will not automatically reload global library
macros
[INFO] Velocimacro : initialization complete.
[INFO] Velocity successfully started.
[INFO] [site:site]
[WARNING] Unable to load parent project from repository: Could not find the model file '/home/maven/continuum-data/working-directory/46/site/../core/cocoon-core/../../../pom.xml'.
[INFO] Generate "Changes Report" report.
[INFO] Generate "Project License" report.
[INFO] [site:deploy]
file:///home/config/cocoon.zone/dev-docs/core-modules/core/2.2/ - Session: Opened  
file:///home/config/cocoon.zone/dev-docs/core-modules/core/2.2/ - Session: Disconnecting 

file:///home/config/cocoon.zone/dev-docs/core-modules/core/2.2/ - Session: Disconnected
[INFO] ----------------------------------------------------------------------------
[INFO] Building Ajax Block Implementation
[INFO]    task-segment: [site-deploy]
[INFO] ----------------------------------------------------------------------------
[INFO] [daisy:cocoon {execution: default}]
[INFO] Deleting /home/maven/continuum-data/working-directory/46/site/../blocks/cocoon-ajax/cocoon-ajax-impl/src/site/site.xml
[INFO] Processing DaisyDocumentProxy[id=1220 branchId=1 languageId=1]
[INFO] Processing DaisyDocumentProxy[id=1242 branchId=1 languageId=1]
[INFO] [site:site]
[WARNING] Unable to load parent project from repository: Could not find the model file '/home/maven/continuum-data/working-directory/46/site/../blocks/cocoon-ajax/cocoon-ajax-impl/../../../../pom.xml'.
[INFO] Generate "Project License" report.
[INFO] [site:deploy]
file:///home/config/cocoon.zone/dev-docs/blocks/ajax/1.0/ - Session: Opened  
file:///home/config/cocoon.zone/dev-docs/blocks/ajax/1.0/ - Session: Disconnecting  
file:///home/config/cocoon.zone/dev-docs/blocks/ajax/1.0/ - Session: Disconnected
[INFO] ----------------------------------------------------------------------------
[INFO] Building Cocoon Authentication Implementation
[INFO]    task-segment: [site-deploy]
[INFO] ----------------------------------------------------------------------------
[INFO] [daisy:cocoon {execution: default}]
[INFO] Deleting /home/maven/continuum-data/working-directory/46/site/../blocks/cocoon-auth/cocoon-auth-impl/src/site/site.xml
[INFO] Processing DaisyDocumentProxy[id=1236 branchId=1 languageId=1]
[INFO] Processing DaisyDocumentProxy[id=1237 branchId=1 languageId=1]
[INFO] [site:site]
[WARNING] Unable to load parent project from repository: Could not find the model file '/home/maven/continuum-data/working-directory/46/site/../blocks/cocoon-auth/cocoon-auth-impl/../../../../pom.xml'.
[INFO] Generate "Project License" report.
[INFO] [site:deploy]
file:///home/config/cocoon.zone/dev-docs/blocks/auth/1.0/ - Session: Opened  
file:///home/config/cocoon.zone/dev-docs/blocks/auth/1.0/ - Session: Disconnecting  
file:///home/config/cocoon.zone/dev-docs/blocks/auth/1.0/ - Session: Disconnected
[INFO] ----------------------------------------------------------------------------
[INFO] Building Captcha Block Implementation
[INFO]    task-segment: [site-deploy]
[INFO] ----------------------------------------------------------------------------
[INFO] [daisy:cocoon {execution: default}]
[INFO] Deleting /home/maven/continuum-data/working-directory/46/site/../blocks/cocoon-captcha/cocoon-captcha-impl/src/site/site.xml
[INFO] Processing DaisyDocumentProxy[id=1238 branchId=1 languageId=1]
[INFO] Processing DaisyDocumentProxy[id=1239 branchId=1 languageId=1]
[INFO] [site:site]
[WARNING] Unable to load parent project from repository: Could not find the model file '/home/maven/continuum-data/working-directory/46/site/../blocks/cocoon-captcha/cocoon-captcha-impl/../../../../pom.xml'.
[INFO] Generate "Project License" report.
[INFO] [site:deploy]
file:///home/config/cocoon.zone/dev-docs/blocks/captcha/1.0/ - Session: Opened  
file:///home/config/cocoon.zone/dev-docs/blocks/captcha/1.0/ - Session: Disconnecting  
file:///home/config/cocoon.zone/dev-docs/blocks/captcha/1.0/ - Session: Disconnected
[INFO] ----------------------------------------------------------------------------
[INFO] Building Flowscript Block
[INFO]    task-segment: [site-deploy]
[INFO] ----------------------------------------------------------------------------
[INFO] [daisy:cocoon {execution: default}]
[INFO] Deleting /home/maven/continuum-data/working-directory/46/site/../blocks/cocoon-flowscript/cocoon-flowscript-impl/src/site/site.xml
[INFO] Processing DaisyDocumentProxy[id=1240 branchId=1 languageId=1]
[INFO] Processing DaisyDocumentProxy[id=1241 branchId=1 languageId=1]
[INFO] Processing DaisyDocumentProxy[id=518 branchId=1 languageId=1]
[INFO] Skipping 518 (not in the collection 'cdocs-flowscript')
[INFO] [site:site]
[WARNING] Unable to load parent project from repository: Could not find the model file '/home/maven/continuum-data/working-directory/46/site/../blocks/cocoon-flowscript/cocoon-flowscript-impl/../../../../pom.xml'.
[INFO] Generate "Project License" report.
[INFO] [site:deploy]
file:///home/config/cocoon.zone/dev-docs/blocks/flowscript/1.0/ - Session: Opened  
file:///home/config/cocoon.zone/dev-docs/blocks/flowscript/1.0/ - Session: Disconnecting 

file:///home/config/cocoon.zone/dev-docs/blocks/flowscript/1.0/ - Session: Disconnected
[INFO] ----------------------------------------------------------------------------
[INFO] Building FOP Block Implementation
[INFO]    task-segment: [site-deploy]
[INFO] ----------------------------------------------------------------------------
[INFO] [daisy:cocoon {execution: default}]
[INFO] Deleting /home/maven/continuum-data/working-directory/46/site/../blocks/cocoon-fop/cocoon-fop-impl/src/site/site.xml
[INFO] Processing DaisyDocumentProxy[id=1217 branchId=1 languageId=1]
[INFO] Processing DaisyDocumentProxy[id=1225 branchId=1 languageId=1]
[INFO] Processing DaisyDocumentProxy[id=1222 branchId=1 languageId=1]
[INFO] Processing DaisyDocumentProxy[id=1226 branchId=1 languageId=1]
[INFO] Processing DaisyDocumentProxy[id=1219 branchId=1 languageId=1]
[INFO] Processing DaisyDocumentProxy[id=1144 branchId=1 languageId=1]
[INFO] Skipping 1144 (not in the collection 'cdocs-fop')
[INFO] Processing DaisyDocumentProxy[id=551 branchId=1 languageId=1]
[INFO] Skipping 551 (not in the collection 'cdocs-fop')
[INFO] Processing DaisyDocumentProxy[id=554 branchId=1 languageId=1]
[INFO] Skipping 554 (not in the collection 'cdocs-fop')
[INFO] Processing DaisyDocumentProxy[id=1224 branchId=1 languageId=1]
[WARNING] Document id=1224 not streamed because there is no available serialization strategy.
documentTypeId=4
[WARNING] Can't resolve link to DaisyLink[id=1144 branchId=1 languageId=1 parent=DaisyDocumentProxy[id=1217
branchId=1 languageId=1]]
[WARNING] Can't resolve link to DaisyLink[id=551 branchId=1 languageId=1 parent=DaisyDocumentProxy[id=1217
branchId=1 languageId=1]]
[WARNING] Can't resolve link to DaisyLink[id=554 branchId=1 languageId=1 parent=DaisyDocumentProxy[id=1217
branchId=1 languageId=1]]
[INFO] [site:site]
[WARNING] Unable to load parent project from repository: Could not find the model file '/home/maven/continuum-data/working-directory/46/site/../blocks/cocoon-fop/cocoon-fop-impl/../../../../pom.xml'.
[INFO] Generate "Project License" report.
[INFO] [site:deploy]
file:///home/config/cocoon.zone/dev-docs/blocks/fop/1.0/ - Session: Opened  
file:///home/config/cocoon.zone/dev-docs/blocks/fop/1.0/ - Session: Disconnecting  
file:///home/config/cocoon.zone/dev-docs/blocks/fop/1.0/ - Session: Disconnected
[INFO] ----------------------------------------------------------------------------
[INFO] Building Forms Block Implementation
[INFO]    task-segment: [site-deploy]
[INFO] ----------------------------------------------------------------------------
[INFO] [daisy:cocoon {execution: default}]
[INFO] Deleting /home/maven/continuum-data/working-directory/46/site/../blocks/cocoon-forms/cocoon-forms-impl/src/site/site.xml
[INFO] Processing DaisyDocumentProxy[id=489 branchId=1 languageId=1]
[INFO] Processing DaisyDocumentProxy[id=478 branchId=1 languageId=1]
[INFO] Processing DaisyDocumentProxy[id=389 branchId=1 languageId=1]
[INFO] ------------------------------------------------------------------------
[ERROR] FATAL ERROR
[INFO] ------------------------------------------------------------------------
[INFO] This method can only be called AFTER all queued objects have been processed.
[INFO] ------------------------------------------------------------------------
[INFO] Trace
java.lang.IllegalStateException: This method can only be called AFTER all queued objects have
been processed.
	at org.daisycms.clientapp.maven.AbstractDaisyMojo$WorkQueue.getProcessedDaisyLinks(AbstractDaisyMojo.java:657)
	at org.daisycms.clientapp.maven.AbstractDaisyMojo.processDocuments(AbstractDaisyMojo.java:302)
	at org.daisycms.clientapp.maven.AbstractDaisyMojo.execute(AbstractDaisyMojo.java:229)
	at org.apache.maven.plugin.DefaultPluginManager.executeMojo(DefaultPluginManager.java:417)
	at org.apache.maven.lifecycle.DefaultLifecycleExecutor.executeGoals(DefaultLifecycleExecutor.java:534)
	at org.apache.maven.lifecycle.DefaultLifecycleExecutor.executeGoalWithLifecycle(DefaultLifecycleExecutor.java:475)
	at org.apache.maven.lifecycle.DefaultLifecycleExecutor.executeGoal(DefaultLifecycleExecutor.java:454)
	at org.apache.maven.lifecycle.DefaultLifecycleExecutor.executeGoalAndHandleFailures(DefaultLifecycleExecutor.java:306)
	at org.apache.maven.lifecycle.DefaultLifecycleExecutor.executeTaskSegments(DefaultLifecycleExecutor.java:273)
	at org.apache.maven.lifecycle.DefaultLifecycleExecutor.execute(DefaultLifecycleExecutor.java:140)
	at org.apache.maven.DefaultMaven.doExecute(DefaultMaven.java:327)
	at org.apache.maven.DefaultMaven.execute(DefaultMaven.java:120)
	at org.apache.maven.cli.MavenCli.main(MavenCli.java:263)
	at sun.reflect.NativeMethodAccessorImpl.invoke0(Native Method)
	at sun.reflect.NativeMethodAccessorImpl.invoke(NativeMethodAccessorImpl.java:39)
	at sun.reflect.DelegatingMethodAccessorImpl.invoke(DelegatingMethodAccessorImpl.java:25)
	at java.lang.reflect.Method.invoke(Method.java:324)
	at org.codehaus.classworlds.Launcher.launchEnhanced(Launcher.java:315)
	at org.codehaus.classworlds.Launcher.launch(Launcher.java:255)
	at org.codehaus.classworlds.Launcher.mainWithExitCode(Launcher.java:430)
	at org.codehaus.classworlds.Launcher.main(Launcher.java:375)
[INFO] ------------------------------------------------------------------------
[INFO] Total time: 1 minute 26 seconds
[INFO] Finished at: Fri Dec 15 17:05:56 GMT 2006
[INFO] Final Memory: 25M/52M
[INFO] ------------------------------------------------------------------------

****************************************************************************



Mime
View raw message