cocoon-docs mailing list archives

Site index · List index
Message view « Date » · « Thread »
Top « Date » · « Thread »
From "Continuum@cocoon.zones.apache.org" <d...@cocoon.apache.org>
Subject [continuum] BUILD FAILURE: $cdocs
Date Tue, 19 Dec 2006 01:10:00 GMT
Online report : http://cocoon.zones.apache.org:12000/continuum/servlet/continuum/target/ProjectBuild.vm/view/ProjectBuild/id/46/buildId/1133
Build statistics:
  State: Failed
  Previous State: Failed
  Started at: Tue, 19 Dec 2006 01:08:16 +0000
  Finished at: Tue, 19 Dec 2006 01:10:00 +0000
  Total time: 1m 43s
  Build Trigger: Forced
  Exit code: 1
  Building machine hostname: cocoon.zones.apache.org
  Operating system : SunOS(unknown)
  Java version : 1.4.2_06(Sun Microsystems Inc.)

Changes
         joerg          removed the hack from assertEqual(String, Document, Document) adding
namespace declarations as attributes as this seems to break the tests now (for whatever reason),
extracted common base class AbstractSelectionListTestCase
             /cocoon/trunk/blocks/cocoon-forms/cocoon-forms-impl/src/test/java/org/apache/cocoon/forms/datatype/AbstractSelectionListTestCase.java
            /cocoon/trunk/blocks/cocoon-forms/cocoon-forms-impl/src/test/java/org/apache/cocoon/forms/datatype/DynamicSelectionListTestCase.java
            /cocoon/trunk/blocks/cocoon-forms/cocoon-forms-impl/src/test/java/org/apache/cocoon/forms/datatype/EnumSelectionListTestCase.java
            /cocoon/trunk/blocks/cocoon-forms/cocoon-forms-impl/src/test/java/org/apache/cocoon/forms/datatype/FlowJXPathSelectionListTestCase.java
        
****************************************************************************
Output:
****************************************************************************
[INFO] Scanning for projects...
[INFO] ----------------------------------------------------------------------------
[INFO] Building Apache Cocoon
[INFO]    task-segment: [install]
[INFO] ----------------------------------------------------------------------------
[INFO] [site:attach-descriptor]
[INFO] [install:install]
[INFO] Installing /home/maven/continuum-data/working-directory/46/pom.xml to /home/maven/.m2/repository/org/apache/cocoon/cocoon/3-SNAPSHOT/cocoon-3-SNAPSHOT.pom
[INFO] ------------------------------------------------------------------------
[INFO] BUILD SUCCESSFUL
[INFO] ------------------------------------------------------------------------
[INFO] Total time: 18 seconds
[INFO] Finished at: Tue Dec 19 01:08:43 GMT 2006
[INFO] Final Memory: 6M/11M
[INFO] ------------------------------------------------------------------------
[INFO] Scanning for projects...
[INFO] Reactor build order: 
[INFO]   Cocoon Site [modules]
[INFO]   Apache Cocoon Blocks Site
[INFO]   Apache Cocoon Core Modules Site
[INFO]   Apache Cocoon Main Site
[INFO]   Apache Cocoon Maven Plugins Site
[INFO]   Cocoon Core
[INFO]   Ajax Block Implementation
[INFO]   Cocoon Authentication Implementation
[INFO]   Captcha Block Implementation
[INFO]   Flowscript Block
[INFO]   FOP Block Implementation
[INFO]   Forms Block Implementation
[INFO]   Lucene Block Implementation
[INFO]   Mail Block Implementation
[INFO]   Portal Block Implementation
[INFO]   Serializers Block Implementation
[INFO]   Template framework implementation
[INFO] ----------------------------------------------------------------------------
[INFO] Building Cocoon Site [modules]
[INFO]    task-segment: [site-deploy]
[INFO] ----------------------------------------------------------------------------
[INFO] Setting property: classpath.resource.loader.class => 'org.codehaus.plexus.velocity.ContextClassLoaderResourceLoader'.
[INFO] Setting property: velocimacro.messages.on => 'false'.
[INFO] Setting property: resource.loader => 'classpath'.
[INFO] Setting property: resource.manager.logwhenfound => 'false'.
[INFO] Setting property: classpath.resource.loader.class => 'org.codehaus.plexus.velocity.ContextClassLoaderResourceLoader'.
[INFO] Setting property: velocimacro.messages.on => 'false'.
[INFO] Setting property: resource.loader => 'classpath'.
[INFO] Setting property: resource.manager.logwhenfound => 'false'.
[INFO] [site:site]
[WARNING] Unable to load parent project from repository: Could not find the model file '/home/maven/continuum-data/working-directory/46/site/../../pom.xml'.
[INFO] artifact org.apache.maven.skins:maven-default-skin: checking for updates from apache.snapshot
[INFO] artifact org.apache.maven.skins:maven-default-skin: checking for updates from apache-cvs
[INFO] snapshot org.apache.maven.skins:maven-default-skin:1.1-SNAPSHOT: checking for updates
from apache.snapshot
[INFO] snapshot org.apache.maven.skins:maven-default-skin:1.1-SNAPSHOT: checking for updates
from apache-cvs
[INFO] snapshot org.apache.maven.skins:maven-default-skin:1.1-SNAPSHOT: checking for updates
from apache.snapshots
[INFO] Generate "Project License" report.
[ERROR] VM #displayTree: error : too few arguments to macro. Wanted 2 got 0
[ERROR] VM #menuItem: error : too few arguments to macro. Wanted 1 got 0
[INFO] [site:deploy]
file:///home/config/cocoon.zone/dev-docs/site - Session: Opened  
file:///home/config/cocoon.zone/dev-docs/site - Session: Disconnecting  
file:///home/config/cocoon.zone/dev-docs/site - Session: Disconnected
[INFO] ----------------------------------------------------------------------------
[INFO] Building Apache Cocoon Blocks Site
[INFO]    task-segment: [site-deploy]
[INFO] ----------------------------------------------------------------------------
[INFO] snapshot org.daisycms:daisy-client-facade:1.0.0-SNAPSHOT: checking for updates from
reinhard-m2-snapshot-repository
[INFO] snapshot org.daisycms:daisy-client-facade:1.0.0-SNAPSHOT: checking for updates from
central
[INFO] snapshot org.daisycms:daisy-client-facade:1.0.0-SNAPSHOT: checking for updates from
cocoon-dev
[INFO] snapshot org.daisycms:daisy-client-facade:1.0.0-SNAPSHOT: checking for updates from
apache.snapshot
Downloading: http://ibiblio.org/maven2/daisy/daisy-repository-spi/1.5-M1/daisy-repository-spi-1.5-M1.pom
[WARNING] Unable to get resource from repository central (http://ibiblio.org/maven2)
Downloading: http://cocoondev.org/repository//daisy/poms/daisy-repository-spi-1.5-M1.pom
[WARNING] Unable to get resource from repository cocoon-dev (http://cocoondev.org/repository/)
Downloading: http://svn.apache.org/maven-snapshot-repository/daisy/daisy-repository-spi/1.5-M1/daisy-repository-spi-1.5-M1.pom
[WARNING] Unable to get resource from repository apache.snapshot (http://svn.apache.org/maven-snapshot-repository)
Downloading: http://ibiblio.org/maven2/daisy/daisy-repository-api/1.5-M1/daisy-repository-api-1.5-M1.pom
[WARNING] Unable to get resource from repository central (http://ibiblio.org/maven2)
Downloading: http://cocoondev.org/repository//daisy/poms/daisy-repository-api-1.5-M1.pom
[WARNING] Unable to get resource from repository cocoon-dev (http://cocoondev.org/repository/)
Downloading: http://svn.apache.org/maven-snapshot-repository/daisy/daisy-repository-api/1.5-M1/daisy-repository-api-1.5-M1.pom
[WARNING] Unable to get resource from repository apache.snapshot (http://svn.apache.org/maven-snapshot-repository)
Downloading: http://ibiblio.org/maven2/daisy/daisy-repository-client-impl/1.5-M1/daisy-repository-client-impl-1.5-M1.pom
[WARNING] Unable to get resource from repository central (http://ibiblio.org/maven2)
Downloading: http://cocoondev.org/repository//daisy/poms/daisy-repository-client-impl-1.5-M1.pom
[WARNING] Unable to get resource from repository cocoon-dev (http://cocoondev.org/repository/)
Downloading: http://svn.apache.org/maven-snapshot-repository/daisy/daisy-repository-client-impl/1.5-M1/daisy-repository-client-impl-1.5-M1.pom
[WARNING] Unable to get resource from repository apache.snapshot (http://svn.apache.org/maven-snapshot-repository)
Downloading: http://ibiblio.org/maven2/daisy/daisy-util/1.5-M1/daisy-util-1.5-M1.pom
[WARNING] Unable to get resource from repository central (http://ibiblio.org/maven2)
Downloading: http://cocoondev.org/repository//daisy/poms/daisy-util-1.5-M1.pom
[WARNING] Unable to get resource from repository cocoon-dev (http://cocoondev.org/repository/)
Downloading: http://svn.apache.org/maven-snapshot-repository/daisy/daisy-util/1.5-M1/daisy-util-1.5-M1.pom
[WARNING] Unable to get resource from repository apache.snapshot (http://svn.apache.org/maven-snapshot-repository)
Downloading: http://ibiblio.org/maven2/daisy/daisy-repository-common-impl/1.5-M1/daisy-repository-common-impl-1.5-M1.pom
[WARNING] Unable to get resource from repository central (http://ibiblio.org/maven2)
Downloading: http://cocoondev.org/repository//daisy/poms/daisy-repository-common-impl-1.5-M1.pom
[WARNING] Unable to get resource from repository cocoon-dev (http://cocoondev.org/repository/)
Downloading: http://svn.apache.org/maven-snapshot-repository/daisy/daisy-repository-common-impl/1.5-M1/daisy-repository-common-impl-1.5-M1.pom
[WARNING] Unable to get resource from repository apache.snapshot (http://svn.apache.org/maven-snapshot-repository)
Downloading: http://ibiblio.org/maven2/daisy/daisy-repository-xmlschema-bindings/1.5-M1/daisy-repository-xmlschema-bindings-1.5-M1.pom
[WARNING] Unable to get resource from repository central (http://ibiblio.org/maven2)
Downloading: http://cocoondev.org/repository//daisy/poms/daisy-repository-xmlschema-bindings-1.5-M1.pom
[WARNING] Unable to get resource from repository cocoon-dev (http://cocoondev.org/repository/)
Downloading: http://svn.apache.org/maven-snapshot-repository/daisy/daisy-repository-xmlschema-bindings/1.5-M1/daisy-repository-xmlschema-bindings-1.5-M1.pom
[WARNING] Unable to get resource from repository apache.snapshot (http://svn.apache.org/maven-snapshot-repository)
Downloading: http://ibiblio.org/maven2/daisy/daisy-jmsclient-api/1.5-M1/daisy-jmsclient-api-1.5-M1.pom
[WARNING] Unable to get resource from repository central (http://ibiblio.org/maven2)
Downloading: http://cocoondev.org/repository//daisy/poms/daisy-jmsclient-api-1.5-M1.pom
[WARNING] Unable to get resource from repository cocoon-dev (http://cocoondev.org/repository/)
Downloading: http://svn.apache.org/maven-snapshot-repository/daisy/daisy-jmsclient-api/1.5-M1/daisy-jmsclient-api-1.5-M1.pom
[WARNING] Unable to get resource from repository apache.snapshot (http://svn.apache.org/maven-snapshot-repository)
Downloading: http://ibiblio.org/maven2/daisy/daisy-publisher-xmlschema-bindings/1.5-M1/daisy-publisher-xmlschema-bindings-1.5-M1.pom
[WARNING] Unable to get resource from repository central (http://ibiblio.org/maven2)
Downloading: http://cocoondev.org/repository//daisy/poms/daisy-publisher-xmlschema-bindings-1.5-M1.pom
[WARNING] Unable to get resource from repository cocoon-dev (http://cocoondev.org/repository/)
Downloading: http://svn.apache.org/maven-snapshot-repository/daisy/daisy-publisher-xmlschema-bindings/1.5-M1/daisy-publisher-xmlschema-bindings-1.5-M1.pom
[WARNING] Unable to get resource from repository apache.snapshot (http://svn.apache.org/maven-snapshot-repository)
Downloading: http://ibiblio.org/maven2/daisy/daisy-textextraction-api/1.5-M1/daisy-textextraction-api-1.5-M1.pom
[WARNING] Unable to get resource from repository central (http://ibiblio.org/maven2)
Downloading: http://cocoondev.org/repository//daisy/poms/daisy-textextraction-api-1.5-M1.pom
[WARNING] Unable to get resource from repository cocoon-dev (http://cocoondev.org/repository/)
Downloading: http://svn.apache.org/maven-snapshot-repository/daisy/daisy-textextraction-api/1.5-M1/daisy-textextraction-api-1.5-M1.pom
[WARNING] Unable to get resource from repository apache.snapshot (http://svn.apache.org/maven-snapshot-repository)
Downloading: http://ibiblio.org/maven2/daisy/daisy-linkextractors/1.5-M1/daisy-linkextractors-1.5-M1.pom
[WARNING] Unable to get resource from repository central (http://ibiblio.org/maven2)
Downloading: http://cocoondev.org/repository//daisy/poms/daisy-linkextractors-1.5-M1.pom
[WARNING] Unable to get resource from repository cocoon-dev (http://cocoondev.org/repository/)
Downloading: http://svn.apache.org/maven-snapshot-repository/daisy/daisy-linkextractors/1.5-M1/daisy-linkextractors-1.5-M1.pom
[WARNING] Unable to get resource from repository apache.snapshot (http://svn.apache.org/maven-snapshot-repository)
[INFO] [daisy:cocoon {execution: default}]
[INFO] Deleting /home/maven/continuum-data/working-directory/46/site/cocoon-blocks-site/src/site/site.xml
log4j:WARN No appenders could be found for logger (org.apache.commons.httpclient.HttpClient).
log4j:WARN Please initialize the log4j system properly.
[INFO] Processing DaisyDocumentProxy[id=1204 branchId=1 languageId=1]
[INFO] Processing DaisyDocumentProxy[id=1220 branchId=1 languageId=1]
[INFO] Processing DaisyDocumentProxy[id=1240 branchId=1 languageId=1]
[INFO] Processing DaisyDocumentProxy[id=1238 branchId=1 languageId=1]
[INFO] Processing DaisyDocumentProxy[id=1217 branchId=1 languageId=1]
[INFO] Processing DaisyDocumentProxy[id=1236 branchId=1 languageId=1]
[INFO] Processing DaisyDocumentProxy[id=1246 branchId=1 languageId=1]
[INFO] Processing DaisyDocumentProxy[id=1250 branchId=1 languageId=1]
[INFO] Processing DaisyDocumentProxy[id=1243 branchId=1 languageId=1]
[INFO] Processing DaisyDocumentProxy[id=1248 branchId=1 languageId=1]
[INFO] Processing DaisyDocumentProxy[id=489 branchId=1 languageId=1]
[INFO] Skipping 1217 (not in the collection 'cdocs-site-blocks')
[INFO] Processing DaisyDocumentProxy[id=1215 branchId=1 languageId=1]
[INFO] Skipping 1240 (not in the collection 'cdocs-site-blocks')
[INFO] Skipping 489 (not in the collection 'cdocs-site-blocks')
[INFO] Processing DaisyDocumentProxy[id=1252 branchId=1 languageId=1]
[INFO] Skipping 1250 (not in the collection 'cdocs-site-blocks')
[INFO] Skipping 1243 (not in the collection 'cdocs-site-blocks')
[INFO] Skipping 1248 (not in the collection 'cdocs-site-blocks')
[INFO] Skipping 1220 (not in the collection 'cdocs-site-blocks')
[INFO] Skipping 1246 (not in the collection 'cdocs-site-blocks')
[INFO] Skipping 1236 (not in the collection 'cdocs-site-blocks')
[INFO] Skipping 1252 (not in the collection 'cdocs-site-blocks')
[INFO] Skipping 1238 (not in the collection 'cdocs-site-blocks')
[INFO] Skipping 1215 (not in the collection 'cdocs-site-blocks')
[INFO] [site:site]
[WARNING] Unable to load parent project from repository: Could not find the model file '/home/maven/continuum-data/working-directory/46/site/../../pom.xml'.
[INFO] snapshot org.apache.cocoon:cocoon-maven-site-skin:1.0.0-SNAPSHOT: checking for updates
from apache.snapshot
[INFO] snapshot org.apache.cocoon:cocoon-maven-site-skin:1.0.0-SNAPSHOT: checking for updates
from apache-cvs
[INFO] snapshot org.apache.cocoon:cocoon-maven-site-skin:1.0.0-SNAPSHOT: checking for updates
from apache.snapshots
[INFO] Generate "Project License" report.
[INFO] [site:deploy]
file:///home/config/cocoon.zone/dev-docs/blocks/ - Session: Opened  
file:///home/config/cocoon.zone/dev-docs/blocks/ - Session: Disconnecting  
file:///home/config/cocoon.zone/dev-docs/blocks/ - Session: Disconnected
[INFO] ----------------------------------------------------------------------------
[INFO] Building Apache Cocoon Core Modules Site
[INFO]    task-segment: [site-deploy]
[INFO] ----------------------------------------------------------------------------
[INFO] [daisy:cocoon {execution: default}]
[INFO] Deleting /home/maven/continuum-data/working-directory/46/site/cocoon-core-site/src/site/site.xml
[INFO] Processing DaisyDocumentProxy[id=1210 branchId=1 languageId=1]
[INFO] Processing DaisyDocumentProxy[id=1270 branchId=1 languageId=1]
[INFO] Skipping 1270 (not in the collection 'cdocs-site-core-modules')
[INFO] [site:site]
[WARNING] Unable to load parent project from repository: Could not find the model file '/home/maven/continuum-data/working-directory/46/site/../../pom.xml'.
[INFO] Generate "Project License" report.
[INFO] [site:deploy]
file:///home/config/cocoon.zone/dev-docs/core-modules/ - Session: Opened  
file:///home/config/cocoon.zone/dev-docs/core-modules/ - Session: Disconnecting  
file:///home/config/cocoon.zone/dev-docs/core-modules/ - Session: Disconnected
[INFO] ----------------------------------------------------------------------------
[INFO] Building Apache Cocoon Main Site
[INFO]    task-segment: [site-deploy]
[INFO] ----------------------------------------------------------------------------
[INFO] [daisy:cocoon {execution: default}]
[INFO] Deleting /home/maven/continuum-data/working-directory/46/site/cocoon-main-site/src/site/site.xml
[INFO] Processing DaisyDocumentProxy[id=1213 branchId=1 languageId=1]
[INFO] Processing DaisyDocumentProxy[id=1284 branchId=1 languageId=1]
[INFO] Processing DaisyDocumentProxy[id=1286 branchId=1 languageId=1]
[INFO] Processing DaisyDocumentProxy[id=1178 branchId=1 languageId=1]
[INFO] [INFO] Processing DaisyDocumentProxy[id=1159 branchId=1 languageId=1]
Processing DaisyDocumentProxy[id=1290 branchId=1 languageId=1]
[INFO] Processing DaisyDocumentProxy[id=1272 branchId=1 languageId=1]
[INFO] Processing DaisyDocumentProxy[id=1291 branchId=1 languageId=1]
[INFO] Processing DaisyDocumentProxy[id=1271 branchId=1 languageId=1]
[INFO] Processing DaisyDocumentProxy[id=1287 branchId=1 languageId=1]
[INFO] Processing DaisyDocumentProxy[id=1288 branchId=1 languageId=1]
[INFO] Processing DaisyDocumentProxy[id=1289 branchId=1 languageId=1]
[INFO] Processing DaisyDocumentProxy[id=1273 branchId=1 languageId=1]
[INFO] Processing DaisyDocumentProxy[id=1274 branchId=1 languageId=1]
[INFO] Processing DaisyDocumentProxy[id=1275 branchId=1 languageId=1]
[INFO] Processing DaisyDocumentProxy[id=1276 branchId=1 languageId=1]
[INFO] Processing DaisyDocumentProxy[id=1199 branchId=1 languageId=1]
[INFO] Processing DaisyDocumentProxy[id=1285 branchId=1 languageId=1]
[WARNING] Document id=1285 not streamed because there is no available serialization strategy.
documentTypeId=14
[INFO] Processing DaisyDocumentProxy[id=1279 branchId=1 languageId=1]
[INFO] Processing DaisyDocumentProxy[id=1281 branchId=1 languageId=1]
[INFO] Processing DaisyDocumentProxy[id=1278 branchId=1 languageId=1]
[INFO] Processing DaisyDocumentProxy[id=1277 branchId=1 languageId=1]
[INFO] Skipping 1281 (not in the collection 'cdocs-site-main')
[INFO] Processing DaisyDocumentProxy[id=1280 branchId=1 languageId=1]
[INFO] Skipping 1280 (not in the collection 'cdocs-site-main')
[WARNING] Can't resolve link to DaisyLink[id=1285 branchId=1 languageId=1 parent=DaisyDocumentProxy[id=1213
branchId=1 languageId=1]]
[INFO] [site:site]
[WARNING] Unable to load parent project from repository: Could not find the model file '/home/maven/continuum-data/working-directory/46/site/../../pom.xml'.
[INFO] Generate "Continuous Integration" report.
[INFO] Generate "Issue Tracking" report.
[INFO] Generate "Project License" report.
[INFO] Generate "Mailing Lists" report.
[INFO] Generate "Project Team" report.
[INFO] [site:deploy]
file:///home/config/cocoon.zone/dev-docs - Session: Opened  
file:///home/config/cocoon.zone/dev-docs - Session: Disconnecting  
file:///home/config/cocoon.zone/dev-docs - Session: Disconnected
[INFO] ----------------------------------------------------------------------------
[INFO] Building Apache Cocoon Maven Plugins Site
[INFO]    task-segment: [site-deploy]
[INFO] ----------------------------------------------------------------------------
[INFO] [daisy:cocoon {execution: default}]
[INFO] Deleting /home/maven/continuum-data/working-directory/46/site/cocoon-maven-plugins-site/src/site/site.xml
[INFO] Processing DaisyDocumentProxy[id=1208 branchId=1 languageId=1]
[INFO] [site:site]
[WARNING] Unable to load parent project from repository: Could not find the model file '/home/maven/continuum-data/working-directory/46/site/../../pom.xml'.
[INFO] Generate "Project License" report.
[INFO] [site:deploy]
file:///home/config/cocoon.zone/dev-docs/maven-plugins/ - Session: Opened  
file:///home/config/cocoon.zone/dev-docs/maven-plugins/ - Session: Disconnecting  
file:///home/config/cocoon.zone/dev-docs/maven-plugins/ - Session: Disconnected
[INFO] ----------------------------------------------------------------------------
[INFO] Building Cocoon Core
[INFO]    task-segment: [site-deploy]
[INFO] ----------------------------------------------------------------------------
Downloading: http://repo1.maven.org/maven2/org/springframework/spring-beans/2.4.1/spring-beans-2.4.1.pom
[WARNING] Unable to get resource from repository central (http://repo1.maven.org/maven2)
Downloading: http://people.apache.org/repo/m2-snapshot-repository/org/springframework/spring-beans/2.4.1/spring-beans-2.4.1.pom
[WARNING] Unable to get resource from repository apache.snapshot (http://people.apache.org/repo/m2-snapshot-repository)
Downloading: http://people.apache.org/repo/m1-snapshot-repository/org.springframework/poms/spring-beans-2.4.1.pom
[WARNING] Unable to get resource from repository apache-cvs (http://people.apache.org/repo/m1-snapshot-repository)
Downloading: http://repo1.maven.org/maven2/org/springframework/spring-core/2.4.1/spring-core-2.4.1.pom
[WARNING] Unable to get resource from repository central (http://repo1.maven.org/maven2)
Downloading: http://people.apache.org/repo/m2-snapshot-repository/org/springframework/spring-core/2.4.1/spring-core-2.4.1.pom
[WARNING] Unable to get resource from repository apache.snapshot (http://people.apache.org/repo/m2-snapshot-repository)
Downloading: http://people.apache.org/repo/m1-snapshot-repository/org.springframework/poms/spring-core-2.4.1.pom
[WARNING] Unable to get resource from repository apache-cvs (http://people.apache.org/repo/m1-snapshot-repository)
Downloading: http://repo1.maven.org/maven2/org/springframework/spring-context/2.4.1/spring-context-2.4.1.pom
[WARNING] Unable to get resource from repository central (http://repo1.maven.org/maven2)
Downloading: http://people.apache.org/repo/m2-snapshot-repository/org/springframework/spring-context/2.4.1/spring-context-2.4.1.pom
[WARNING] Unable to get resource from repository apache.snapshot (http://people.apache.org/repo/m2-snapshot-repository)
Downloading: http://people.apache.org/repo/m1-snapshot-repository/org.springframework/poms/spring-context-2.4.1.pom
[WARNING] Unable to get resource from repository apache-cvs (http://people.apache.org/repo/m1-snapshot-repository)
[WARNING] 
	Artifact junit:junit:jar:3.8.2:test retains local scope 'test' overriding broader scope 'compile'
	given by a dependency. If this is not intended, modify or remove the local scope.

[WARNING] 
	Artifact javax.servlet:servlet-api:jar:2.4:provided retains local scope 'provided' overriding
broader scope 'compile'
	given by a dependency. If this is not intended, modify or remove the local scope.

[INFO] snapshot org.apache.cocoon:cocoon-pipeline-api:1.0.0-SNAPSHOT: checking for updates
from apache.snapshot
[INFO] snapshot org.apache.cocoon:cocoon-pipeline-api:1.0.0-SNAPSHOT: checking for updates
from apache-cvs
[INFO] snapshot org.apache.cocoon:cocoon-pipeline-api:1.0.0-SNAPSHOT: checking for updates
from apache.snapshots
Downloading: http://people.apache.org/repo/m2-snapshot-repository/org/apache/cocoon/cocoon-pipeline-api/1.0.0-SNAPSHOT/cocoon-pipeline-api-1.0.0-SNAPSHOT.pom
[WARNING] Unable to get resource from repository apache.snapshot (http://people.apache.org/repo/m2-snapshot-repository)
Downloading: http://people.apache.org/repo/m1-snapshot-repository/org.apache.cocoon/poms/cocoon-pipeline-api-1.0.0-SNAPSHOT.pom
[WARNING] Unable to get resource from repository apache-cvs (http://people.apache.org/repo/m1-snapshot-repository)
Downloading: http://people.apache.org/repo/m2-snapshot-repository/org/apache/cocoon/cocoon-pipeline-api/1.0.0-SNAPSHOT/cocoon-pipeline-api-1.0.0-SNAPSHOT.pom
[WARNING] Unable to get resource from repository apache.snapshots (http://people.apache.org/repo/m2-snapshot-repository)
Downloading: http://people.apache.org/repo/m2-snapshot-repository/org/apache/cocoon/cocoon-pipeline-api/1.0.0-SNAPSHOT/cocoon-pipeline-api-1.0.0-SNAPSHOT.jar
[WARNING] Unable to get resource from repository apache.snapshot (http://people.apache.org/repo/m2-snapshot-repository)
Downloading: http://people.apache.org/repo/m1-snapshot-repository/org.apache.cocoon/jars/cocoon-pipeline-api-1.0.0-SNAPSHOT.jar
[WARNING] Unable to get resource from repository apache-cvs (http://people.apache.org/repo/m1-snapshot-repository)
Downloading: http://people.apache.org/repo/m2-snapshot-repository/org/apache/cocoon/cocoon-pipeline-api/1.0.0-SNAPSHOT/cocoon-pipeline-api-1.0.0-SNAPSHOT.jar
[WARNING] Unable to get resource from repository apache.snapshots (http://people.apache.org/repo/m2-snapshot-repository)
[INFO] ------------------------------------------------------------------------
[ERROR] BUILD ERROR
[INFO] ------------------------------------------------------------------------
[INFO] Failed to resolve artifact.

Missing:
----------
1) org.apache.cocoon:cocoon-pipeline-api:jar:1.0.0-SNAPSHOT

  Try downloading the file manually from the project website.

  Then, install it using the command: 
      mvn install:install-file -DgroupId=org.apache.cocoon -DartifactId=cocoon-pipeline-api
\
          -Dversion=1.0.0-SNAPSHOT -Dpackaging=jar -Dfile=/path/to/file

  Path to dependency: 
  	1) org.apache.cocoon:cocoon-core:jar:2.2.0-M3-SNAPSHOT
  	2) org.apache.cocoon:cocoon-pipeline-api:jar:1.0.0-SNAPSHOT

----------
1 required artifact is missing.

for artifact: 
  org.apache.cocoon:cocoon-core:jar:2.2.0-M3-SNAPSHOT

from the specified remote repositories:
  central (http://repo1.maven.org/maven2),
  apache.snapshots (http://people.apache.org/repo/m2-snapshot-repository),
  apache.snapshot (http://people.apache.org/repo/m2-snapshot-repository),
  apache-cvs (http://people.apache.org/repo/m1-snapshot-repository)


[INFO] ------------------------------------------------------------------------
[INFO] For more information, run Maven with the -e switch
[INFO] ------------------------------------------------------------------------
[INFO] Total time: 1 minute 15 seconds
[INFO] Finished at: Tue Dec 19 01:10:00 GMT 2006
[INFO] Final Memory: 20M/40M
[INFO] ------------------------------------------------------------------------

****************************************************************************



Mime
View raw message