cocoon-dev mailing list archives

Site index · List index
Message view « Date » · « Thread »
Top « Date » · « Thread »
From Continuum VMBuild Server <contin...@apache.org>
Subject [continuum] BUILD FAILURE: Apache Cocoon [build root]
Date Fri, 04 Apr 2008 05:03:38 GMT
Online report : http://vmbuild.apache.org/continuum/buildResult.action?buildId=73068&projectId=51

Build statistics:
  State: Failed
  Previous State: Ok
  Started at: Thu 3 Apr 2008 21:52:10 -0700
  Finished at: Thu 3 Apr 2008 22:01:49 -0700
  Total time: 9m 39s
  Build Trigger: Schedule
  Build Number: 250
  Exit code: 1
  Building machine hostname: vmbuild.apache.org
  Operating system : Linux(unknown)
  Java Home version : 
          java version "1.4.2_15"
          Java(TM) 2 Runtime Environment, Standard Edition (build 1.4.2_15-b02)
          Java HotSpot(TM) Client VM (build 1.4.2_15-b02, mixed mode)
        
  Builder version :
          Maven version: 2.0.7
          Java version: 1.4.2_15
          OS name: "linux" version: "2.6.20-16-server" arch: "i386"
    
****************************************************************************
SCM Changes:
****************************************************************************
Changed: joerg @ Thu 3 Apr 2008 20:05:40 -0700
Comment: extracted HtmlSaxParser from both NekoHTMLGenerator and NekoHTMLTransformer as NekoHtmlSaxParser
Files changed:
  /cocoon/trunk/blocks/cocoon-html/cocoon-html-impl/src/main/java/org/apache/cocoon/components ( 644590 )
  /cocoon/trunk/blocks/cocoon-html/cocoon-html-impl/src/main/java/org/apache/cocoon/components/NekoHtmlSaxParser.java ( 644590 )
  /cocoon/trunk/blocks/cocoon-html/cocoon-html-impl/src/main/java/org/apache/cocoon/generation/NekoHTMLGenerator.java ( 644590 )
  /cocoon/trunk/blocks/cocoon-html/cocoon-html-impl/src/main/java/org/apache/cocoon/transformation/NekoHTMLTransformer.java ( 644590 )

Changed: joerg @ Thu 3 Apr 2008 20:11:52 -0700
Comment: COCOON-2063: Set system's default encoding on NekoHTMLGenerator and NekoHTMLTransformer configuration to make them work with UTF-8.
Files changed:
  /cocoon/trunk/blocks/cocoon-html/cocoon-html-impl/src/changes/changes.xml ( 644595 )
  /cocoon/trunk/blocks/cocoon-html/cocoon-html-impl/src/main/java/org/apache/cocoon/components/NekoHtmlSaxParser.java ( 644595 )

****************************************************************************
Dependencies Changes:
****************************************************************************
No dependencies changed


****************************************************************************
Build Defintion:
****************************************************************************
POM filename: pom.xml
Goals: clean install   
Arguments: --batch-mode -P allblocks,it
Build Fresh: false
Always Build: false
Default Build Definition: true
Schedule: DEFAULT_SCHEDULE
Profile Name: Java 1.4, Large Memory
Description: 


****************************************************************************
Test Summary:
****************************************************************************
Tests: 357
Failures: 0
Total time: 98653

****************************************************************************
Output:
****************************************************************************
[INFO] Scanning for projects...
[INFO] Reactor build order: 
[INFO]   Apache Cocoon
[INFO]   Cocoon Tools [modules]
[INFO]   Cocoon 2.2 Archetype: Block
[INFO]   Cocoon 2.2 Archetype: Block (plain)
[INFO]   Cocoon 2.2 Archetype: Web Application
[INFO]   Cocoon Integration Test Framework [maven-plugin]
[INFO]   Cocoon Maven Reports
[INFO]   Cocoon Maven 2 Plugin
[INFO]   Cocoon Maven Javadocs Script Report
[INFO]   Cocoon Maven Javadocs Script Report
[INFO]   Cocoon Reloading ClassLoader - Webapp Wrapper
[INFO]   Cocoon Reloading ClassLoader - Spring reloader
[INFO]   Cocoon Configuration API
[INFO]   Cocoon Spring Configurator
[INFO]   Cocoon Core [modules]
[INFO]   Cocoon Pipeline API
[INFO]   Cocoon Util
[INFO]   Cocoon XML API
[INFO]   Cocoon Expression Language API
[INFO]   Cocoon Pipeline Implementation
[INFO]   Cocoon XML Implementation
[INFO]   Cocoon Pipeline Components
[INFO]   Cocoon Sitemap API
[INFO]   Cocoon XML Utilities
[INFO]   Cocoon Expression Language Implementation.
[INFO]   Cocoon Thread API
[INFO]   Cocoon Sitemap Implementation
[INFO]   Cocoon Sitemap Components
[INFO]   Cocoon XML Resolver
[INFO]   Cocoon Store Implementation
[INFO]   Cocoon Thread Implementation
[INFO]   Cocoon Core
[INFO]   Cocoon Servlet Service Implementation
[INFO]   Cocoon Blocks [modules]
[INFO]   Cocoon Linkrewriter Block Implementation
[INFO]   Cocoon Servlet Service Components
[INFO]   Cocoon Ajax Block Implementation
[INFO]   Cocoon Template Framework Block Implementation
[INFO]   Cocoon Samples Style Default Block
[INFO]   Cocoon Ajax Block Sample
[INFO]   Cocoon Apples Block Implementation
[INFO]   Session Framework Implementation
[INFO]   XSP Block Implementation
[INFO]   Cocoon Main Core Sample Block
[INFO]   Cocoon Flowscript Block Implementation
[INFO]   Cocoon Forms Block Implementation
[INFO]   Cocoon Apples Block Samples
[INFO]   Cocoon Additional Sample Block
[INFO]   Cocoon Batik Block Implementation
[INFO]   Cocoon Forms Block Samples
[INFO]   Cocoon Integration Tests Block
[INFO]   Cocoon Linkrewriter Block Samples
[INFO]   Cocoon Template Block Samples
[INFO]   Cocoon Batik Block Samples
[INFO]   Cocoon Welcome (Samples)
[INFO]   Asciiart Block Implementation
[INFO]   Asciiart Block Samples
[INFO]   cocoon-acegisecurity
[INFO]   Cocoon Authentication Block API
[INFO]   Cocoon Authentication Block Implementation
[INFO]   Cocoon Authentication Block Sample
[INFO]   Authentication Framework Implementation
[INFO]   Authentication Framework Sample Application
[INFO]   Axis Block Implementation
[INFO]   Axis Block Samples
[INFO]   Bsf Block Implementation
[INFO]   Bsf Block Samples
[INFO]   Cocoon Captcha Block Implementation
[INFO]   Cocoon Captcha Block Sample
[INFO]   Chaperon Block Implementation
[INFO]   Chaperon Block Samples
[INFO]   Cron block implementation
[INFO]   Cron Block Samples
[INFO]   Cocoon Database Block Mocks
[INFO]   Cocoon Database Block Bridge for Avalon components
[INFO]   Cocoon Database Block Implementation
[INFO]   Cocoon Hsqldb Server Block Implementation
[INFO]   Cocoon Hsqldb Client Implementation
[INFO]   Cocoon Databases Block Samples
[INFO]   Cocoon ODBC client Implementation
[INFO]   Cocoon Oracle client Implementation
[INFO]   Cocoon PostgreSQL client Implementation
[INFO]   Deli Block Implementation
[INFO]   Deli Block Samples
[INFO]   JMS Block Implementation
[INFO]   Eventcache Block Implementation
[INFO]   Eventcache Block Samples
[INFO]   Taglib Block Implementation
[INFO]   Portal Block [modules]
[INFO]   Portal Block API
[INFO]   Cocoon Serializers Charsets
[INFO]   Portal Block Implementation
[INFO]   Faces Block Implementation
[INFO]   Faces Block Samples
[INFO]   Cocoon FOP Block Implementation
[INFO]   Cocoon FOP Block Samples
[INFO]   Cocoon FOP 0.9x Block Implementation
[INFO]   Cocoon FOP 0.9x Block Samples
[INFO]   Cocoon HTML Block Implementation
[INFO]   Cocoon Html Block Sample
[INFO]   Image Operation Block Implementation
[INFO]   Image Operation Block Samples
[INFO]   Itext Block Implementation
[INFO]   Itext Block Samples
[INFO]   Javaflow Block
[INFO]   Javaflow Block Samples
[INFO]   JCR Block [modules]
[INFO]   JCR Block Implementation
[INFO]   JCR Block Sample
[INFO]   Jfor Block Implementation
[INFO]   Jfor Block Samples
[INFO]   JMS Block Samples
[INFO]   Jsp Block Mocks
[INFO]   Jsp Block Implementation
[INFO]   Jsp Block Samples
[INFO]   Lucene Block Implementation
[INFO]   Lucene Block Samples
[INFO]   Cocoon Mail Block Implementation
[INFO]   Cocoon Mail Block Sample
[INFO]   Midi Block Implementation
[INFO]   Midi Block Samples
[INFO]   Naming Block Implementation
[INFO]   Naming Block Samples
[INFO]   Ojb Block Mocks
[INFO]   Ojb Block Implementation
[INFO]   Querybean Block Implementation
[INFO]   Ojb Block Samples
[INFO]   Petstore Block Implementation
[INFO]   Velocity Block [modules]
[INFO]   Velocity Block Implementation
[INFO]   Petstore Block Samples
[INFO]   Poi Block Implementation
[INFO]   Poi Block Samples
[INFO]   Portal Block CAuth Support
[INFO]   Portal Block Bridges Implementation
[INFO]   Cocoon Serializers Block Implementation
[INFO]   Portal Block Sitemap
[INFO]   Portal Block Portlet Implementation
[INFO]   Cocoon Portal Castor Converter
[INFO]   Portal Block Sample
[INFO]   Profiler Block
[INFO]   Profiler Block Samples
[INFO]   Proxy Block Implementation
[INFO]   Proxy Block Samples
[INFO]   Python Block Mocks
[INFO]   Python Block Implementation
[INFO]   Qdox Block Implementation
[INFO]   Qdox Block Samples
[INFO]   Querybean Block Samples
[INFO]   Repository Block Implementation
[INFO]   Scratchpad Block Implementation
[INFO]   Scratchpad Block Samples
[INFO]   Session Framework Sample Application
[INFO]   Slide Block Implementation
[INFO]   Slide Block Samples
[INFO]   Slop Block Implementation
[INFO]   Slop Block Samples
[INFO]   Stx Block Implementation
[INFO]   Stx Block Samples
[INFO]   Taglib Block Samples
[INFO]   Tour Block [modules]
[INFO]   Tour Block Implementation
[INFO]   Tour Block Samples
[INFO]   Validation Block [modules]
[INFO]   Validation Block Implementation
[INFO]   Validation Block Sample
[INFO]   Velocity Block Samples
[INFO]   Web3 Block [modules]
[INFO]   Web3 Block Mocks
[INFO]   Web3 Block Implementation
[INFO]   Web3 Block Samples
[INFO]   Webdav Block [modules]
[INFO]   Webdav Block Implementation
[INFO]   Webdav Block Samples
[INFO]   XMLDB Block's Implementation
[INFO]   XMLDB Block's Samples
[INFO]   XSP Block Samples
[INFO]   Cocoon Licenses
[INFO]   Cocoon Commons [modules]
[INFO]   Cocoon Servlet Service Sample Blocks
[INFO]   Cocoon Webapp
[INFO]   Cocoon Distributions [modules]
[INFO]   Apache Cocoon [build root]
[INFO] ----------------------------------------------------------------------------
[INFO] Building Apache Cocoon
[INFO]    task-segment: [clean, install]
[INFO] ----------------------------------------------------------------------------
[INFO] [clean:clean]
[INFO] Deleting directory /home/continuum/data/working-directory/51/parent/target
[INFO] Deleting directory /home/continuum/data/working-directory/51/parent/target/classes
[INFO] Deleting directory /home/continuum/data/working-directory/51/parent/target/test-classes
[INFO] Deleting directory /home/continuum/data/working-directory/51/parent/target/site
[INFO] [enforcer:enforce-once {execution: enforce-maven}]
[INFO] [site:attach-descriptor]
[INFO] [install:install]
[INFO] Installing /home/continuum/data/working-directory/51/parent/pom.xml to /home/continuum/.m2/repository/org/apache/cocoon/cocoon/6-SNAPSHOT/cocoon-6-SNAPSHOT.pom
[INFO] ----------------------------------------------------------------------------
[INFO] Building Cocoon Tools [modules]
[INFO]    task-segment: [clean, install]
[INFO] ----------------------------------------------------------------------------
[INFO] [clean:clean]
[INFO] Deleting directory /home/continuum/data/working-directory/51/tools/target
[INFO] Deleting directory /home/continuum/data/working-directory/51/tools/target/classes
[INFO] Deleting directory /home/continuum/data/working-directory/51/tools/target/test-classes
[INFO] Deleting directory /home/continuum/data/working-directory/51/tools/target/site
[INFO] [enforcer:enforce-once {execution: enforce-maven}]
[INFO] [site:attach-descriptor]
[INFO] [install:install]
[INFO] Installing /home/continuum/data/working-directory/51/tools/pom.xml to /home/continuum/.m2/repository/org/apache/cocoon/cocoon-tools-modules/5-SNAPSHOT/cocoon-tools-modules-5-SNAPSHOT.pom
[INFO] ----------------------------------------------------------------------------
[INFO] Building Cocoon 2.2 Archetype: Block
[INFO]    task-segment: [clean, install]
[INFO] ----------------------------------------------------------------------------
[INFO] [clean:clean]
[INFO] Deleting directory /home/continuum/data/working-directory/51/tools/archetypes/cocoon-22-archetype-block/target
[INFO] Deleting directory /home/continuum/data/working-directory/51/tools/archetypes/cocoon-22-archetype-block/target/classes
[INFO] Deleting directory /home/continuum/data/working-directory/51/tools/archetypes/cocoon-22-archetype-block/target/test-classes
[INFO] Deleting directory /home/continuum/data/working-directory/51/tools/archetypes/cocoon-22-archetype-block/target/site
[INFO] [enforcer:enforce-once {execution: enforce-maven}]
[INFO] [resources:resources]
[INFO] Using default encoding to copy filtered resources.
[INFO] [compiler:compile]
[INFO] No sources to compile
[INFO] [resources:testResources]
[INFO] Using default encoding to copy filtered resources.
[INFO] [compiler:testCompile]
[INFO] No sources to compile
[INFO] [surefire:test]
[INFO] No tests to run.
[INFO] [jar:jar]
[INFO] Building jar: /home/continuum/data/working-directory/51/tools/archetypes/cocoon-22-archetype-block/target/cocoon-22-archetype-block-1.1.0-SNAPSHOT.jar
[INFO] [install:install]
[INFO] Installing /home/continuum/data/working-directory/51/tools/archetypes/cocoon-22-archetype-block/target/cocoon-22-archetype-block-1.1.0-SNAPSHOT.jar to /home/continuum/.m2/repository/org/apache/cocoon/cocoon-22-archetype-block/1.1.0-SNAPSHOT/cocoon-22-archetype-block-1.1.0-SNAPSHOT.jar
[INFO] ----------------------------------------------------------------------------
[INFO] Building Cocoon 2.2 Archetype: Block (plain)
[INFO]    task-segment: [clean, install]
[INFO] ----------------------------------------------------------------------------
[INFO] [clean:clean]
[INFO] Deleting directory /home/continuum/data/working-directory/51/tools/archetypes/cocoon-22-archetype-block-plain/target
[INFO] Deleting directory /home/continuum/data/working-directory/51/tools/archetypes/cocoon-22-archetype-block-plain/target/classes
[INFO] Deleting directory /home/continuum/data/working-directory/51/tools/archetypes/cocoon-22-archetype-block-plain/target/test-classes
[INFO] Deleting directory /home/continuum/data/working-directory/51/tools/archetypes/cocoon-22-archetype-block-plain/target/site
[INFO] [enforcer:enforce-once {execution: enforce-maven}]
[INFO] [resources:resources]
[INFO] Using default encoding to copy filtered resources.
[INFO] [compiler:compile]
[INFO] No sources to compile
[INFO] [resources:testResources]
[INFO] Using default encoding to copy filtered resources.
[INFO] [compiler:testCompile]
[INFO] No sources to compile
[INFO] [surefire:test]
[INFO] No tests to run.
[INFO] [jar:jar]
[INFO] Building jar: /home/continuum/data/working-directory/51/tools/archetypes/cocoon-22-archetype-block-plain/target/cocoon-22-archetype-block-plain-1.1.0-SNAPSHOT.jar
[INFO] [install:install]
[INFO] Installing /home/continuum/data/working-directory/51/tools/archetypes/cocoon-22-archetype-block-plain/target/cocoon-22-archetype-block-plain-1.1.0-SNAPSHOT.jar to /home/continuum/.m2/repository/org/apache/cocoon/cocoon-22-archetype-block-plain/1.1.0-SNAPSHOT/cocoon-22-archetype-block-plain-1.1.0-SNAPSHOT.jar
[INFO] ----------------------------------------------------------------------------
[INFO] Building Cocoon 2.2 Archetype: Web Application
[INFO]    task-segment: [clean, install]
[INFO] ----------------------------------------------------------------------------
[INFO] [clean:clean]
[INFO] Deleting directory /home/continuum/data/working-directory/51/tools/archetypes/cocoon-22-archetype-webapp/target
[INFO] Deleting directory /home/continuum/data/working-directory/51/tools/archetypes/cocoon-22-archetype-webapp/target/classes
[INFO] Deleting directory /home/continuum/data/working-directory/51/tools/archetypes/cocoon-22-archetype-webapp/target/test-classes
[INFO] Deleting directory /home/continuum/data/working-directory/51/tools/archetypes/cocoon-22-archetype-webapp/target/site
[INFO] [enforcer:enforce-once {execution: enforce-maven}]
[INFO] [resources:resources]
[INFO] Using default encoding to copy filtered resources.
[INFO] [compiler:compile]
[INFO] No sources to compile
[INFO] [resources:testResources]
[INFO] Using default encoding to copy filtered resources.
[INFO] [compiler:testCompile]
[INFO] No sources to compile
[INFO] [surefire:test]
[INFO] No tests to run.
[INFO] [jar:jar]
[INFO] Building jar: /home/continuum/data/working-directory/51/tools/archetypes/cocoon-22-archetype-webapp/target/cocoon-22-archetype-webapp-1.1.0-SNAPSHOT.jar
[INFO] [install:install]
[INFO] Installing /home/continuum/data/working-directory/51/tools/archetypes/cocoon-22-archetype-webapp/target/cocoon-22-archetype-webapp-1.1.0-SNAPSHOT.jar to /home/continuum/.m2/repository/org/apache/cocoon/cocoon-22-archetype-webapp/1.1.0-SNAPSHOT/cocoon-22-archetype-webapp-1.1.0-SNAPSHOT.jar
[INFO] ----------------------------------------------------------------------------
[INFO] Building Cocoon Integration Test Framework [maven-plugin]
[INFO]    task-segment: [clean, install]
[INFO] ----------------------------------------------------------------------------
[INFO] [clean:clean]
[INFO] Deleting directory /home/continuum/data/working-directory/51/tools/cocoon-it-fw/target
[INFO] Deleting directory /home/continuum/data/working-directory/51/tools/cocoon-it-fw/target/classes
[INFO] Deleting directory /home/continuum/data/working-directory/51/tools/cocoon-it-fw/target/test-classes
[INFO] Deleting directory /home/continuum/data/working-directory/51/tools/cocoon-it-fw/target/site
[INFO] [enforcer:enforce-once {execution: enforce-maven}]
[INFO] [plugin:descriptor]
[INFO] Using 2 extractors.
[INFO] Applying extractor for language: java
[INFO] Extractor for language: java found 2 mojo descriptors.
[INFO] Applying extractor for language: bsh
[INFO] Extractor for language: bsh found 0 mojo descriptors.
[INFO] [resources:resources]
[INFO] Using default encoding to copy filtered resources.
[INFO] [compiler:compile]
[INFO] Compiling 5 source files to /home/continuum/data/working-directory/51/tools/cocoon-it-fw/target/classes
[INFO] [resources:testResources]
[INFO] Using default encoding to copy filtered resources.
[INFO] [compiler:testCompile]
[INFO] No sources to compile
[INFO] [surefire:test]
[INFO] No tests to run.
[INFO] [jar:jar]
[INFO] Building jar: /home/continuum/data/working-directory/51/tools/cocoon-it-fw/target/cocoon-it-fw-1.0.0-RC1-SNAPSHOT.jar
[INFO] [plugin:addPluginArtifactMetadata]
[INFO] [install:install]
[INFO] Installing /home/continuum/data/working-directory/51/tools/cocoon-it-fw/target/cocoon-it-fw-1.0.0-RC1-SNAPSHOT.jar to /home/continuum/.m2/repository/org/apache/cocoon/cocoon-it-fw/1.0.0-RC1-SNAPSHOT/cocoon-it-fw-1.0.0-RC1-SNAPSHOT.jar
[INFO] [plugin:updateRegistry]
[INFO] ----------------------------------------------------------------------------
[INFO] Building Cocoon Maven Reports
[INFO]    task-segment: [clean, install]
[INFO] ----------------------------------------------------------------------------
[INFO] [clean:clean]
[INFO] Deleting directory /home/continuum/data/working-directory/51/tools/cocoon-maven-reports/target
[INFO] Deleting directory /home/continuum/data/working-directory/51/tools/cocoon-maven-reports/target/classes
[INFO] Deleting directory /home/continuum/data/working-directory/51/tools/cocoon-maven-reports/target/test-classes
[INFO] Deleting directory /home/continuum/data/working-directory/51/tools/cocoon-maven-reports/target/site
[INFO] [enforcer:enforce-once {execution: enforce-maven}]
[INFO] [resources:resources]
[INFO] Using default encoding to copy filtered resources.
[INFO] [compiler:compile]
[INFO] No sources to compile
[INFO] [resources:testResources]
[INFO] Using default encoding to copy filtered resources.
[INFO] [compiler:testCompile]
[INFO] No sources to compile
[INFO] [surefire:test]
[INFO] No tests to run.
[INFO] [jar:jar]
[INFO] Building jar: /home/continuum/data/working-directory/51/tools/cocoon-maven-reports/target/cocoon-maven-reports-1.0.0-SNAPSHOT.jar
[INFO] [install:install]
[INFO] Installing /home/continuum/data/working-directory/51/tools/cocoon-maven-reports/target/cocoon-maven-reports-1.0.0-SNAPSHOT.jar to /home/continuum/.m2/repository/org/apache/cocoon/cocoon-maven-reports/1.0.0-SNAPSHOT/cocoon-maven-reports-1.0.0-SNAPSHOT.jar
[INFO] ----------------------------------------------------------------------------
[INFO] Building Cocoon Maven 2 Plugin
[INFO]    task-segment: [clean, install]
[INFO] ----------------------------------------------------------------------------
[INFO] [clean:clean]
[INFO] Deleting directory /home/continuum/data/working-directory/51/tools/cocoon-maven-plugin/target
[INFO] Deleting directory /home/continuum/data/working-directory/51/tools/cocoon-maven-plugin/target/classes
[INFO] Deleting directory /home/continuum/data/working-directory/51/tools/cocoon-maven-plugin/target/test-classes
[INFO] Deleting directory /home/continuum/data/working-directory/51/tools/cocoon-maven-plugin/target/site
[INFO] [enforcer:enforce-once {execution: enforce-maven}]
[INFO] [plugin:descriptor]
[WARNING] Goal prefix is: cocoon; Maven currently expects it to be cocoon
[INFO] Using 2 extractors.
[INFO] Applying extractor for language: java
[INFO] Extractor for language: java found 4 mojo descriptors.
[INFO] Applying extractor for language: bsh
[INFO] Extractor for language: bsh found 0 mojo descriptors.
[INFO] [resources:resources]
[INFO] Using default encoding to copy filtered resources.
[INFO] [compiler:compile]
[INFO] Compiling 24 source files to /home/continuum/data/working-directory/51/tools/cocoon-maven-plugin/target/classes
[INFO] [resources:testResources]
[INFO] Using default encoding to copy filtered resources.
[INFO] [compiler:testCompile]
[INFO] Compiling 1 source file to /home/continuum/data/working-directory/51/tools/cocoon-maven-plugin/target/test-classes
[INFO] [surefire:test]
[INFO] Surefire report directory: /home/continuum/data/working-directory/51/tools/cocoon-maven-plugin/target/surefire-reports

-------------------------------------------------------
 T E S T S
-------------------------------------------------------
Running org.apache.cocoon.maven.rcl.RwmPropertiesTest
log4j:WARN No appenders could be found for logger (org.apache.commons.configuration.ConfigurationUtils).
log4j:WARN Please initialize the log4j system properly.
Tests run: 4, Failures: 0, Errors: 0, Skipped: 0, Time elapsed: 0.295 sec

Results :

Tests run: 4, Failures: 0, Errors: 0, Skipped: 0

[INFO] [jar:jar]
[INFO] Building jar: /home/continuum/data/working-directory/51/tools/cocoon-maven-plugin/target/cocoon-maven-plugin-1.0.0-RC1-SNAPSHOT.jar
[INFO] [plugin:addPluginArtifactMetadata]
[INFO] [install:install]
[INFO] Installing /home/continuum/data/working-directory/51/tools/cocoon-maven-plugin/target/cocoon-maven-plugin-1.0.0-RC1-SNAPSHOT.jar to /home/continuum/.m2/repository/org/apache/cocoon/cocoon-maven-plugin/1.0.0-RC1-SNAPSHOT/cocoon-maven-plugin-1.0.0-RC1-SNAPSHOT.jar
[INFO] [plugin:updateRegistry]
[INFO] ----------------------------------------------------------------------------
[INFO] Building Cocoon Maven Javadocs Script Report
[INFO]    task-segment: [clean, install]
[INFO] ----------------------------------------------------------------------------
[INFO] [clean:clean]
[INFO] Deleting directory /home/continuum/data/working-directory/51/tools/cocoon-maven-docs-cleaner-plugin/target
[INFO] Deleting directory /home/continuum/data/working-directory/51/tools/cocoon-maven-docs-cleaner-plugin/target/classes
[INFO] Deleting directory /home/continuum/data/working-directory/51/tools/cocoon-maven-docs-cleaner-plugin/target/test-classes
[INFO] Deleting directory /home/continuum/data/working-directory/51/tools/cocoon-maven-docs-cleaner-plugin/target/site
[INFO] [enforcer:enforce-once {execution: enforce-maven}]
[INFO] [plugin:descriptor]
[WARNING] Goal prefix is: cocoon-docs-cleaner; Maven currently expects it to be cocoondocs-cleaner
[INFO] Using 2 extractors.
[INFO] Applying extractor for language: java
[INFO] Extractor for language: java found 1 mojo descriptors.
[INFO] Applying extractor for language: bsh
[INFO] Extractor for language: bsh found 0 mojo descriptors.
[INFO] [resources:resources]
[INFO] Using default encoding to copy filtered resources.
[INFO] [compiler:compile]
[INFO] Compiling 1 source file to /home/continuum/data/working-directory/51/tools/cocoon-maven-docs-cleaner-plugin/target/classes
[INFO] [resources:testResources]
[INFO] Using default encoding to copy filtered resources.
[INFO] [compiler:testCompile]
[INFO] No sources to compile
[INFO] [surefire:test]
[INFO] No tests to run.
[INFO] [jar:jar]
[INFO] Building jar: /home/continuum/data/working-directory/51/tools/cocoon-maven-docs-cleaner-plugin/target/cocoon-maven-docs-cleaner-plugin-1.0.0-M1-SNAPSHOT.jar
[INFO] [plugin:addPluginArtifactMetadata]
[INFO] [install:install]
[INFO] Installing /home/continuum/data/working-directory/51/tools/cocoon-maven-docs-cleaner-plugin/target/cocoon-maven-docs-cleaner-plugin-1.0.0-M1-SNAPSHOT.jar to /home/continuum/.m2/repository/org/apache/cocoon/cocoon-maven-docs-cleaner-plugin/1.0.0-M1-SNAPSHOT/cocoon-maven-docs-cleaner-plugin-1.0.0-M1-SNAPSHOT.jar
[INFO] [plugin:updateRegistry]
[INFO] ----------------------------------------------------------------------------
[INFO] Building Cocoon Maven Javadocs Script Report
[INFO]    task-segment: [clean, install]
[INFO] ----------------------------------------------------------------------------
[INFO] [clean:clean]
[INFO] Deleting directory /home/continuum/data/working-directory/51/tools/cocoon-maven-javadocs-script-report/target
[INFO] Deleting directory /home/continuum/data/working-directory/51/tools/cocoon-maven-javadocs-script-report/target/classes
[INFO] Deleting directory /home/continuum/data/working-directory/51/tools/cocoon-maven-javadocs-script-report/target/test-classes
[INFO] Deleting directory /home/continuum/data/working-directory/51/tools/cocoon-maven-javadocs-script-report/target/site
[INFO] [enforcer:enforce-once {execution: enforce-maven}]
[INFO] [plugin:descriptor]
[INFO] Using 2 extractors.
[INFO] Applying extractor for language: java
[INFO] Extractor for language: java found 1 mojo descriptors.
[INFO] Applying extractor for language: bsh
[INFO] Extractor for language: bsh found 0 mojo descriptors.
[INFO] [resources:resources]
[INFO] Using default encoding to copy filtered resources.
[INFO] [compiler:compile]
[INFO] Compiling 1 source file to /home/continuum/data/working-directory/51/tools/cocoon-maven-javadocs-script-report/target/classes
[INFO] [resources:testResources]
[INFO] Using default encoding to copy filtered resources.
[INFO] [compiler:testCompile]
[INFO] No sources to compile
[INFO] [surefire:test]
[INFO] No tests to run.
[INFO] [jar:jar]
[INFO] Building jar: /home/continuum/data/working-directory/51/tools/cocoon-maven-javadocs-script-report/target/cocoon-maven-javadocs-script-report-1.0.0-M2-SNAPSHOT.jar
[INFO] [plugin:addPluginArtifactMetadata]
[INFO] [install:install]
[INFO] Installing /home/continuum/data/working-directory/51/tools/cocoon-maven-javadocs-script-report/target/cocoon-maven-javadocs-script-report-1.0.0-M2-SNAPSHOT.jar to /home/continuum/.m2/repository/org/apache/cocoon/cocoon-maven-javadocs-script-report/1.0.0-M2-SNAPSHOT/cocoon-maven-javadocs-script-report-1.0.0-M2-SNAPSHOT.jar
[INFO] [plugin:updateRegistry]
[INFO] ----------------------------------------------------------------------------
[INFO] Building Cocoon Reloading ClassLoader - Webapp Wrapper
[INFO]    task-segment: [clean, install]
[INFO] ----------------------------------------------------------------------------
[INFO] [clean:clean]
[INFO] Deleting directory /home/continuum/data/working-directory/51/tools/cocoon-rcl/cocoon-rcl-webapp-wrapper/target
[INFO] Deleting directory /home/continuum/data/working-directory/51/tools/cocoon-rcl/cocoon-rcl-webapp-wrapper/target/classes
[INFO] Deleting directory /home/continuum/data/working-directory/51/tools/cocoon-rcl/cocoon-rcl-webapp-wrapper/target/test-classes
[INFO] Deleting directory /home/continuum/data/working-directory/51/tools/cocoon-rcl/cocoon-rcl-webapp-wrapper/target/site
[INFO] [enforcer:enforce-once {execution: enforce-maven}]
[INFO] [resources:resources]
[INFO] Using default encoding to copy filtered resources.
[INFO] [compiler:compile]
[INFO] Compiling 9 source files to /home/continuum/data/working-directory/51/tools/cocoon-rcl/cocoon-rcl-webapp-wrapper/target/classes
[INFO] [resources:testResources]
[INFO] Using default encoding to copy filtered resources.
[INFO] [compiler:testCompile]
[INFO] No sources to compile
[INFO] [surefire:test]
[INFO] No tests to run.
[INFO] [jar:jar]
[INFO] Building jar: /home/continuum/data/working-directory/51/tools/cocoon-rcl/cocoon-rcl-webapp-wrapper/target/cocoon-rcl-webapp-wrapper-1.0.0-RC1-SNAPSHOT.jar
[INFO] [install:install]
[INFO] Installing /home/continuum/data/working-directory/51/tools/cocoon-rcl/cocoon-rcl-webapp-wrapper/target/cocoon-rcl-webapp-wrapper-1.0.0-RC1-SNAPSHOT.jar to /home/continuum/.m2/repository/org/apache/cocoon/cocoon-rcl-webapp-wrapper/1.0.0-RC1-SNAPSHOT/cocoon-rcl-webapp-wrapper-1.0.0-RC1-SNAPSHOT.jar
[INFO] ----------------------------------------------------------------------------
[INFO] Building Cocoon Reloading ClassLoader - Spring reloader
[INFO]    task-segment: [clean, install]
[INFO] ----------------------------------------------------------------------------
[INFO] [clean:clean]
[INFO] Deleting directory /home/continuum/data/working-directory/51/tools/cocoon-rcl/cocoon-rcl-spring-reloader/target
[INFO] Deleting directory /home/continuum/data/working-directory/51/tools/cocoon-rcl/cocoon-rcl-spring-reloader/target/classes
[INFO] Deleting directory /home/continuum/data/working-directory/51/tools/cocoon-rcl/cocoon-rcl-spring-reloader/target/test-classes
[INFO] Deleting directory /home/continuum/data/working-directory/51/tools/cocoon-rcl/cocoon-rcl-spring-reloader/target/site
[INFO] [enforcer:enforce-once {execution: enforce-maven}]
[INFO] [resources:resources]
[INFO] Using default encoding to copy filtered resources.
[INFO] [compiler:compile]
[INFO] Compiling 2 source files to /home/continuum/data/working-directory/51/tools/cocoon-rcl/cocoon-rcl-spring-reloader/target/classes
[INFO] [resources:testResources]
[INFO] Using default encoding to copy filtered resources.
[INFO] [compiler:testCompile]
[INFO] No sources to compile
[INFO] [surefire:test]
[INFO] No tests to run.
[INFO] [jar:jar]
[INFO] Building jar: /home/continuum/data/working-directory/51/tools/cocoon-rcl/cocoon-rcl-spring-reloader/target/cocoon-rcl-spring-reloader-1.0.0-RC1-SNAPSHOT.jar
[INFO] [install:install]
[INFO] Installing /home/continuum/data/working-directory/51/tools/cocoon-rcl/cocoon-rcl-spring-reloader/target/cocoon-rcl-spring-reloader-1.0.0-RC1-SNAPSHOT.jar to /home/continuum/.m2/repository/org/apache/cocoon/cocoon-rcl-spring-reloader/1.0.0-RC1-SNAPSHOT/cocoon-rcl-spring-reloader-1.0.0-RC1-SNAPSHOT.jar
[INFO] ----------------------------------------------------------------------------
[INFO] Building Cocoon Configuration API
[INFO]    task-segment: [clean, install]
[INFO] ----------------------------------------------------------------------------
[INFO] [clean:clean]
[INFO] Deleting directory /home/continuum/data/working-directory/51/core/cocoon-configuration/cocoon-configuration-api/target
[INFO] Deleting directory /home/continuum/data/working-directory/51/core/cocoon-configuration/cocoon-configuration-api/target/classes
[INFO] Deleting directory /home/continuum/data/working-directory/51/core/cocoon-configuration/cocoon-configuration-api/target/test-classes
[INFO] Deleting directory /home/continuum/data/working-directory/51/core/cocoon-configuration/cocoon-configuration-api/target/site
[INFO] [enforcer:enforce-once {execution: enforce-maven}]
[INFO] [resources:resources]
[INFO] Using default encoding to copy filtered resources.
[INFO] [compiler:compile]
[INFO] Compiling 5 source files to /home/continuum/data/working-directory/51/core/cocoon-configuration/cocoon-configuration-api/target/classes
[INFO] [resources:testResources]
[INFO] Using default encoding to copy filtered resources.
[INFO] [compiler:testCompile]
[INFO] No sources to compile
[INFO] [surefire:test]
[INFO] No tests to run.
[INFO] [jar:jar]
[INFO] Building jar: /home/continuum/data/working-directory/51/core/cocoon-configuration/cocoon-configuration-api/target/cocoon-configuration-api-1.0.3-SNAPSHOT.jar
[INFO] [install:install]
[INFO] Installing /home/continuum/data/working-directory/51/core/cocoon-configuration/cocoon-configuration-api/target/cocoon-configuration-api-1.0.3-SNAPSHOT.jar to /home/continuum/.m2/repository/org/apache/cocoon/cocoon-configuration-api/1.0.3-SNAPSHOT/cocoon-configuration-api-1.0.3-SNAPSHOT.jar
[INFO] ----------------------------------------------------------------------------
[INFO] Building Cocoon Spring Configurator
[INFO]    task-segment: [clean, install]
[INFO] ----------------------------------------------------------------------------
[INFO] [clean:clean]
[INFO] Deleting directory /home/continuum/data/working-directory/51/core/cocoon-configuration/cocoon-spring-configurator/target
[INFO] Deleting directory /home/continuum/data/working-directory/51/core/cocoon-configuration/cocoon-spring-configurator/target/classes
[INFO] Deleting directory /home/continuum/data/working-directory/51/core/cocoon-configuration/cocoon-spring-configurator/target/test-classes
[INFO] Deleting directory /home/continuum/data/working-directory/51/core/cocoon-configuration/cocoon-spring-configurator/target/site
[INFO] [enforcer:enforce-once {execution: enforce-maven}]
[INFO] [resources:resources]
[INFO] Using default encoding to copy filtered resources.
[INFO] [compiler:compile]
[INFO] Compiling 22 source files to /home/continuum/data/working-directory/51/core/cocoon-configuration/cocoon-spring-configurator/target/classes
[INFO] [resources:testResources]
[INFO] Using default encoding to copy filtered resources.
[INFO] [compiler:testCompile]
[INFO] No sources to compile
[INFO] [surefire:test]
[INFO] No tests to run.
[INFO] [jar:jar]
[INFO] Building jar: /home/continuum/data/working-directory/51/core/cocoon-configuration/cocoon-spring-configurator/target/cocoon-spring-configurator-1.0.3-SNAPSHOT.jar
[INFO] [install:install]
[INFO] Installing /home/continuum/data/working-directory/51/core/cocoon-configuration/cocoon-spring-configurator/target/cocoon-spring-configurator-1.0.3-SNAPSHOT.jar to /home/continuum/.m2/repository/org/apache/cocoon/cocoon-spring-configurator/1.0.3-SNAPSHOT/cocoon-spring-configurator-1.0.3-SNAPSHOT.jar
[INFO] ----------------------------------------------------------------------------
[INFO] Building Cocoon Core [modules]
[INFO]    task-segment: [clean, install]
[INFO] ----------------------------------------------------------------------------
[INFO] [clean:clean]
[INFO] Deleting directory /home/continuum/data/working-directory/51/core/target
[INFO] Deleting directory /home/continuum/data/working-directory/51/core/target/classes
[INFO] Deleting directory /home/continuum/data/working-directory/51/core/target/test-classes
[INFO] Deleting directory /home/continuum/data/working-directory/51/core/target/site
[INFO] [enforcer:enforce-once {execution: enforce-maven}]
[INFO] [site:attach-descriptor]
[INFO] [install:install]
[INFO] Installing /home/continuum/data/working-directory/51/core/pom.xml to /home/continuum/.m2/repository/org/apache/cocoon/cocoon-core-modules/6-SNAPSHOT/cocoon-core-modules-6-SNAPSHOT.pom
[INFO] ----------------------------------------------------------------------------
[INFO] Building Cocoon Pipeline API
[INFO]    task-segment: [clean, install]
[INFO] ----------------------------------------------------------------------------
[INFO] [clean:clean]
[INFO] Deleting directory /home/continuum/data/working-directory/51/core/cocoon-pipeline/cocoon-pipeline-api/target
[INFO] Deleting directory /home/continuum/data/working-directory/51/core/cocoon-pipeline/cocoon-pipeline-api/target/classes
[INFO] Deleting directory /home/continuum/data/working-directory/51/core/cocoon-pipeline/cocoon-pipeline-api/target/test-classes
[INFO] Deleting directory /home/continuum/data/working-directory/51/core/cocoon-pipeline/cocoon-pipeline-api/target/site
[INFO] [enforcer:enforce-once {execution: enforce-maven}]
[INFO] [resources:resources]
[INFO] Using default encoding to copy filtered resources.
[INFO] [compiler:compile]
[INFO] Compiling 45 source files to /home/continuum/data/working-directory/51/core/cocoon-pipeline/cocoon-pipeline-api/target/classes
[INFO] [resources:testResources]
[INFO] Using default encoding to copy filtered resources.
[INFO] [compiler:testCompile]
[INFO] Compiling 1 source file to /home/continuum/data/working-directory/51/core/cocoon-pipeline/cocoon-pipeline-api/target/test-classes
[INFO] [surefire:test]
[INFO] Surefire report directory: /home/continuum/data/working-directory/51/core/cocoon-pipeline/cocoon-pipeline-api/target/surefire-reports

-------------------------------------------------------
 T E S T S
-------------------------------------------------------
Running org.apache.cocoon.util.location.LocationTestCase
Tests run: 3, Failures: 0, Errors: 0, Skipped: 0, Time elapsed: 0.084 sec

Results :

Tests run: 3, Failures: 0, Errors: 0, Skipped: 0

[INFO] [jar:jar]
[INFO] Building jar: /home/continuum/data/working-directory/51/core/cocoon-pipeline/cocoon-pipeline-api/target/cocoon-pipeline-api-1.1.0-SNAPSHOT.jar
[INFO] [install:install]
[INFO] Installing /home/continuum/data/working-directory/51/core/cocoon-pipeline/cocoon-pipeline-api/target/cocoon-pipeline-api-1.1.0-SNAPSHOT.jar to /home/continuum/.m2/repository/org/apache/cocoon/cocoon-pipeline-api/1.1.0-SNAPSHOT/cocoon-pipeline-api-1.1.0-SNAPSHOT.jar
[INFO] ----------------------------------------------------------------------------
[INFO] Building Cocoon Util
[INFO]    task-segment: [clean, install]
[INFO] ----------------------------------------------------------------------------
[INFO] [clean:clean]
[INFO] Deleting directory /home/continuum/data/working-directory/51/core/cocoon-util/target
[INFO] Deleting directory /home/continuum/data/working-directory/51/core/cocoon-util/target/classes
[INFO] Deleting directory /home/continuum/data/working-directory/51/core/cocoon-util/target/test-classes
[INFO] Deleting directory /home/continuum/data/working-directory/51/core/cocoon-util/target/site
[INFO] [enforcer:enforce-once {execution: enforce-maven}]
[INFO] [resources:resources]
[INFO] Using default encoding to copy filtered resources.
[INFO] [compiler:compile]
[INFO] Compiling 24 source files to /home/continuum/data/working-directory/51/core/cocoon-util/target/classes
[INFO] [resources:testResources]
[INFO] Using default encoding to copy filtered resources.
[INFO] [compiler:testCompile]
[INFO] Compiling 5 source files to /home/continuum/data/working-directory/51/core/cocoon-util/target/test-classes
[INFO] [surefire:test]
[INFO] Surefire report directory: /home/continuum/data/working-directory/51/core/cocoon-util/target/surefire-reports

-------------------------------------------------------
 T E S T S
-------------------------------------------------------
Running org.apache.cocoon.util.test.DeprecationTestCase
Tests run: 8, Failures: 0, Errors: 0, Skipped: 0, Time elapsed: 0.074 sec
Running org.apache.cocoon.util.test.IOUtilsTestCase
Tests run: 2, Failures: 0, Errors: 0, Skipped: 0, Time elapsed: 0.057 sec
Running org.apache.cocoon.util.test.NetUtilsTestCase
Tests run: 8, Failures: 0, Errors: 0, Skipped: 0, Time elapsed: 0.021 sec
Running org.apache.cocoon.util.test.MIMEUtilsTestCase
Tests run: 1, Failures: 0, Errors: 0, Skipped: 0, Time elapsed: 0.029 sec
Running org.apache.cocoon.util.WildcardMatcherHelperTestCase
Tests run: 40, Failures: 0, Errors: 0, Skipped: 0, Time elapsed: 0.131 sec

Results :

Tests run: 59, Failures: 0, Errors: 0, Skipped: 0

[INFO] [jar:jar]
[INFO] Building jar: /home/continuum/data/working-directory/51/core/cocoon-util/target/cocoon-util-1.1.0-SNAPSHOT.jar
[INFO] [install:install]
[INFO] Installing /home/continuum/data/working-directory/51/core/cocoon-util/target/cocoon-util-1.1.0-SNAPSHOT.jar to /home/continuum/.m2/repository/org/apache/cocoon/cocoon-util/1.1.0-SNAPSHOT/cocoon-util-1.1.0-SNAPSHOT.jar
[INFO] ----------------------------------------------------------------------------
[INFO] Building Cocoon XML API
[INFO]    task-segment: [clean, install]
[INFO] ----------------------------------------------------------------------------
[INFO] [clean:clean]
[INFO] Deleting directory /home/continuum/data/working-directory/51/core/cocoon-xml/cocoon-xml-api/target
[INFO] Deleting directory /home/continuum/data/working-directory/51/core/cocoon-xml/cocoon-xml-api/target/classes
[INFO] Deleting directory /home/continuum/data/working-directory/51/core/cocoon-xml/cocoon-xml-api/target/test-classes
[INFO] Deleting directory /home/continuum/data/working-directory/51/core/cocoon-xml/cocoon-xml-api/target/site
[INFO] [enforcer:enforce-once {execution: enforce-maven}]
[INFO] [resources:resources]
[INFO] Using default encoding to copy filtered resources.
[INFO] [compiler:compile]
[INFO] Compiling 2 source files to /home/continuum/data/working-directory/51/core/cocoon-xml/cocoon-xml-api/target/classes
[INFO] [resources:testResources]
[INFO] Using default encoding to copy filtered resources.
[INFO] [compiler:testCompile]
[INFO] No sources to compile
[INFO] [surefire:test]
[INFO] No tests to run.
[INFO] [jar:jar]
[INFO] Building jar: /home/continuum/data/working-directory/51/core/cocoon-xml/cocoon-xml-api/target/cocoon-xml-api-1.1.0-SNAPSHOT.jar
[INFO] [install:install]
[INFO] Installing /home/continuum/data/working-directory/51/core/cocoon-xml/cocoon-xml-api/target/cocoon-xml-api-1.1.0-SNAPSHOT.jar to /home/continuum/.m2/repository/org/apache/cocoon/cocoon-xml-api/1.1.0-SNAPSHOT/cocoon-xml-api-1.1.0-SNAPSHOT.jar
[INFO] ----------------------------------------------------------------------------
[INFO] Building Cocoon Expression Language API
[INFO]    task-segment: [clean, install]
[INFO] ----------------------------------------------------------------------------
[INFO] [clean:clean]
[INFO] Deleting directory /home/continuum/data/working-directory/51/core/cocoon-expression-language/cocoon-expression-language-api/target
[INFO] Deleting directory /home/continuum/data/working-directory/51/core/cocoon-expression-language/cocoon-expression-language-api/target/classes
[INFO] Deleting directory /home/continuum/data/working-directory/51/core/cocoon-expression-language/cocoon-expression-language-api/target/test-classes
[INFO] Deleting directory /home/continuum/data/working-directory/51/core/cocoon-expression-language/cocoon-expression-language-api/target/site
[INFO] [enforcer:enforce-once {execution: enforce-maven}]
[INFO] [resources:resources]
[INFO] Using default encoding to copy filtered resources.
[INFO] [compiler:compile]
[INFO] Compiling 8 source files to /home/continuum/data/working-directory/51/core/cocoon-expression-language/cocoon-expression-language-api/target/classes
[INFO] [resources:testResources]
[INFO] Using default encoding to copy filtered resources.
[INFO] [compiler:testCompile]
[INFO] No sources to compile
[INFO] [surefire:test]
[INFO] No tests to run.
[INFO] [jar:jar]
[INFO] Building jar: /home/continuum/data/working-directory/51/core/cocoon-expression-language/cocoon-expression-language-api/target/cocoon-expression-language-api-1.1.0-SNAPSHOT.jar
[INFO] [install:install]
[INFO] Installing /home/continuum/data/working-directory/51/core/cocoon-expression-language/cocoon-expression-language-api/target/cocoon-expression-language-api-1.1.0-SNAPSHOT.jar to /home/continuum/.m2/repository/org/apache/cocoon/cocoon-expression-language-api/1.1.0-SNAPSHOT/cocoon-expression-language-api-1.1.0-SNAPSHOT.jar
[INFO] ----------------------------------------------------------------------------
[INFO] Building Cocoon Pipeline Implementation
[INFO]    task-segment: [clean, install]
[INFO] ----------------------------------------------------------------------------
[INFO] [clean:clean]
[INFO] Deleting directory /home/continuum/data/working-directory/51/core/cocoon-pipeline/cocoon-pipeline-impl/target
[INFO] Deleting directory /home/continuum/data/working-directory/51/core/cocoon-pipeline/cocoon-pipeline-impl/target/classes
[INFO] Deleting directory /home/continuum/data/working-directory/51/core/cocoon-pipeline/cocoon-pipeline-impl/target/test-classes
[INFO] Deleting directory /home/continuum/data/working-directory/51/core/cocoon-pipeline/cocoon-pipeline-impl/target/site
[INFO] [enforcer:enforce-once {execution: enforce-maven}]
[INFO] [resources:resources]
[INFO] Using default encoding to copy filtered resources.
[INFO] [compiler:compile]
[INFO] Compiling 89 source files to /home/continuum/data/working-directory/51/core/cocoon-pipeline/cocoon-pipeline-impl/target/classes
[INFO] [resources:testResources]
[INFO] Using default encoding to copy filtered resources.
[INFO] [compiler:testCompile]
[INFO] Compiling 8 source files to /home/continuum/data/working-directory/51/core/cocoon-pipeline/cocoon-pipeline-impl/target/test-classes
[INFO] [surefire:test]
[INFO] Surefire report directory: /home/continuum/data/working-directory/51/core/cocoon-pipeline/cocoon-pipeline-impl/target/surefire-reports

-------------------------------------------------------
 T E S T S
-------------------------------------------------------
Running org.apache.cocoon.xml.SaxBufferTestCase
consuming: 625000.0 documents per second
parsed:9910.0 documents per second
recalling: 1250000.0 documents per second
Tests run: 3, Failures: 0, Errors: 0, Skipped: 0, Time elapsed: 8.883 sec
Running org.apache.cocoon.xml.dom.DOMBuilderTestCase
Tests run: 1, Failures: 0, Errors: 0, Skipped: 0, Time elapsed: 0.009 sec
Running org.apache.cocoon.components.sax.XMLByteStreamCompilerInterpreterTestCase
consuming: 136986.0 documents per second
parsed: 13717.0 documents per second
recalling: 232558.0 documents per second
Tests run: 4, Failures: 0, Errors: 0, Skipped: 0, Time elapsed: 9.389 sec
Running org.apache.cocoon.xml.dom.DOMBuilderStreamerTestCase
<?xml version="1.0" encoding="UTF-8"?>
<root/>
<?xml version="1.0" encoding="UTF-8"?>
<!--abcd--><root/>
Tests run: 7, Failures: 0, Errors: 0, Skipped: 0, Time elapsed: 0.11 sec

Results :

Tests run: 15, Failures: 0, Errors: 0, Skipped: 0

[INFO] [jar:jar]
[INFO] Building jar: /home/continuum/data/working-directory/51/core/cocoon-pipeline/cocoon-pipeline-impl/target/cocoon-pipeline-impl-1.1.0-SNAPSHOT.jar
[INFO] [jar:test-jar {execution: default}]
[INFO] Building jar: /home/continuum/data/working-directory/51/core/cocoon-pipeline/cocoon-pipeline-impl/target/cocoon-pipeline-impl-1.1.0-SNAPSHOT-tests.jar
[INFO] [install:install]
[INFO] Installing /home/continuum/data/working-directory/51/core/cocoon-pipeline/cocoon-pipeline-impl/target/cocoon-pipeline-impl-1.1.0-SNAPSHOT.jar to /home/continuum/.m2/repository/org/apache/cocoon/cocoon-pipeline-impl/1.1.0-SNAPSHOT/cocoon-pipeline-impl-1.1.0-SNAPSHOT.jar
[INFO] Installing /home/continuum/data/working-directory/51/core/cocoon-pipeline/cocoon-pipeline-impl/target/cocoon-pipeline-impl-1.1.0-SNAPSHOT-tests.jar to /home/continuum/.m2/repository/org/apache/cocoon/cocoon-pipeline-impl/1.1.0-SNAPSHOT/cocoon-pipeline-impl-1.1.0-SNAPSHOT-tests.jar
[INFO] ----------------------------------------------------------------------------
[INFO] Building Cocoon XML Implementation
[INFO]    task-segment: [clean, install]
[INFO] ----------------------------------------------------------------------------
[INFO] [clean:clean]
[INFO] Deleting directory /home/continuum/data/working-directory/51/core/cocoon-xml/cocoon-xml-impl/target
[INFO] Deleting directory /home/continuum/data/working-directory/51/core/cocoon-xml/cocoon-xml-impl/target/classes
[INFO] Deleting directory /home/continuum/data/working-directory/51/core/cocoon-xml/cocoon-xml-impl/target/test-classes
[INFO] Deleting directory /home/continuum/data/working-directory/51/core/cocoon-xml/cocoon-xml-impl/target/site
[INFO] [enforcer:enforce-once {execution: enforce-maven}]
[INFO] [resources:resources]
[INFO] Using default encoding to copy filtered resources.
[INFO] [compiler:compile]
[INFO] Compiling 4 source files to /home/continuum/data/working-directory/51/core/cocoon-xml/cocoon-xml-impl/target/classes
[INFO] [resources:testResources]
[INFO] Using default encoding to copy filtered resources.
[INFO] [compiler:testCompile]
[INFO] No sources to compile
[INFO] [surefire:test]
[INFO] No tests to run.
[INFO] [jar:jar]
[INFO] Building jar: /home/continuum/data/working-directory/51/core/cocoon-xml/cocoon-xml-impl/target/cocoon-xml-impl-1.1.0-SNAPSHOT.jar
[INFO] [install:install]
[INFO] Installing /home/continuum/data/working-directory/51/core/cocoon-xml/cocoon-xml-impl/target/cocoon-xml-impl-1.1.0-SNAPSHOT.jar to /home/continuum/.m2/repository/org/apache/cocoon/cocoon-xml-impl/1.1.0-SNAPSHOT/cocoon-xml-impl-1.1.0-SNAPSHOT.jar
[INFO] ----------------------------------------------------------------------------
[INFO] Building Cocoon Pipeline Components
[INFO]    task-segment: [clean, install]
[INFO] ----------------------------------------------------------------------------
[INFO] [clean:clean]
[INFO] Deleting directory /home/continuum/data/working-directory/51/core/cocoon-pipeline/cocoon-pipeline-components/target
[INFO] Deleting directory /home/continuum/data/working-directory/51/core/cocoon-pipeline/cocoon-pipeline-components/target/classes
[INFO] Deleting directory /home/continuum/data/working-directory/51/core/cocoon-pipeline/cocoon-pipeline-components/target/test-classes
[INFO] Deleting directory /home/continuum/data/working-directory/51/core/cocoon-pipeline/cocoon-pipeline-components/target/site
[INFO] [enforcer:enforce-once {execution: enforce-maven}]
[INFO] [resources:resources]
[INFO] Using default encoding to copy filtered resources.
[INFO] [compiler:compile]
[INFO] Compiling 69 source files to /home/continuum/data/working-directory/51/core/cocoon-pipeline/cocoon-pipeline-components/target/classes
[INFO] [resources:testResources]
[INFO] Using default encoding to copy filtered resources.
[INFO] [compiler:testCompile]
[INFO] Nothing to compile - all classes are up to date
[INFO] [surefire:test]
[INFO] Surefire report directory: /home/continuum/data/working-directory/51/core/cocoon-pipeline/cocoon-pipeline-components/target/surefire-reports

-------------------------------------------------------
 T E S T S
-------------------------------------------------------
There are no tests to run.

Results :

Tests run: 0, Failures: 0, Errors: 0, Skipped: 0

[INFO] [jar:jar]
[INFO] Building jar: /home/continuum/data/working-directory/51/core/cocoon-pipeline/cocoon-pipeline-components/target/cocoon-pipeline-components-1.1.0-SNAPSHOT.jar
[INFO] [install:install]
[INFO] Installing /home/continuum/data/working-directory/51/core/cocoon-pipeline/cocoon-pipeline-components/target/cocoon-pipeline-components-1.1.0-SNAPSHOT.jar to /home/continuum/.m2/repository/org/apache/cocoon/cocoon-pipeline-components/1.1.0-SNAPSHOT/cocoon-pipeline-components-1.1.0-SNAPSHOT.jar
[INFO] ----------------------------------------------------------------------------
[INFO] Building Cocoon Sitemap API
[INFO]    task-segment: [clean, install]
[INFO] ----------------------------------------------------------------------------
[INFO] [clean:clean]
[INFO] Deleting directory /home/continuum/data/working-directory/51/core/cocoon-sitemap/cocoon-sitemap-api/target
[INFO] Deleting directory /home/continuum/data/working-directory/51/core/cocoon-sitemap/cocoon-sitemap-api/target/classes
[INFO] Deleting directory /home/continuum/data/working-directory/51/core/cocoon-sitemap/cocoon-sitemap-api/target/test-classes
[INFO] Deleting directory /home/continuum/data/working-directory/51/core/cocoon-sitemap/cocoon-sitemap-api/target/site
[INFO] [enforcer:enforce-once {execution: enforce-maven}]
[INFO] [resources:resources]
[INFO] Using default encoding to copy filtered resources.
[INFO] [compiler:compile]
[INFO] Compiling 29 source files to /home/continuum/data/working-directory/51/core/cocoon-sitemap/cocoon-sitemap-api/target/classes
[INFO] [resources:testResources]
[INFO] Using default encoding to copy filtered resources.
[INFO] [compiler:testCompile]
[INFO] No sources to compile
[INFO] [surefire:test]
[INFO] No tests to run.
[INFO] [jar:jar]
[INFO] Building jar: /home/continuum/data/working-directory/51/core/cocoon-sitemap/cocoon-sitemap-api/target/cocoon-sitemap-api-1.1.0-SNAPSHOT.jar
[INFO] [install:install]
[INFO] Installing /home/continuum/data/working-directory/51/core/cocoon-sitemap/cocoon-sitemap-api/target/cocoon-sitemap-api-1.1.0-SNAPSHOT.jar to /home/continuum/.m2/repository/org/apache/cocoon/cocoon-sitemap-api/1.1.0-SNAPSHOT/cocoon-sitemap-api-1.1.0-SNAPSHOT.jar
[INFO] ----------------------------------------------------------------------------
[INFO] Building Cocoon XML Utilities
[INFO]    task-segment: [clean, install]
[INFO] ----------------------------------------------------------------------------
[INFO] [clean:clean]
[INFO] Deleting directory /home/continuum/data/working-directory/51/core/cocoon-xml/cocoon-xml-util/target
[INFO] Deleting directory /home/continuum/data/working-directory/51/core/cocoon-xml/cocoon-xml-util/target/classes
[INFO] Deleting directory /home/continuum/data/working-directory/51/core/cocoon-xml/cocoon-xml-util/target/test-classes
[INFO] Deleting directory /home/continuum/data/working-directory/51/core/cocoon-xml/cocoon-xml-util/target/site
[INFO] [enforcer:enforce-once {execution: enforce-maven}]
[INFO] [resources:resources]
[INFO] Using default encoding to copy filtered resources.
[INFO] [compiler:compile]
[INFO] Compiling 2 source files to /home/continuum/data/working-directory/51/core/cocoon-xml/cocoon-xml-util/target/classes
[INFO] [resources:testResources]
[INFO] Using default encoding to copy filtered resources.
[INFO] [compiler:testCompile]
[INFO] Compiling 1 source file to /home/continuum/data/working-directory/51/core/cocoon-xml/cocoon-xml-util/target/test-classes
[INFO] [surefire:test]
[INFO] Surefire report directory: /home/continuum/data/working-directory/51/core/cocoon-xml/cocoon-xml-util/target/surefire-reports

-------------------------------------------------------
 T E S T S
-------------------------------------------------------
Running org.apache.cocoon.xml.util.NamespacesTableTestCase
Tests run: 6, Failures: 0, Errors: 0, Skipped: 0, Time elapsed: 0.049 sec

Results :

Tests run: 6, Failures: 0, Errors: 0, Skipped: 0

[INFO] [jar:jar]
[INFO] Building jar: /home/continuum/data/working-directory/51/core/cocoon-xml/cocoon-xml-util/target/cocoon-xml-util-1.1.0-SNAPSHOT.jar
[INFO] [install:install]
[INFO] Installing /home/continuum/data/working-directory/51/core/cocoon-xml/cocoon-xml-util/target/cocoon-xml-util-1.1.0-SNAPSHOT.jar to /home/continuum/.m2/repository/org/apache/cocoon/cocoon-xml-util/1.1.0-SNAPSHOT/cocoon-xml-util-1.1.0-SNAPSHOT.jar
[INFO] ----------------------------------------------------------------------------
[INFO] Building Cocoon Expression Language Implementation.
[INFO]    task-segment: [clean, install]
[INFO] ----------------------------------------------------------------------------
[INFO] [clean:clean]
[INFO] Deleting directory /home/continuum/data/working-directory/51/core/cocoon-expression-language/cocoon-expression-language-impl/target
[INFO] Deleting directory /home/continuum/data/working-directory/51/core/cocoon-expression-language/cocoon-expression-language-impl/target/classes
[INFO] Deleting directory /home/continuum/data/working-directory/51/core/cocoon-expression-language/cocoon-expression-language-impl/target/test-classes
[INFO] Deleting directory /home/continuum/data/working-directory/51/core/cocoon-expression-language/cocoon-expression-language-impl/target/site
[INFO] [enforcer:enforce-once {execution: enforce-maven}]
[INFO] [resources:resources]
[INFO] Using default encoding to copy filtered resources.
[INFO] [compiler:compile]
[INFO] Compiling 21 source files to /home/continuum/data/working-directory/51/core/cocoon-expression-language/cocoon-expression-language-impl/target/classes
[INFO] [resources:testResources]
[INFO] Using default encoding to copy filtered resources.
[INFO] [compiler:testCompile]
[INFO] Compiling 5 source files to /home/continuum/data/working-directory/51/core/cocoon-expression-language/cocoon-expression-language-impl/target/test-classes
[INFO] [surefire:test]
[INFO] Surefire report directory: /home/continuum/data/working-directory/51/core/cocoon-expression-language/cocoon-expression-language-impl/target/surefire-reports

-------------------------------------------------------
 T E S T S
-------------------------------------------------------
Running org.apache.cocoon.el.impl.jxpath.JXPathTestCase
Tests run: 1, Failures: 0, Errors: 0, Skipped: 0, Time elapsed: 0.224 sec
Running org.apache.cocoon.el.impl.DefaultExpressionFactoryTestCase
log4j:WARN No appenders could be found for logger (org.apache.commons.jexl.ExpressionFactory).
log4j:WARN Please initialize the log4j system properly.
Tests run: 3, Failures: 0, Errors: 0, Skipped: 0, Time elapsed: 0.142 sec
Running org.apache.cocoon.el.impl.jexl.JexlTestCase
Tests run: 3, Failures: 0, Errors: 0, Skipped: 0, Time elapsed: 0.014 sec
Running org.apache.cocoon.el.impl.objectmodel.ObjectModelImplTestCase
Tests run: 12, Failures: 0, Errors: 0, Skipped: 0, Time elapsed: 0.05 sec
Running org.apache.cocoon.el.impl.javascript.JavaScriptTestCase
Tests run: 3, Failures: 0, Errors: 0, Skipped: 0, Time elapsed: 0.316 sec

Results :

Tests run: 22, Failures: 0, Errors: 0, Skipped: 0

[INFO] [jar:jar]
[INFO] Building jar: /home/continuum/data/working-directory/51/core/cocoon-expression-language/cocoon-expression-language-impl/target/cocoon-expression-language-impl-1.1.0-SNAPSHOT.jar
[INFO] [install:install]
[INFO] Installing /home/continuum/data/working-directory/51/core/cocoon-expression-language/cocoon-expression-language-impl/target/cocoon-expression-language-impl-1.1.0-SNAPSHOT.jar to /home/continuum/.m2/repository/org/apache/cocoon/cocoon-expression-language-impl/1.1.0-SNAPSHOT/cocoon-expression-language-impl-1.1.0-SNAPSHOT.jar
[INFO] ----------------------------------------------------------------------------
[INFO] Building Cocoon Thread API
[INFO]    task-segment: [clean, install]
[INFO] ----------------------------------------------------------------------------
[INFO] [clean:clean]
[INFO] Deleting directory /home/continuum/data/working-directory/51/core/cocoon-thread/cocoon-thread-api/target
[INFO] Deleting directory /home/continuum/data/working-directory/51/core/cocoon-thread/cocoon-thread-api/target/classes
[INFO] Deleting directory /home/continuum/data/working-directory/51/core/cocoon-thread/cocoon-thread-api/target/test-classes
[INFO] Deleting directory /home/continuum/data/working-directory/51/core/cocoon-thread/cocoon-thread-api/target/site
[INFO] [enforcer:enforce-once {execution: enforce-maven}]
[INFO] [resources:resources]
[INFO] Using default encoding to copy filtered resources.
[INFO] [compiler:compile]
[INFO] Compiling 3 source files to /home/continuum/data/working-directory/51/core/cocoon-thread/cocoon-thread-api/target/classes
[INFO] [resources:testResources]
[INFO] Using default encoding to copy filtered resources.
[INFO] [compiler:testCompile]
[INFO] No sources to compile
[INFO] [surefire:test]
[INFO] No tests to run.
[INFO] [jar:jar]
[INFO] Building jar: /home/continuum/data/working-directory/51/core/cocoon-thread/cocoon-thread-api/target/cocoon-thread-api-1.1.0-SNAPSHOT.jar
[INFO] [install:install]
[INFO] Installing /home/continuum/data/working-directory/51/core/cocoon-thread/cocoon-thread-api/target/cocoon-thread-api-1.1.0-SNAPSHOT.jar to /home/continuum/.m2/repository/org/apache/cocoon/cocoon-thread-api/1.1.0-SNAPSHOT/cocoon-thread-api-1.1.0-SNAPSHOT.jar
[INFO] ----------------------------------------------------------------------------
[INFO] Building Cocoon Sitemap Implementation
[INFO]    task-segment: [clean, install]
[INFO] ----------------------------------------------------------------------------
[INFO] [clean:clean]
[INFO] Deleting directory /home/continuum/data/working-directory/51/core/cocoon-sitemap/cocoon-sitemap-impl/target
[INFO] Deleting directory /home/continuum/data/working-directory/51/core/cocoon-sitemap/cocoon-sitemap-impl/target/classes
[INFO] Deleting directory /home/continuum/data/working-directory/51/core/cocoon-sitemap/cocoon-sitemap-impl/target/test-classes
[INFO] Deleting directory /home/continuum/data/working-directory/51/core/cocoon-sitemap/cocoon-sitemap-impl/target/site
[INFO] [enforcer:enforce-once {execution: enforce-maven}]
[INFO] [resources:resources]
[INFO] Using default encoding to copy filtered resources.
[INFO] [compiler:compile]
[INFO] Compiling 185 source files to /home/continuum/data/working-directory/51/core/cocoon-sitemap/cocoon-sitemap-impl/target/classes
[INFO] [resources:testResources]
[INFO] Using default encoding to copy filtered resources.
[INFO] [compiler:testCompile]
[INFO] Compiling 11 source files to /home/continuum/data/working-directory/51/core/cocoon-sitemap/cocoon-sitemap-impl/target/test-classes
[INFO] [surefire:test]
[INFO] Surefire report directory: /home/continuum/data/working-directory/51/core/cocoon-sitemap/cocoon-sitemap-impl/target/surefire-reports

-------------------------------------------------------
 T E S T S
-------------------------------------------------------
Running org.apache.cocoon.environment.FOMTestCase
log4j:WARN No appenders could be found for logger (org.springframework.util.ClassUtils).
log4j:WARN Please initialize the log4j system properly.
Tests run: 2, Failures: 0, Errors: 0, Skipped: 0, Time elapsed: 3.104 sec

Results :

Tests run: 2, Failures: 0, Errors: 0, Skipped: 0

[INFO] [jar:jar]
[INFO] Building jar: /home/continuum/data/working-directory/51/core/cocoon-sitemap/cocoon-sitemap-impl/target/cocoon-sitemap-impl-1.1.0-SNAPSHOT.jar
[INFO] [jar:test-jar {execution: default}]
[INFO] Building jar: /home/continuum/data/working-directory/51/core/cocoon-sitemap/cocoon-sitemap-impl/target/cocoon-sitemap-impl-1.1.0-SNAPSHOT-tests.jar
[INFO] [install:install]
[INFO] Installing /home/continuum/data/working-directory/51/core/cocoon-sitemap/cocoon-sitemap-impl/target/cocoon-sitemap-impl-1.1.0-SNAPSHOT.jar to /home/continuum/.m2/repository/org/apache/cocoon/cocoon-sitemap-impl/1.1.0-SNAPSHOT/cocoon-sitemap-impl-1.1.0-SNAPSHOT.jar
[INFO] Installing /home/continuum/data/working-directory/51/core/cocoon-sitemap/cocoon-sitemap-impl/target/cocoon-sitemap-impl-1.1.0-SNAPSHOT-tests.jar to /home/continuum/.m2/repository/org/apache/cocoon/cocoon-sitemap-impl/1.1.0-SNAPSHOT/cocoon-sitemap-impl-1.1.0-SNAPSHOT-tests.jar
[INFO] ----------------------------------------------------------------------------
[INFO] Building Cocoon Sitemap Components
[INFO]    task-segment: [clean, install]
[INFO] ----------------------------------------------------------------------------
[INFO] [clean:clean]
[INFO] Deleting directory /home/continuum/data/working-directory/51/core/cocoon-sitemap/cocoon-sitemap-components/target
[INFO] Deleting directory /home/continuum/data/working-directory/51/core/cocoon-sitemap/cocoon-sitemap-components/target/classes
[INFO] Deleting directory /home/continuum/data/working-directory/51/core/cocoon-sitemap/cocoon-sitemap-components/target/test-classes
[INFO] Deleting directory /home/continuum/data/working-directory/51/core/cocoon-sitemap/cocoon-sitemap-components/target/site
[INFO] [enforcer:enforce-once {execution: enforce-maven}]
[INFO] [resources:resources]
[INFO] Using default encoding to copy filtered resources.
[INFO] [compiler:compile]
[INFO] Compiling 108 source files to /home/continuum/data/working-directory/51/core/cocoon-sitemap/cocoon-sitemap-components/target/classes
[INFO] [resources:testResources]
[INFO] Using default encoding to copy filtered resources.
[INFO] [compiler:testCompile]
[INFO] Nothing to compile - all classes are up to date
[INFO] [surefire:test]
[INFO] Surefire report directory: /home/continuum/data/working-directory/51/core/cocoon-sitemap/cocoon-sitemap-components/target/surefire-reports

-------------------------------------------------------
 T E S T S
-------------------------------------------------------
There are no tests to run.

Results :

Tests run: 0, Failures: 0, Errors: 0, Skipped: 0

[INFO] [jar:jar]
[INFO] Building jar: /home/continuum/data/working-directory/51/core/cocoon-sitemap/cocoon-sitemap-components/target/cocoon-sitemap-components-1.1.0-SNAPSHOT.jar
[INFO] [install:install]
[INFO] Installing /home/continuum/data/working-directory/51/core/cocoon-sitemap/cocoon-sitemap-components/target/cocoon-sitemap-components-1.1.0-SNAPSHOT.jar to /home/continuum/.m2/repository/org/apache/cocoon/cocoon-sitemap-components/1.1.0-SNAPSHOT/cocoon-sitemap-components-1.1.0-SNAPSHOT.jar
[INFO] ----------------------------------------------------------------------------
[INFO] Building Cocoon XML Resolver
[INFO]    task-segment: [clean, install]
[INFO] ----------------------------------------------------------------------------
[INFO] [clean:clean]
[INFO] Deleting directory /home/continuum/data/working-directory/51/core/cocoon-xml/cocoon-xml-resolver/target
[INFO] Deleting directory /home/continuum/data/working-directory/51/core/cocoon-xml/cocoon-xml-resolver/target/classes
[INFO] Deleting directory /home/continuum/data/working-directory/51/core/cocoon-xml/cocoon-xml-resolver/target/test-classes
[INFO] Deleting directory /home/continuum/data/working-directory/51/core/cocoon-xml/cocoon-xml-resolver/target/site
[INFO] [enforcer:enforce-once {execution: enforce-maven}]
[INFO] [resources:resources]
[INFO] Using default encoding to copy filtered resources.
[INFO] [compiler:compile]
[INFO] Compiling 1 source file to /home/continuum/data/working-directory/51/core/cocoon-xml/cocoon-xml-resolver/target/classes
[INFO] [resources:testResources]
[INFO] Using default encoding to copy filtered resources.
[INFO] [compiler:testCompile]
[INFO] No sources to compile
[INFO] [surefire:test]
[INFO] No tests to run.
[INFO] [jar:jar]
[INFO] Building jar: /home/continuum/data/working-directory/51/core/cocoon-xml/cocoon-xml-resolver/target/cocoon-xml-resolver-1.1.0-SNAPSHOT.jar
[INFO] [install:install]
[INFO] Installing /home/continuum/data/working-directory/51/core/cocoon-xml/cocoon-xml-resolver/target/cocoon-xml-resolver-1.1.0-SNAPSHOT.jar to /home/continuum/.m2/repository/org/apache/cocoon/cocoon-xml-resolver/1.1.0-SNAPSHOT/cocoon-xml-resolver-1.1.0-SNAPSHOT.jar
[INFO] ----------------------------------------------------------------------------
[INFO] Building Cocoon Store Implementation
[INFO]    task-segment: [clean, install]
[INFO] ----------------------------------------------------------------------------
[INFO] [clean:clean]
[INFO] Deleting directory /home/continuum/data/working-directory/51/core/cocoon-store/cocoon-store-impl/target
[INFO] Deleting directory /home/continuum/data/working-directory/51/core/cocoon-store/cocoon-store-impl/target/classes
[INFO] Deleting directory /home/continuum/data/working-directory/51/core/cocoon-store/cocoon-store-impl/target/test-classes
[INFO] Deleting directory /home/continuum/data/working-directory/51/core/cocoon-store/cocoon-store-impl/target/site
[INFO] [enforcer:enforce-once {execution: enforce-maven}]
[INFO] [resources:resources]
[INFO] Using default encoding to copy filtered resources.
[INFO] [compiler:compile]
[INFO] Compiling 7 source files to /home/continuum/data/working-directory/51/core/cocoon-store/cocoon-store-impl/target/classes
[INFO] [resources:testResources]
[INFO] Using default encoding to copy filtered resources.
[INFO] [compiler:testCompile]
[INFO] No sources to compile
[INFO] [surefire:test]
[INFO] No tests to run.
[INFO] [jar:jar]
[INFO] Building jar: /home/continuum/data/working-directory/51/core/cocoon-store/cocoon-store-impl/target/cocoon-store-impl-1.1.0-SNAPSHOT.jar
[INFO] [install:install]
[INFO] Installing /home/continuum/data/working-directory/51/core/cocoon-store/cocoon-store-impl/target/cocoon-store-impl-1.1.0-SNAPSHOT.jar to /home/continuum/.m2/repository/org/apache/cocoon/cocoon-store-impl/1.1.0-SNAPSHOT/cocoon-store-impl-1.1.0-SNAPSHOT.jar
[INFO] ----------------------------------------------------------------------------
[INFO] Building Cocoon Thread Implementation
[INFO]    task-segment: [clean, install]
[INFO] ----------------------------------------------------------------------------
[INFO] [clean:clean]
[INFO] Deleting directory /home/continuum/data/working-directory/51/core/cocoon-thread/cocoon-thread-impl/target
[INFO] Deleting directory /home/continuum/data/working-directory/51/core/cocoon-thread/cocoon-thread-impl/target/classes
[INFO] Deleting directory /home/continuum/data/working-directory/51/core/cocoon-thread/cocoon-thread-impl/target/test-classes
[INFO] Deleting directory /home/continuum/data/working-directory/51/core/cocoon-thread/cocoon-thread-impl/target/site
[INFO] [enforcer:enforce-once {execution: enforce-maven}]
[INFO] [resources:resources]
[INFO] Using default encoding to copy filtered resources.
[INFO] [compiler:compile]
[INFO] Compiling 8 source files to /home/continuum/data/working-directory/51/core/cocoon-thread/cocoon-thread-impl/target/classes
[INFO] [resources:testResources]
[INFO] Using default encoding to copy filtered resources.
[INFO] [compiler:testCompile]
[INFO] Compiling 4 source files to /home/continuum/data/working-directory/51/core/cocoon-thread/cocoon-thread-impl/target/test-classes
[INFO] [surefire:test]
[INFO] Surefire report directory: /home/continuum/data/working-directory/51/core/cocoon-thread/cocoon-thread-impl/target/surefire-reports

-------------------------------------------------------
 T E S T S
-------------------------------------------------------
Running org.apache.cocoon.thread.impl.DefaultThreadPoolTestCase
log4j:WARN No appenders could be found for logger (org.apache.cocoon.thread.impl.DefaultThreadPool).
log4j:WARN Please initialize the log4j system properly.
Tests run: 3, Failures: 0, Errors: 0, Skipped: 0, Time elapsed: 0.895 sec
Running org.apache.cocoon.thread.impl.DefaultRunnableManagerTestCase
Tests run: 11, Failures: 0, Errors: 0, Skipped: 0, Time elapsed: 0.024 sec
Running org.apache.cocoon.thread.impl.DefaultThreadFactoryTestCase
Tests run: 5, Failures: 0, Errors: 0, Skipped: 0, Time elapsed: 0.01 sec

Results :

Tests run: 19, Failures: 0, Errors: 0, Skipped: 0

[INFO] [jar:jar]
[INFO] Building jar: /home/continuum/data/working-directory/51/core/cocoon-thread/cocoon-thread-impl/target/cocoon-thread-impl-1.1.0-SNAPSHOT.jar
[INFO] [install:install]
[INFO] Installing /home/continuum/data/working-directory/51/core/cocoon-thread/cocoon-thread-impl/target/cocoon-thread-impl-1.1.0-SNAPSHOT.jar to /home/continuum/.m2/repository/org/apache/cocoon/cocoon-thread-impl/1.1.0-SNAPSHOT/cocoon-thread-impl-1.1.0-SNAPSHOT.jar
[INFO] ----------------------------------------------------------------------------
[INFO] Building Cocoon Core
[INFO]    task-segment: [clean, install]
[INFO] ----------------------------------------------------------------------------
[INFO] [clean:clean]
[INFO] Deleting directory /home/continuum/data/working-directory/51/core/cocoon-core/target
[INFO] Deleting directory /home/continuum/data/working-directory/51/core/cocoon-core/target/classes
[INFO] Deleting directory /home/continuum/data/working-directory/51/core/cocoon-core/target/test-classes
[INFO] Deleting directory /home/continuum/data/working-directory/51/core/cocoon-core/target/site
[INFO] [enforcer:enforce-once {execution: enforce-maven}]
[INFO] [resources:resources]
[INFO] Using default encoding to copy filtered resources.
[INFO] [compiler:compile]
[INFO] Compiling 84 source files to /home/continuum/data/working-directory/51/core/cocoon-core/target/classes
[INFO] [resources:testResources]
[INFO] Using default encoding to copy filtered resources.
[INFO] [compiler:testCompile]
[INFO] Compiling 51 source files to /home/continuum/data/working-directory/51/core/cocoon-core/target/test-classes
[INFO] [surefire:test]
[INFO] Surefire report directory: /home/continuum/data/working-directory/51/core/cocoon-core/target/surefire-reports

-------------------------------------------------------
 T E S T S
-------------------------------------------------------
Running org.apache.cocoon.matching.RegexpURIMatcherTestCase
log4j:WARN No appenders could be found for logger (org.springframework.util.ClassUtils).
log4j:WARN Please initialize the log4j system properly.
{2=null, 0=test/foo/bla/end, 1=test/foo/bla/end}
{3=null, 2=end, 0=test/foo/bla/end, 1=test/foo}
Tests run: 1, Failures: 0, Errors: 0, Skipped: 0, Time elapsed: 0.859 sec
Running org.apache.cocoon.acting.RequestParamActionTestCase
Tests run: 1, Failures: 0, Errors: 0, Skipped: 0, Time elapsed: 0.011 sec
Running org.apache.cocoon.selection.HeaderSelectorTestCase
true
false
true
false
Tests run: 2, Failures: 0, Errors: 0, Skipped: 0, Time elapsed: 0.159 sec
Running org.apache.cocoon.transformation.FilterTransformerTestCase
Tests run: 3, Failures: 0, Errors: 0, Skipped: 0, Time elapsed: 0.426 sec
Running org.apache.cocoon.core.container.util.PropertyHelperTestCase
Tests run: 1, Failures: 0, Errors: 0, Skipped: 0, Time elapsed: 0.004 sec
Running org.apache.cocoon.generation.FileGeneratorTestCase
Tests run: 1, Failures: 0, Errors: 0, Skipped: 0, Time elapsed: 0.064 sec
Running org.apache.cocoon.transformation.XAbstractDOMTransformerTestCase
Tests run: 1, Failures: 0, Errors: 0, Skipped: 0, Time elapsed: 0.021 sec
Running org.apache.cocoon.selection.RegexpHeaderSelectorTestCase
true
false
false
false
false
true
false
Tests run: 2, Failures: 0, Errors: 0, Skipped: 0, Time elapsed: 0.198 sec
Running org.apache.cocoon.selection.CookieSelectorTestCase
true
false
true
false
Tests run: 2, Failures: 0, Errors: 0, Skipped: 0, Time elapsed: 0.091 sec
Running org.apache.cocoon.selection.SimpleSelectorTestCase
false
false
true
false
Tests run: 2, Failures: 0, Errors: 0, Skipped: 0, Time elapsed: 0.144 sec
Running org.apache.cocoon.generation.FileGeneratorBeanTestCase
Tests run: 1, Failures: 0, Errors: 0, Skipped: 0, Time elapsed: 0.039 sec
Running org.apache.cocoon.selection.HostSelectorTestCase
true
false
false
false
Tests run: 2, Failures: 0, Errors: 0, Skipped: 0, Time elapsed: 0.087 sec
Running org.apache.cocoon.transformation.EncodeURLTransformerTestCase
resultDocument
<?xml version="1.0" encoding="UTF-8"?>
<!--
  Licensed to the Apache Software Foundation (ASF) under one or more
  contributor license agreements.  See the NOTICE file distributed with
  this work for additional information regarding copyright ownership.
  The ASF licenses this file to You under the Apache License, Version 2.0
  (the "License"); you may not use this file except in compliance with
  the License.  You may obtain a copy of the License at

      http://www.apache.org/licenses/LICENSE-2.0

  Unless required by applicable law or agreed to in writing, software
  distributed under the License is distributed on an "AS IS" BASIS,
  WITHOUT WARRANTIES OR CONDITIONS OF ANY KIND, either express or implied.
  See the License for the specific language governing permissions and
  limitations under the License.
--><root><x>X</x><a>A</a><a b="c">d</a><a href="x">x</a></root>
inputDocument
<?xml version="1.0" encoding="UTF-8"?>
<!--
  Licensed to the Apache Software Foundation (ASF) under one or more
  contributor license agreements.  See the NOTICE file distributed with
  this work for additional information regarding copyright ownership.
  The ASF licenses this file to You under the Apache License, Version 2.0
  (the "License"); you may not use this file except in compliance with
  the License.  You may obtain a copy of the License at

      http://www.apache.org/licenses/LICENSE-2.0

  Unless required by applicable law or agreed to in writing, software
  distributed under the License is distributed on an "AS IS" BASIS,
  WITHOUT WARRANTIES OR CONDITIONS OF ANY KIND, either express or implied.
  See the License for the specific language governing permissions and
  limitations under the License.
--><root><x>X</x><a>A</a><a b="c">d</a><a href="x">x</a></root>
transformDocument
<?xml version="1.0" encoding="UTF-8"?>
<root><x>X</x><a>A</a><a b="c">d</a><a href="x">x</a></root>
resultDocument
<?xml version="1.0" encoding="UTF-8"?>
<!--
  Licensed to the Apache Software Foundation (ASF) under one or more
  contributor license agreements.  See the NOTICE file distributed with
  this work for additional information regarding copyright ownership.
  The ASF licenses this file to You under the Apache License, Version 2.0
  (the "License"); you may not use this file except in compliance with
  the License.  You may obtain a copy of the License at

      http://www.apache.org/licenses/LICENSE-2.0

  Unless required by applicable law or agreed to in writing, software
  distributed under the License is distributed on an "AS IS" BASIS,
  WITHOUT WARRANTIES OR CONDITIONS OF ANY KIND, either express or implied.
  See the License for the specific language governing permissions and
  limitations under the License.
--><root><x>X</x><a>A</a><a b="c">d</a><a href="x?JSESSIONID=MockSession">x</a><img src="img/src must not be encoded"/><a href="href must be encoded?JSESSIONID=MockSession"/><form action="action must be encoded?JSESSIONID=MockSession"/></root>
inputDocument
<?xml version="1.0" encoding="UTF-8"?>
<!--
  Licensed to the Apache Software Foundation (ASF) under one or more
  contributor license agreements.  See the NOTICE file distributed with
  this work for additional information regarding copyright ownership.
  The ASF licenses this file to You under the Apache License, Version 2.0
  (the "License"); you may not use this file except in compliance with
  the License.  You may obtain a copy of the License at

      http://www.apache.org/licenses/LICENSE-2.0

  Unless required by applicable law or agreed to in writing, software
  distributed under the License is distributed on an "AS IS" BASIS,
  WITHOUT WARRANTIES OR CONDITIONS OF ANY KIND, either express or implied.
  See the License for the specific language governing permissions and
  limitations under the License.
--><root><x>X</x><a>A</a><a b="c">d</a><a href="x">x</a><img src="img/src must not be encoded"/><a href="href must be encoded"/><form action="action must be encoded"/></root>
transformDocument
<?xml version="1.0" encoding="UTF-8"?>
<root><x>X</x><a>A</a><a b="c">d</a><a href="x?JSESSIONID=MockSession">x</a><img src="img/src must not be encoded"/><a href="href must be encoded?JSESSIONID=MockSession"/><form action="action must be encoded?JSESSIONID=MockSession"/></root>
Tests run: 2, Failures: 0, Errors: 0, Skipped: 0, Time elapsed: 0.363 sec
Running org.apache.cocoon.transformation.CIncludeTransformerTestCase
Tests run: 3, Failures: 0, Errors: 0, Skipped: 0, Time elapsed: 0.397 sec
Running org.apache.cocoon.matching.RequestAttributeMatcherTestCase
{1=requestAttributeMatchTestCaseValue}
Tests run: 2, Failures: 0, Errors: 0, Skipped: 0, Time elapsed: 0.066 sec
Running org.apache.cocoon.acting.ResourceExistsActionTestCase
Tests run: 2, Failures: 0, Errors: 0, Skipped: 0, Time elapsed: 0.02 sec
Running org.apache.cocoon.matching.RequestParameterMatcherTestCase
{1=requestParameterMatchTestCaseValue}
Tests run: 2, Failures: 0, Errors: 0, Skipped: 0, Time elapsed: 0.123 sec
Running org.apache.cocoon.components.source.impl.CachingSourceTestCase
Tests run: 6, Failures: 0, Errors: 0, Skipped: 0, Time elapsed: 12.674 sec
Running org.apache.cocoon.transformation.TraxTransformerTestCase
Tests run: 2, Failures: 0, Errors: 0, Skipped: 0, Time elapsed: 2.219 sec
Running org.apache.cocoon.matching.SessionAttributeMatcherTestCase
{1=sessionAttributeMatchTestCaseValue}
Tests run: 2, Failures: 0, Errors: 0, Skipped: 0, Time elapsed: 0.058 sec
Running org.apache.cocoon.transformation.I18NTransformerTestCase
Tests run: 2, Failures: 0, Errors: 0, Skipped: 0, Time elapsed: 0.394 sec
Running org.apache.cocoon.selection.ExceptionSelectorTestCase
true
false
false
true
false
true
Tests run: 4, Failures: 0, Errors: 0, Skipped: 0, Time elapsed: 0.11 sec
Running org.apache.cocoon.selection.RequestAttributeSelectorTestCase
true
false
true
false
Tests run: 2, Failures: 0, Errors: 0, Skipped: 0, Time elapsed: 0.049 sec
Running org.apache.cocoon.selection.ParameterSelectorTestCase
true
false
false
false
Tests run: 2, Failures: 0, Errors: 0, Skipped: 0, Time elapsed: 0.05 sec
Running org.apache.cocoon.components.treeprocessor.variables.PreparedVariableResolverTestCase
Tests run: 14, Failures: 0, Errors: 0, Skipped: 0, Time elapsed: 6.339 sec
Running org.apache.cocoon.acting.LocaleActionTestCase
Tests run: 2, Failures: 0, Errors: 0, Skipped: 0, Time elapsed: 0.08 sec
Running org.apache.cocoon.selection.RegexpRequestParameterSelectorTestCase
true
false
false
false
true
false
Tests run: 2, Failures: 0, Errors: 0, Skipped: 0, Time elapsed: 0.128 sec
Running org.apache.cocoon.matching.HeaderMatcherTestCase
{1=headerMatchTestCaseValue}
Tests run: 2, Failures: 0, Errors: 0, Skipped: 0, Time elapsed: 0.049 sec
Running org.apache.cocoon.selection.RequestMethodSelectorTestCase
true
false
false
Tests run: 1, Failures: 0, Errors: 0, Skipped: 0, Time elapsed: 0.026 sec
Running org.apache.cocoon.xml.ParamSaxBufferTestCase
Tests run: 3, Failures: 0, Errors: 0, Skipped: 0, Time elapsed: 0.008 sec
Running org.apache.cocoon.matching.WildcardURIMatcherTestCase
Tests run: 3, Failures: 0, Errors: 0, Skipped: 0, Time elapsed: 0.183 sec
Running org.apache.cocoon.selection.BrowserSelectorTestCase
false
true
false
Tests run: 2, Failures: 0, Errors: 0, Skipped: 0, Time elapsed: 0.046 sec
Running org.apache.cocoon.selection.RequestParameterSelectorTestCase
true
false
true
false
Tests run: 2, Failures: 0, Errors: 0, Skipped: 0, Time elapsed: 0.048 sec
Running org.apache.cocoon.selection.SessionAttributeSelectorTestCase
true
false
true
false
false
Tests run: 3, Failures: 0, Errors: 0, Skipped: 0, Time elapsed: 0.083 sec
Running org.apache.cocoon.selection.ResourceExistsSelectorTestCase
true
false
true
false
Tests run: 2, Failures: 0, Errors: 0, Skipped: 0, Time elapsed: 0.055 sec
Running org.apache.cocoon.transformation.AugmentTransformerTestCase
resultDocument
<?xml version="1.0" encoding="UTF-8"?>
<!--
  Licensed to the Apache Software Foundation (ASF) under one or more
  contributor license agreements.  See the NOTICE file distributed with
  this work for additional information regarding copyright ownership.
  The ASF licenses this file to You under the Apache License, Version 2.0
  (the "License"); you may not use this file except in compliance with
  the License.  You may obtain a copy of the License at

      http://www.apache.org/licenses/LICENSE-2.0

  Unless required by applicable law or agreed to in writing, software
  distributed under the License is distributed on an "AS IS" BASIS,
  WITHOUT WARRANTIES OR CONDITIONS OF ANY KIND, either express or implied.
  See the License for the specific language governing permissions and
  limitations under the License.
--><root><x>X</x><a>A</a><a b="c">d</a><a href="http://null/portal1/sect1/x">x</a></root>
inputDocument
<?xml version="1.0" encoding="UTF-8"?>
<!--
  Licensed to the Apache Software Foundation (ASF) under one or more
  contributor license agreements.  See the NOTICE file distributed with
  this work for additional information regarding copyright ownership.
  The ASF licenses this file to You under the Apache License, Version 2.0
  (the "License"); you may not use this file except in compliance with
  the License.  You may obtain a copy of the License at

      http://www.apache.org/licenses/LICENSE-2.0

  Unless required by applicable law or agreed to in writing, software
  distributed under the License is distributed on an "AS IS" BASIS,
  WITHOUT WARRANTIES OR CONDITIONS OF ANY KIND, either express or implied.
  See the License for the specific language governing permissions and
  limitations under the License.
--><root><x>X</x><a>A</a><a b="c">d</a><a href="x">x</a></root>
transformDocument
<?xml version="1.0" encoding="UTF-8"?>
<root><x>X</x><a>A</a><a b="c">d</a><a href="http://null/portal1/sect1/x">x</a></root>
Tests run: 1, Failures: 0, Errors: 0, Skipped: 0, Time elapsed: 0.072 sec
Running org.apache.cocoon.components.source.impl.ZipSourceTestCase
Tests run: 1, Failures: 0, Errors: 0, Skipped: 0, Time elapsed: 0.045 sec
Running org.apache.cocoon.matching.ParameterMatcherTestCase
{1=parameterMatchTestCaseValue}
Tests run: 2, Failures: 0, Errors: 0, Skipped: 0, Time elapsed: 0.051 sec
Running org.apache.cocoon.transformation.XIncludeTransformerTestCase
Tests run: 6, Failures: 0, Errors: 0, Skipped: 0, Time elapsed: 0.354 sec
Running org.apache.cocoon.matching.CookieMatcherTestCase
{1=cookieValue}
null
Tests run: 2, Failures: 0, Errors: 0, Skipped: 0, Time elapsed: 0.155 sec

Results :

Tests run: 98, Failures: 0, Errors: 0, Skipped: 0

[INFO] [jar:jar]
[INFO] Building jar: /home/continuum/data/working-directory/51/core/cocoon-core/target/cocoon-core-2.2.1-SNAPSHOT.jar
[INFO] [jar:test-jar {execution: default}]
[INFO] Building jar: /home/continuum/data/working-directory/51/core/cocoon-core/target/cocoon-core-2.2.1-SNAPSHOT-tests.jar
[INFO] [install:install]
[INFO] Installing /home/continuum/data/working-directory/51/core/cocoon-core/target/cocoon-core-2.2.1-SNAPSHOT.jar to /home/continuum/.m2/repository/org/apache/cocoon/cocoon-core/2.2.1-SNAPSHOT/cocoon-core-2.2.1-SNAPSHOT.jar
[INFO] Installing /home/continuum/data/working-directory/51/core/cocoon-core/target/cocoon-core-2.2.1-SNAPSHOT-tests.jar to /home/continuum/.m2/repository/org/apache/cocoon/cocoon-core/2.2.1-SNAPSHOT/cocoon-core-2.2.1-SNAPSHOT-tests.jar
[INFO] ----------------------------------------------------------------------------
[INFO] Building Cocoon Servlet Service Implementation
[INFO]    task-segment: [clean, install]
[INFO] ----------------------------------------------------------------------------
[INFO] [clean:clean]
[INFO] Deleting directory /home/continuum/data/working-directory/51/core/cocoon-servlet-service/cocoon-servlet-service-impl/target
[INFO] Deleting directory /home/continuum/data/working-directory/51/core/cocoon-servlet-service/cocoon-servlet-service-impl/target/classes
[INFO] Deleting directory /home/continuum/data/working-directory/51/core/cocoon-servlet-service/cocoon-servlet-service-impl/target/test-classes
[INFO] Deleting directory /home/continuum/data/working-directory/51/core/cocoon-servlet-service/cocoon-servlet-service-impl/target/site
[INFO] [enforcer:enforce-once {execution: enforce-maven}]
[INFO] [resources:resources]
[INFO] Using default encoding to copy filtered resources.
[INFO] [compiler:compile]
[INFO] Compiling 42 source files to /home/continuum/data/working-directory/51/core/cocoon-servlet-service/cocoon-servlet-service-impl/target/classes
[INFO] [resources:testResources]
[INFO] Using default encoding to copy filtered resources.
[INFO] [compiler:testCompile]
[INFO] Compiling 3 source files to /home/continuum/data/working-directory/51/core/cocoon-servlet-service/cocoon-servlet-service-impl/target/test-classes
[INFO] [surefire:test]
[INFO] Surefire report directory: /home/continuum/data/working-directory/51/core/cocoon-servlet-service/cocoon-servlet-service-impl/target/surefire-reports

-------------------------------------------------------
 T E S T S
-------------------------------------------------------
Running org.apache.cocoon.servletservice.util.RequestParametersTestCase
Tests run: 5, Failures: 0, Errors: 0, Skipped: 0, Time elapsed: 0.057 sec
Running org.apache.cocoon.servletservice.ServletServiceContextTestCase
log4j:WARN No appenders could be found for logger (org.apache.cocoon.servletservice.ServletServiceContext).
log4j:WARN Please initialize the log4j system properly.
Tests run: 5, Failures: 0, Errors: 0, Skipped: 0, Time elapsed: 0.156 sec
Running org.apache.cocoon.servletservice.HttpServletResponseBufferingWrapperTestCase
Tests run: 5, Failures: 0, Errors: 0, Skipped: 0, Time elapsed: 0.199 sec

Results :

Tests run: 15, Failures: 0, Errors: 0, Skipped: 0

[INFO] [jar:jar]
[INFO] Building jar: /home/continuum/data/working-directory/51/core/cocoon-servlet-service/cocoon-servlet-service-impl/target/cocoon-servlet-service-impl-1.1.0-SNAPSHOT.jar
[INFO] [install:install]
[INFO] Installing /home/continuum/data/working-directory/51/core/cocoon-servlet-service/cocoon-servlet-service-impl/target/cocoon-servlet-service-impl-1.1.0-SNAPSHOT.jar to /home/continuum/.m2/repository/org/apache/cocoon/cocoon-servlet-service-impl/1.1.0-SNAPSHOT/cocoon-servlet-service-impl-1.1.0-SNAPSHOT.jar
[INFO] ----------------------------------------------------------------------------
[INFO] Building Cocoon Blocks [modules]
[INFO]    task-segment: [clean, install]
[INFO] ----------------------------------------------------------------------------
[INFO] [clean:clean]
[INFO] Deleting directory /home/continuum/data/working-directory/51/blocks/target
[INFO] Deleting directory /home/continuum/data/working-directory/51/blocks/target/classes
[INFO] Deleting directory /home/continuum/data/working-directory/51/blocks/target/test-classes
[INFO] Deleting directory /home/continuum/data/working-directory/51/blocks/target/site
[INFO] [enforcer:enforce-once {execution: enforce-maven}]
[INFO] [site:attach-descriptor]
[INFO] [install:install]
[INFO] Installing /home/continuum/data/working-directory/51/blocks/pom.xml to /home/continuum/.m2/repository/org/apache/cocoon/cocoon-blocks-modules/6-SNAPSHOT/cocoon-blocks-modules-6-SNAPSHOT.pom
[INFO] ----------------------------------------------------------------------------
[INFO] Building Cocoon Linkrewriter Block Implementation
[INFO]    task-segment: [clean, install]
[INFO] ----------------------------------------------------------------------------
[INFO] [clean:clean]
[INFO] Deleting directory /home/continuum/data/working-directory/51/blocks/cocoon-linkrewriter/cocoon-linkrewriter-impl/target
[INFO] Deleting directory /home/continuum/data/working-directory/51/blocks/cocoon-linkrewriter/cocoon-linkrewriter-impl/target/classes
[INFO] Deleting directory /home/continuum/data/working-directory/51/blocks/cocoon-linkrewriter/cocoon-linkrewriter-impl/target/test-classes
[INFO] Deleting directory /home/continuum/data/working-directory/51/blocks/cocoon-linkrewriter/cocoon-linkrewriter-impl/target/site
[INFO] [enforcer:enforce-once {execution: enforce-maven}]
[INFO] [resources:resources]
[INFO] Using default encoding to copy filtered resources.
[INFO] [compiler:compile]
[INFO] Compiling 4 source files to /home/continuum/data/working-directory/51/blocks/cocoon-linkrewriter/cocoon-linkrewriter-impl/target/classes
[INFO] [resources:testResources]
[INFO] Using default encoding to copy filtered resources.
[INFO] [compiler:testCompile]
[INFO] No sources to compile
[INFO] [surefire:test]
[INFO] No tests to run.
[INFO] [jar:jar]
[INFO] Building jar: /home/continuum/data/working-directory/51/blocks/cocoon-linkrewriter/cocoon-linkrewriter-impl/target/cocoon-linkrewriter-impl-1.1.0-SNAPSHOT.jar
[INFO] [install:install]
[INFO] Installing /home/continuum/data/working-directory/51/blocks/cocoon-linkrewriter/cocoon-linkrewriter-impl/target/cocoon-linkrewriter-impl-1.1.0-SNAPSHOT.jar to /home/continuum/.m2/repository/org/apache/cocoon/cocoon-linkrewriter-impl/1.1.0-SNAPSHOT/cocoon-linkrewriter-impl-1.1.0-SNAPSHOT.jar
[INFO] ----------------------------------------------------------------------------
[INFO] Building Cocoon Servlet Service Components
[INFO]    task-segment: [clean, install]
[INFO] ----------------------------------------------------------------------------
[INFO] [clean:clean]
[INFO] Deleting directory /home/continuum/data/working-directory/51/core/cocoon-servlet-service/cocoon-servlet-service-components/target
[INFO] Deleting directory /home/continuum/data/working-directory/51/core/cocoon-servlet-service/cocoon-servlet-service-components/target/classes
[INFO] Deleting directory /home/continuum/data/working-directory/51/core/cocoon-servlet-service/cocoon-servlet-service-components/target/test-classes
[INFO] Deleting directory /home/continuum/data/working-directory/51/core/cocoon-servlet-service/cocoon-servlet-service-components/target/site
[INFO] [enforcer:enforce-once {execution: enforce-maven}]
[INFO] [resources:resources]
[INFO] Using default encoding to copy filtered resources.
[INFO] [compiler:compile]
[INFO] Compiling 16 source files to /home/continuum/data/working-directory/51/core/cocoon-servlet-service/cocoon-servlet-service-components/target/classes
[INFO] [resources:testResources]
[INFO] Using default encoding to copy filtered resources.
[INFO] [compiler:testCompile]
[INFO] Compiling 2 source files to /home/continuum/data/working-directory/51/core/cocoon-servlet-service/cocoon-servlet-service-components/target/test-classes
[INFO] [surefire:test]
[INFO] Surefire report directory: /home/continuum/data/working-directory/51/core/cocoon-servlet-service/cocoon-servlet-service-components/target/surefire-reports

-------------------------------------------------------
 T E S T S
-------------------------------------------------------
Running org.apache.cocoon.servletservice.AbsoluteServletConnectionTestCase
log4j:WARN No appenders could be found for logger (org.springframework.util.ClassUtils).
log4j:WARN Please initialize the log4j system properly.
Tests run: 1, Failures: 0, Errors: 0, Skipped: 0, Time elapsed: 0.748 sec

Results :

Tests run: 1, Failures: 0, Errors: 0, Skipped: 0

[INFO] [jar:jar]
[INFO] Building jar: /home/continuum/data/working-directory/51/core/cocoon-servlet-service/cocoon-servlet-service-components/target/cocoon-servlet-service-components-1.1.0-SNAPSHOT.jar
[INFO] [install:install]
[INFO] Installing /home/continuum/data/working-directory/51/core/cocoon-servlet-service/cocoon-servlet-service-components/target/cocoon-servlet-service-components-1.1.0-SNAPSHOT.jar to /home/continuum/.m2/repository/org/apache/cocoon/cocoon-servlet-service-components/1.1.0-SNAPSHOT/cocoon-servlet-service-components-1.1.0-SNAPSHOT.jar
[INFO] ----------------------------------------------------------------------------
[INFO] Building Cocoon Ajax Block Implementation
[INFO]    task-segment: [clean, install]
[INFO] ----------------------------------------------------------------------------
[INFO] [clean:clean]
[INFO] Deleting directory /home/continuum/data/working-directory/51/blocks/cocoon-ajax/cocoon-ajax-impl/target
[INFO] Deleting directory /home/continuum/data/working-directory/51/blocks/cocoon-ajax/cocoon-ajax-impl/target/classes
[INFO] Deleting directory /home/continuum/data/working-directory/51/blocks/cocoon-ajax/cocoon-ajax-impl/target/test-classes
[INFO] Deleting directory /home/continuum/data/working-directory/51/blocks/cocoon-ajax/cocoon-ajax-impl/target/site
[INFO] [enforcer:enforce-once {execution: enforce-maven}]
[INFO] [resources:resources]
[INFO] Using default encoding to copy filtered resources.
[INFO] [antrun:run {execution: default}]
[INFO] Executing tasks

unzip-dojo:
    [unzip] Expanding: /home/continuum/data/working-directory/51/blocks/cocoon-ajax/cocoon-ajax-impl/src/main/resources/org/apache/cocoon/dojo/resources/dojo-0.4.3-ajax.zip into /home/continuum/data/working-directory/51/blocks/cocoon-ajax/cocoon-ajax-impl/target/dojo-temp
   [delete] Deleting 1 files from /home/continuum/data/working-directory/51/blocks/cocoon-ajax/cocoon-ajax-impl/target/classes/org/apache/cocoon/dojo/resources
     [copy] Copying 1475 files to /home/continuum/data/working-directory/51/blocks/cocoon-ajax/cocoon-ajax-impl/target/classes/org/apache/cocoon/dojo/resources
     [echo] copied
[INFO] Executed tasks
[INFO] [compiler:compile]
[INFO] Compiling 5 source files to /home/continuum/data/working-directory/51/blocks/cocoon-ajax/cocoon-ajax-impl/target/classes
[INFO] [resources:testResources]
[INFO] Using default encoding to copy filtered resources.
[INFO] [compiler:testCompile]
[INFO] No sources to compile
[INFO] [surefire:test]
[INFO] No tests to run.
[INFO] [jar:jar]
[INFO] Building jar: /home/continuum/data/working-directory/51/blocks/cocoon-ajax/cocoon-ajax-impl/target/cocoon-ajax-impl-1.1.0-SNAPSHOT.jar
[INFO] [install:install]
[INFO] Installing /home/continuum/data/working-directory/51/blocks/cocoon-ajax/cocoon-ajax-impl/target/cocoon-ajax-impl-1.1.0-SNAPSHOT.jar to /home/continuum/.m2/repository/org/apache/cocoon/cocoon-ajax-impl/1.1.0-SNAPSHOT/cocoon-ajax-impl-1.1.0-SNAPSHOT.jar
[INFO] ----------------------------------------------------------------------------
[INFO] Building Cocoon Template Framework Block Implementation
[INFO]    task-segment: [clean, install]
[INFO] ----------------------------------------------------------------------------
[INFO] [clean:clean]
[INFO] Deleting directory /home/continuum/data/working-directory/51/blocks/cocoon-template/cocoon-template-impl/target
[INFO] Deleting directory /home/continuum/data/working-directory/51/blocks/cocoon-template/cocoon-template-impl/target/classes
[INFO] Deleting directory /home/continuum/data/working-directory/51/blocks/cocoon-template/cocoon-template-impl/target/test-classes
[INFO] Deleting directory /home/continuum/data/working-directory/51/blocks/cocoon-template/cocoon-template-impl/target/site
[INFO] [enforcer:enforce-once {execution: enforce-maven}]
[INFO] [resources:resources]
[INFO] Using default encoding to copy filtered resources.
[INFO] [compiler:compile]
[INFO] Compiling 64 source files to /home/continuum/data/working-directory/51/blocks/cocoon-template/cocoon-template-impl/target/classes
[INFO] [resources:testResources]
[INFO] Using default encoding to copy filtered resources.
[INFO] [compiler:testCompile]
[INFO] Compiling 1 source file to /home/continuum/data/working-directory/51/blocks/cocoon-template/cocoon-template-impl/target/test-classes
[INFO] [surefire:test]
[INFO] Surefire report directory: /home/continuum/data/working-directory/51/blocks/cocoon-template/cocoon-template-impl/target/surefire-reports

-------------------------------------------------------
 T E S T S
-------------------------------------------------------
Running org.apache.cocoon.template.jxtg.JXTemplateGeneratorTestCase
log4j:WARN No appenders could be found for logger (org.springframework.util.ClassUtils).
log4j:WARN Please initialize the log4j system properly.
Tests run: 18, Failures: 0, Errors: 0, Skipped: 0, Time elapsed: 15.651 sec

Results :

Tests run: 18, Failures: 0, Errors: 0, Skipped: 0

[INFO] [jar:jar]
[INFO] Building jar: /home/continuum/data/working-directory/51/blocks/cocoon-template/cocoon-template-impl/target/cocoon-template-impl-1.2.0-SNAPSHOT.jar
[INFO] [install:install]
[INFO] Installing /home/continuum/data/working-directory/51/blocks/cocoon-template/cocoon-template-impl/target/cocoon-template-impl-1.2.0-SNAPSHOT.jar to /home/continuum/.m2/repository/org/apache/cocoon/cocoon-template-impl/1.2.0-SNAPSHOT/cocoon-template-impl-1.2.0-SNAPSHOT.jar
[INFO] ----------------------------------------------------------------------------
[INFO] Building Cocoon Samples Style Default Block
[INFO]    task-segment: [clean, install]
[INFO] ----------------------------------------------------------------------------
[INFO] [clean:clean]
[INFO] Deleting directory /home/continuum/data/working-directory/51/blocks/cocoon-samples-style/cocoon-samples-style-default/target
[INFO] Deleting directory /home/continuum/data/working-directory/51/blocks/cocoon-samples-style/cocoon-samples-style-default/target/classes
[INFO] Deleting directory /home/continuum/data/working-directory/51/blocks/cocoon-samples-style/cocoon-samples-style-default/target/test-classes
[INFO] Deleting directory /home/continuum/data/working-directory/51/blocks/cocoon-samples-style/cocoon-samples-style-default/target/site
[INFO] [enforcer:enforce-once {execution: enforce-maven}]
[INFO] [resources:resources]
[INFO] Using default encoding to copy filtered resources.
[INFO] [compiler:compile]
[INFO] No sources to compile
[INFO] [resources:testResources]
[INFO] Using default encoding to copy filtered resources.
[INFO] [compiler:testCompile]
[INFO] No sources to compile
[INFO] [surefire:test]
[INFO] No tests to run.
[INFO] [jar:jar]
[INFO] Building jar: /home/continuum/data/working-directory/51/blocks/cocoon-samples-style/cocoon-samples-style-default/target/cocoon-samples-style-default.jar
[INFO] [install:install]
[INFO] Installing /home/continuum/data/working-directory/51/blocks/cocoon-samples-style/cocoon-samples-style-default/target/cocoon-samples-style-default.jar to /home/continuum/.m2/repository/org/apache/cocoon/cocoon-samples-style-default/1.0.0-SNAPSHOT/cocoon-samples-style-default-1.0.0-SNAPSHOT.jar
[INFO] ----------------------------------------------------------------------------
[INFO] Building Cocoon Ajax Block Sample
[INFO]    task-segment: [clean, install]
[INFO] ----------------------------------------------------------------------------
[INFO] [clean:clean]
[INFO] Deleting directory /home/continuum/data/working-directory/51/blocks/cocoon-ajax/cocoon-ajax-sample/target
[INFO] Deleting directory /home/continuum/data/working-directory/51/blocks/cocoon-ajax/cocoon-ajax-sample/target/classes
[INFO] Deleting directory /home/continuum/data/working-directory/51/blocks/cocoon-ajax/cocoon-ajax-sample/target/test-classes
[INFO] Deleting directory /home/continuum/data/working-directory/51/blocks/cocoon-ajax/cocoon-ajax-sample/target/site
[INFO] [enforcer:enforce-once {execution: enforce-maven}]
[INFO] [resources:resources]
[INFO] Using default encoding to copy filtered resources.
[INFO] [compiler:compile]
[INFO] No sources to compile
[INFO] [resources:testResources]
[INFO] Using default encoding to copy filtered resources.
[INFO] [compiler:testCompile]
[INFO] No sources to compile
[INFO] [surefire:test]
[INFO] No tests to run.
[INFO] [jar:jar]
[INFO] Building jar: /home/continuum/data/working-directory/51/blocks/cocoon-ajax/cocoon-ajax-sample/target/cocoon-ajax-sample-1.0.0-SNAPSHOT.jar
[INFO] [install:install]
[INFO] Installing /home/continuum/data/working-directory/51/blocks/cocoon-ajax/cocoon-ajax-sample/target/cocoon-ajax-sample-1.0.0-SNAPSHOT.jar to /home/continuum/.m2/repository/org/apache/cocoon/cocoon-ajax-sample/1.0.0-SNAPSHOT/cocoon-ajax-sample-1.0.0-SNAPSHOT.jar
[INFO] ----------------------------------------------------------------------------
[INFO] Building Cocoon Apples Block Implementation
[INFO]    task-segment: [clean, install]
[INFO] ----------------------------------------------------------------------------
[INFO] [clean:clean]
[INFO] Deleting directory /home/continuum/data/working-directory/51/blocks/cocoon-apples/cocoon-apples-impl/target
[INFO] Deleting directory /home/continuum/data/working-directory/51/blocks/cocoon-apples/cocoon-apples-impl/target/classes
[INFO] Deleting directory /home/continuum/data/working-directory/51/blocks/cocoon-apples/cocoon-apples-impl/target/test-classes
[INFO] Deleting directory /home/continuum/data/working-directory/51/blocks/cocoon-apples/cocoon-apples-impl/target/site
[INFO] [enforcer:enforce-once {execution: enforce-maven}]
[INFO] [resources:resources]
[INFO] Using default encoding to copy filtered resources.
[INFO] [compiler:compile]
[INFO] Compiling 10 source files to /home/continuum/data/working-directory/51/blocks/cocoon-apples/cocoon-apples-impl/target/classes
[INFO] [resources:testResources]
[INFO] Using default encoding to copy filtered resources.
[INFO] [compiler:testCompile]
[INFO] No sources to compile
[INFO] [surefire:test]
[INFO] No tests to run.
[INFO] [jar:jar]
[INFO] Building jar: /home/continuum/data/working-directory/51/blocks/cocoon-apples/cocoon-apples-impl/target/cocoon-apples-impl-1.1.0-SNAPSHOT.jar
[INFO] [install:install]
[INFO] Installing /home/continuum/data/working-directory/51/blocks/cocoon-apples/cocoon-apples-impl/target/cocoon-apples-impl-1.1.0-SNAPSHOT.jar to /home/continuum/.m2/repository/org/apache/cocoon/cocoon-apples-impl/1.1.0-SNAPSHOT/cocoon-apples-impl-1.1.0-SNAPSHOT.jar
[INFO] ----------------------------------------------------------------------------
[INFO] Building Session Framework Implementation
[INFO]    task-segment: [clean, install]
[INFO] ----------------------------------------------------------------------------
[INFO] [clean:clean]
[INFO] Deleting directory /home/continuum/data/working-directory/51/blocks/cocoon-session-fw/cocoon-session-fw-impl/target
[INFO] Deleting directory /home/continuum/data/working-directory/51/blocks/cocoon-session-fw/cocoon-session-fw-impl/target/classes
[INFO] Deleting directory /home/continuum/data/working-directory/51/blocks/cocoon-session-fw/cocoon-session-fw-impl/target/test-classes
[INFO] Deleting directory /home/continuum/data/working-directory/51/blocks/cocoon-session-fw/cocoon-session-fw-impl/target/site
[INFO] [enforcer:enforce-once {execution: enforce-maven}]
[INFO] [resources:resources]
[INFO] Using default encoding to copy filtered resources.
[INFO] [compiler:compile]
[INFO] Compiling 26 source files to /home/continuum/data/working-directory/51/blocks/cocoon-session-fw/cocoon-session-fw-impl/target/classes
[INFO] [resources:testResources]
[INFO] Using default encoding to copy filtered resources.
[INFO] [compiler:testCompile]
[INFO] No sources to compile
[INFO] [surefire:test]
[INFO] No tests to run.
[INFO] [jar:jar]
[INFO] Building jar: /home/continuum/data/working-directory/51/blocks/cocoon-session-fw/cocoon-session-fw-impl/target/cocoon-session-fw-impl-1.0.0-SNAPSHOT.jar
[INFO] [install:install]
[INFO] Installing /home/continuum/data/working-directory/51/blocks/cocoon-session-fw/cocoon-session-fw-impl/target/cocoon-session-fw-impl-1.0.0-SNAPSHOT.jar to /home/continuum/.m2/repository/org/apache/cocoon/cocoon-session-fw-impl/1.0.0-SNAPSHOT/cocoon-session-fw-impl-1.0.0-SNAPSHOT.jar
[INFO] ----------------------------------------------------------------------------
[INFO] Building XSP Block Implementation
[INFO]    task-segment: [clean, install]
[INFO] ----------------------------------------------------------------------------
[INFO] [clean:clean]
[INFO] Deleting directory /home/continuum/data/working-directory/51/blocks/cocoon-xsp/cocoon-xsp-impl/target
[INFO] Deleting directory /home/continuum/data/working-directory/51/blocks/cocoon-xsp/cocoon-xsp-impl/target/classes
[INFO] Deleting directory /home/continuum/data/working-directory/51/blocks/cocoon-xsp/cocoon-xsp-impl/target/test-classes
[INFO] Deleting directory /home/continuum/data/working-directory/51/blocks/cocoon-xsp/cocoon-xsp-impl/target/site
[INFO] [enforcer:enforce-once {execution: enforce-maven}]
[INFO] [resources:resources]
[INFO] Using default encoding to copy filtered resources.
[INFO] [compiler:compile]
[INFO] Compiling 78 source files to /home/continuum/data/working-directory/51/blocks/cocoon-xsp/cocoon-xsp-impl/target/classes
[INFO] [resources:testResources]
[INFO] Using default encoding to copy filtered resources.
[INFO] [compiler:testCompile]
[INFO] No sources to compile
[INFO] [surefire:test]
[INFO] No tests to run.
[INFO] [jar:jar]
[INFO] Building jar: /home/continuum/data/working-directory/51/blocks/cocoon-xsp/cocoon-xsp-impl/target/cocoon-xsp-impl-1.0.0-SNAPSHOT.jar
[INFO] [install:install]
[INFO] Installing /home/continuum/data/working-directory/51/blocks/cocoon-xsp/cocoon-xsp-impl/target/cocoon-xsp-impl-1.0.0-SNAPSHOT.jar to /home/continuum/.m2/repository/org/apache/cocoon/cocoon-xsp-impl/1.0.0-SNAPSHOT/cocoon-xsp-impl-1.0.0-SNAPSHOT.jar
[INFO] ----------------------------------------------------------------------------
[INFO] Building Cocoon Main Core Sample Block
[INFO]    task-segment: [clean, install]
[INFO] ----------------------------------------------------------------------------
[INFO] [clean:clean]
[INFO] Deleting directory /home/continuum/data/working-directory/51/blocks/cocoon-core-sample/cocoon-core-main-sample/target
[INFO] Deleting directory /home/continuum/data/working-directory/51/blocks/cocoon-core-sample/cocoon-core-main-sample/target/classes
[INFO] Deleting directory /home/continuum/data/working-directory/51/blocks/cocoon-core-sample/cocoon-core-main-sample/target/test-classes
[INFO] Deleting directory /home/continuum/data/working-directory/51/blocks/cocoon-core-sample/cocoon-core-main-sample/target/site
[INFO] [enforcer:enforce-once {execution: enforce-maven}]
[INFO] [resources:resources]
[INFO] Using default encoding to copy filtered resources.
[INFO] [compiler:compile]
[INFO] Compiling 8 source files to /home/continuum/data/working-directory/51/blocks/cocoon-core-sample/cocoon-core-main-sample/target/classes
[INFO] [resources:testResources]
[INFO] Using default encoding to copy filtered resources.
[INFO] [compiler:testCompile]
[INFO] No sources to compile
[INFO] [surefire:test]
[INFO] No tests to run.
[INFO] [jar:jar]
[INFO] Building jar: /home/continuum/data/working-directory/51/blocks/cocoon-core-sample/cocoon-core-main-sample/target/cocoon-core-main-sample-1.0.0-SNAPSHOT.jar
[INFO] [install:install]
[INFO] Installing /home/continuum/data/working-directory/51/blocks/cocoon-core-sample/cocoon-core-main-sample/target/cocoon-core-main-sample-1.0.0-SNAPSHOT.jar to /home/continuum/.m2/repository/org/apache/cocoon/cocoon-core-main-sample/1.0.0-SNAPSHOT/cocoon-core-main-sample-1.0.0-SNAPSHOT.jar
[INFO] ----------------------------------------------------------------------------
[INFO] Building Cocoon Flowscript Block Implementation
[INFO]    task-segment: [clean, install]
[INFO] ----------------------------------------------------------------------------
[INFO] [clean:clean]
[INFO] Deleting directory /home/continuum/data/working-directory/51/blocks/cocoon-flowscript/cocoon-flowscript-impl/target
[INFO] Deleting directory /home/continuum/data/working-directory/51/blocks/cocoon-flowscript/cocoon-flowscript-impl/target/classes
[INFO] Deleting directory /home/continuum/data/working-directory/51/blocks/cocoon-flowscript/cocoon-flowscript-impl/target/test-classes
[INFO] Deleting directory /home/continuum/data/working-directory/51/blocks/cocoon-flowscript/cocoon-flowscript-impl/target/site
[INFO] [enforcer:enforce-once {execution: enforce-maven}]
[INFO] [resources:resources]
[INFO] Using default encoding to copy filtered resources.
[INFO] [compiler:compile]
[INFO] Compiling 20 source files to /home/continuum/data/working-directory/51/blocks/cocoon-flowscript/cocoon-flowscript-impl/target/classes
[INFO] [resources:testResources]
[INFO] Using default encoding to copy filtered resources.
[INFO] [compiler:testCompile]
[INFO] No sources to compile
[INFO] [surefire:test]
[INFO] No tests to run.
[INFO] [jar:jar]
[INFO] Building jar: /home/continuum/data/working-directory/51/blocks/cocoon-flowscript/cocoon-flowscript-impl/target/cocoon-flowscript-impl-1.1.0-SNAPSHOT.jar
[INFO] [install:install]
[INFO] Installing /home/continuum/data/working-directory/51/blocks/cocoon-flowscript/cocoon-flowscript-impl/target/cocoon-flowscript-impl-1.1.0-SNAPSHOT.jar to /home/continuum/.m2/repository/org/apache/cocoon/cocoon-flowscript-impl/1.1.0-SNAPSHOT/cocoon-flowscript-impl-1.1.0-SNAPSHOT.jar
[INFO] ----------------------------------------------------------------------------
[INFO] Building Cocoon Forms Block Implementation
[INFO]    task-segment: [clean, install]
[INFO] ----------------------------------------------------------------------------
[INFO] [clean:clean]
[INFO] Deleting directory /home/continuum/data/working-directory/51/blocks/cocoon-forms/cocoon-forms-impl/target
[INFO] Deleting directory /home/continuum/data/working-directory/51/blocks/cocoon-forms/cocoon-forms-impl/target/classes
[INFO] Deleting directory /home/continuum/data/working-directory/51/blocks/cocoon-forms/cocoon-forms-impl/target/test-classes
[INFO] Deleting directory /home/continuum/data/working-directory/51/blocks/cocoon-forms/cocoon-forms-impl/target/site
[INFO] [enforcer:enforce-once {execution: enforce-maven}]
[INFO] [resources:resources]
[INFO] Using default encoding to copy filtered resources.
[INFO] [compiler:compile]
[INFO] Compiling 395 source files to /home/continuum/data/working-directory/51/blocks/cocoon-forms/cocoon-forms-impl/target/classes
[INFO] [resources:testResources]
[INFO] Using default encoding to copy filtered resources.
[INFO] [compiler:testCompile]
[INFO] Compiling 11 source files to /home/continuum/data/working-directory/51/blocks/cocoon-forms/cocoon-forms-impl/target/test-classes
[INFO] [surefire:test]
[INFO] Surefire report directory: /home/continuum/data/working-directory/51/blocks/cocoon-forms/cocoon-forms-impl/target/surefire-reports

-------------------------------------------------------
 T E S T S
-------------------------------------------------------
Running org.apache.cocoon.forms.datatype.FlowJXPathSelectionListTestCase
log4j:WARN No appenders could be found for logger (org.springframework.util.ClassUtils).
log4j:WARN Please initialize the log4j system properly.
Tests run: 2, Failures: 0, Errors: 0, Skipped: 0, Time elapsed: 5.5 sec
Running org.apache.cocoon.forms.datatype.DynamicSelectionListTestCase
Tests run: 1, Failures: 0, Errors: 0, Skipped: 0, Time elapsed: 0.592 sec
Running org.apache.cocoon.forms.datatype.convertor.EnumConvertorTestCase
Tests run: 2, Failures: 0, Errors: 0, Skipped: 0, Time elapsed: 0.01 sec
Running org.apache.cocoon.forms.datatype.convertor.EnumConvertorBuilderTestCase
Tests run: 1, Failures: 0, Errors: 0, Skipped: 0, Time elapsed: 0.008 sec
Running org.apache.cocoon.forms.datatype.validationruleimpl.EmailValidationRuleTest
Tests run: 2, Failures: 0, Errors: 0, Skipped: 0, Time elapsed: 0.047 sec
Running org.apache.cocoon.forms.datatype.EnumSelectionListTestCase
Tests run: 2, Failures: 0, Errors: 0, Skipped: 0, Time elapsed: 0.741 sec
Running org.apache.cocoon.forms.formmodel.GroupTestCase
Tests run: 1, Failures: 0, Errors: 0, Skipped: 0, Time elapsed: 0.403 sec
Running org.apache.cocoon.forms.formmodel.FieldTestCase
Tests run: 6, Failures: 0, Errors: 0, Skipped: 0, Time elapsed: 1.975 sec

Results :

Tests run: 17, Failures: 0, Errors: 0, Skipped: 0

[INFO] [jar:jar]
[INFO] Building jar: /home/continuum/data/working-directory/51/blocks/cocoon-forms/cocoon-forms-impl/target/cocoon-forms-impl-1.2.0-SNAPSHOT.jar
[INFO] [install:install]
[INFO] Installing /home/continuum/data/working-directory/51/blocks/cocoon-forms/cocoon-forms-impl/target/cocoon-forms-impl-1.2.0-SNAPSHOT.jar to /home/continuum/.m2/repository/org/apache/cocoon/cocoon-forms-impl/1.2.0-SNAPSHOT/cocoon-forms-impl-1.2.0-SNAPSHOT.jar
[INFO] ----------------------------------------------------------------------------
[INFO] Building Cocoon Apples Block Samples
[INFO]    task-segment: [clean, install]
[INFO] ----------------------------------------------------------------------------
[INFO] [clean:clean]
[INFO] Deleting directory /home/continuum/data/working-directory/51/blocks/cocoon-apples/cocoon-apples-sample/target
[INFO] Deleting directory /home/continuum/data/working-directory/51/blocks/cocoon-apples/cocoon-apples-sample/target/classes
[INFO] Deleting directory /home/continuum/data/working-directory/51/blocks/cocoon-apples/cocoon-apples-sample/target/test-classes
[INFO] Deleting directory /home/continuum/data/working-directory/51/blocks/cocoon-apples/cocoon-apples-sample/target/site
[INFO] [enforcer:enforce-once {execution: enforce-maven}]
[INFO] [resources:resources]
[INFO] Using default encoding to copy filtered resources.
[INFO] [compiler:compile]
[INFO] Compiling 4 source files to /home/continuum/data/working-directory/51/blocks/cocoon-apples/cocoon-apples-sample/target/classes
[INFO] [resources:testResources]
[INFO] Using default encoding to copy filtered resources.
[INFO] [compiler:testCompile]
[INFO] No sources to compile
[INFO] [surefire:test]
[INFO] No tests to run.
[INFO] [jar:jar]
[INFO] Building jar: /home/continuum/data/working-directory/51/blocks/cocoon-apples/cocoon-apples-sample/target/cocoon-apples-sample.jar
[INFO] [install:install]
[INFO] Installing /home/continuum/data/working-directory/51/blocks/cocoon-apples/cocoon-apples-sample/target/cocoon-apples-sample.jar to /home/continuum/.m2/repository/org/apache/cocoon/cocoon-apples-sample/1.0.0-SNAPSHOT/cocoon-apples-sample-1.0.0-SNAPSHOT.jar
[INFO] ----------------------------------------------------------------------------
[INFO] Building Cocoon Additional Sample Block
[INFO]    task-segment: [clean, install]
[INFO] ----------------------------------------------------------------------------
[INFO] [clean:clean]
[INFO] Deleting directory /home/continuum/data/working-directory/51/blocks/cocoon-core-sample/cocoon-core-additional-sample/target
[INFO] Deleting directory /home/continuum/data/working-directory/51/blocks/cocoon-core-sample/cocoon-core-additional-sample/target/classes
[INFO] Deleting directory /home/continuum/data/working-directory/51/blocks/cocoon-core-sample/cocoon-core-additional-sample/target/test-classes
[INFO] Deleting directory /home/continuum/data/working-directory/51/blocks/cocoon-core-sample/cocoon-core-additional-sample/target/site
[INFO] [enforcer:enforce-once {execution: enforce-maven}]
[INFO] [resources:resources]
[INFO] Using default encoding to copy filtered resources.
[INFO] [compiler:compile]
[INFO] No sources to compile
[INFO] [resources:testResources]
[INFO] Using default encoding to copy filtered resources.
[INFO] [compiler:testCompile]
[INFO] No sources to compile
[INFO] [surefire:test]
[INFO] No tests to run.
[INFO] [jar:jar]
[INFO] Building jar: /home/continuum/data/working-directory/51/blocks/cocoon-core-sample/cocoon-core-additional-sample/target/cocoon-core-additional-sample-1.0.0-SNAPSHOT.jar
[INFO] [install:install]
[INFO] Installing /home/continuum/data/working-directory/51/blocks/cocoon-core-sample/cocoon-core-additional-sample/target/cocoon-core-additional-sample-1.0.0-SNAPSHOT.jar to /home/continuum/.m2/repository/org/apache/cocoon/cocoon-core-additional-sample/1.0.0-SNAPSHOT/cocoon-core-additional-sample-1.0.0-SNAPSHOT.jar
[INFO] ----------------------------------------------------------------------------
[INFO] Building Cocoon Batik Block Implementation
[INFO]    task-segment: [clean, install]
[INFO] ----------------------------------------------------------------------------
[INFO] [clean:clean]
[INFO] Deleting directory /home/continuum/data/working-directory/51/blocks/cocoon-batik/cocoon-batik-impl/target
[INFO] Deleting directory /home/continuum/data/working-directory/51/blocks/cocoon-batik/cocoon-batik-impl/target/classes
[INFO] Deleting directory /home/continuum/data/working-directory/51/blocks/cocoon-batik/cocoon-batik-impl/target/test-classes
[INFO] Deleting directory /home/continuum/data/working-directory/51/blocks/cocoon-batik/cocoon-batik-impl/target/site
[INFO] [enforcer:enforce-once {execution: enforce-maven}]
[INFO] [resources:resources]
[INFO] Using default encoding to copy filtered resources.
[INFO] [compiler:compile]
[INFO] Compiling 8 source files to /home/continuum/data/working-directory/51/blocks/cocoon-batik/cocoon-batik-impl/target/classes
[INFO] [resources:testResources]
[INFO] Using default encoding to copy filtered resources.
[INFO] [compiler:testCompile]
[INFO] Nothing to compile - all classes are up to date
[INFO] [surefire:test]
[INFO] Surefire report directory: /home/continuum/data/working-directory/51/blocks/cocoon-batik/cocoon-batik-impl/target/surefire-reports

-------------------------------------------------------
 T E S T S
-------------------------------------------------------
There are no tests to run.

Results :

Tests run: 0, Failures: 0, Errors: 0, Skipped: 0

[INFO] [jar:jar]
[INFO] Building jar: /home/continuum/data/working-directory/51/blocks/cocoon-batik/cocoon-batik-impl/target/cocoon-batik-impl-1.1.0-SNAPSHOT.jar
[INFO] [install:install]
[INFO] Installing /home/continuum/data/working-directory/51/blocks/cocoon-batik/cocoon-batik-impl/target/cocoon-batik-impl-1.1.0-SNAPSHOT.jar to /home/continuum/.m2/repository/org/apache/cocoon/cocoon-batik-impl/1.1.0-SNAPSHOT/cocoon-batik-impl-1.1.0-SNAPSHOT.jar
[INFO] ----------------------------------------------------------------------------
[INFO] Building Cocoon Forms Block Samples
[INFO]    task-segment: [clean, install]
[INFO] ----------------------------------------------------------------------------
[INFO] [clean:clean]
[INFO] Deleting directory /home/continuum/data/working-directory/51/blocks/cocoon-forms/cocoon-forms-sample/target
[INFO] Deleting directory /home/continuum/data/working-directory/51/blocks/cocoon-forms/cocoon-forms-sample/target/classes
[INFO] Deleting directory /home/continuum/data/working-directory/51/blocks/cocoon-forms/cocoon-forms-sample/target/test-classes
[INFO] Deleting directory /home/continuum/data/working-directory/51/blocks/cocoon-forms/cocoon-forms-sample/target/site
[INFO] [enforcer:enforce-once {execution: enforce-maven}]
[INFO] [resources:resources]
[INFO] Using default encoding to copy filtered resources.
[INFO] [compiler:compile]
[INFO] Compiling 18 source files to /home/continuum/data/working-directory/51/blocks/cocoon-forms/cocoon-forms-sample/target/classes
[INFO] [resources:testResources]
[INFO] Using default encoding to copy filtered resources.
[INFO] [compiler:testCompile]
[INFO] No sources to compile
[INFO] [surefire:test]
[INFO] No tests to run.
[INFO] [jar:jar]
[INFO] Building jar: /home/continuum/data/working-directory/51/blocks/cocoon-forms/cocoon-forms-sample/target/cocoon-forms-sample-1.1.0-SNAPSHOT.jar
[INFO] [install:install]
[INFO] Installing /home/continuum/data/working-directory/51/blocks/cocoon-forms/cocoon-forms-sample/target/cocoon-forms-sample-1.1.0-SNAPSHOT.jar to /home/continuum/.m2/repository/org/apache/cocoon/cocoon-forms-sample/1.1.0-SNAPSHOT/cocoon-forms-sample-1.1.0-SNAPSHOT.jar
[INFO] ----------------------------------------------------------------------------
[INFO] Building Cocoon Integration Tests Block
[INFO]    task-segment: [clean, install]
[INFO] ----------------------------------------------------------------------------
[INFO] [clean:clean]
[INFO] Deleting directory /home/continuum/data/working-directory/51/blocks/cocoon-it/target
[INFO] Deleting directory /home/continuum/data/working-directory/51/blocks/cocoon-it/target/classes
[INFO] Deleting directory /home/continuum/data/working-directory/51/blocks/cocoon-it/target/test-classes
[INFO] Deleting directory /home/continuum/data/working-directory/51/blocks/cocoon-it/target/site
[INFO] [enforcer:enforce-once {execution: enforce-maven}]
[INFO] [resources:resources]
[INFO] Using default encoding to copy filtered resources.
[INFO] [compiler:compile]
[INFO] Compiling 9 source files to /home/continuum/data/working-directory/51/blocks/cocoon-it/target/classes
[INFO] [resources:testResources]
[INFO] Using default encoding to copy filtered resources.
[INFO] [compiler:testCompile]
[INFO] No sources to compile
[INFO] [surefire:test]
[INFO] No tests to run.
[INFO] [jar:jar]
[INFO] Building jar: /home/continuum/data/working-directory/51/blocks/cocoon-it/target/cocoon-it-1.0.0-SNAPSHOT.jar
[INFO] [install:install]
[INFO] Installing /home/continuum/data/working-directory/51/blocks/cocoon-it/target/cocoon-it-1.0.0-SNAPSHOT.jar to /home/continuum/.m2/repository/org/apache/cocoon/cocoon-it/1.0.0-SNAPSHOT/cocoon-it-1.0.0-SNAPSHOT.jar
[INFO] Preparing cocoon:rcl
[WARNING] Removing: rcl from forked lifecycle, to prevent recursive invocation.
[INFO] [enforcer:enforce-once {execution: enforce-maven}]
[INFO] [resources:resources]
[INFO] Using default encoding to copy filtered resources.
[INFO] [compiler:compile]
[INFO] Nothing to compile - all classes are up to date
[INFO] [cocoon:rcl {execution: default}]
[INFO] Creating a reloading Cocoon web application.
[INFO] Deploying string-template to WEB-INF/log4j.xml
[INFO] Adding lib to WEB-INF/lib: org.apache.commons:commons-jci-core:1.0:jar
[INFO] Adding lib to WEB-INF/lib: commons-logging:commons-logging:1.1:jar
[INFO] Adding lib to WEB-INF/lib: javax.servlet:servlet-api:2.3:jar
[INFO] Adding lib to WEB-INF/lib: org.apache.commons:commons-jci-fam:1.0:jar
[INFO] Adding lib to WEB-INF/lib: commons-logging:commons-logging-api:1.1:jar
[INFO] Adding lib to WEB-INF/lib: org.apache.cocoon:cocoon-rcl-webapp-wrapper:1.0.0-M1:jar
[INFO] Adding lib to WEB-INF/lib: log4j:log4j:1.2.14:jar
[INFO] Adding lib to WEB-INF/lib: commons-io:commons-io:1.3.1:jar
[INFO] No patches to apply
[INFO] ----------------------------------------------------------------------------
[INFO] Building Cocoon Linkrewriter Block Samples
[INFO]    task-segment: [clean, install]
[INFO] ----------------------------------------------------------------------------
[INFO] [clean:clean]
[INFO] Deleting directory /home/continuum/data/working-directory/51/blocks/cocoon-linkrewriter/cocoon-linkrewriter-sample/target
[INFO] Deleting directory /home/continuum/data/working-directory/51/blocks/cocoon-linkrewriter/cocoon-linkrewriter-sample/target/classes
[INFO] Deleting directory /home/continuum/data/working-directory/51/blocks/cocoon-linkrewriter/cocoon-linkrewriter-sample/target/test-classes
[INFO] Deleting directory /home/continuum/data/working-directory/51/blocks/cocoon-linkrewriter/cocoon-linkrewriter-sample/target/site
[INFO] [enforcer:enforce-once {execution: enforce-maven}]
[INFO] [resources:resources]
[INFO] Using default encoding to copy filtered resources.
[INFO] [compiler:compile]
[INFO] No sources to compile
[INFO] [resources:testResources]
[INFO] Using default encoding to copy filtered resources.
[INFO] [compiler:testCompile]
[INFO] No sources to compile
[INFO] [surefire:test]
[INFO] No tests to run.
[INFO] [jar:jar]
[INFO] Building jar: /home/continuum/data/working-directory/51/blocks/cocoon-linkrewriter/cocoon-linkrewriter-sample/target/cocoon-linkrewriter-sample-1.0.0-SNAPSHOT.jar
[INFO] [install:install]
[INFO] Installing /home/continuum/data/working-directory/51/blocks/cocoon-linkrewriter/cocoon-linkrewriter-sample/target/cocoon-linkrewriter-sample-1.0.0-SNAPSHOT.jar to /home/continuum/.m2/repository/org/apache/cocoon/cocoon-linkrewriter-sample/1.0.0-SNAPSHOT/cocoon-linkrewriter-sample-1.0.0-SNAPSHOT.jar
[INFO] ----------------------------------------------------------------------------
[INFO] Building Cocoon Template Block Samples
[INFO]    task-segment: [clean, install]
[INFO] ----------------------------------------------------------------------------
[INFO] [clean:clean]
[INFO] Deleting directory /home/continuum/data/working-directory/51/blocks/cocoon-template/cocoon-template-sample/target
[INFO] Deleting directory /home/continuum/data/working-directory/51/blocks/cocoon-template/cocoon-template-sample/target/classes
[INFO] Deleting directory /home/continuum/data/working-directory/51/blocks/cocoon-template/cocoon-template-sample/target/test-classes
[INFO] Deleting directory /home/continuum/data/working-directory/51/blocks/cocoon-template/cocoon-template-sample/target/site
[INFO] [enforcer:enforce-once {execution: enforce-maven}]
[INFO] [resources:resources]
[INFO] Using default encoding to copy filtered resources.
[INFO] [compiler:compile]
[INFO] No sources to compile
[INFO] [resources:testResources]
[INFO] Using default encoding to copy filtered resources.
[INFO] [compiler:testCompile]
[INFO] No sources to compile
[INFO] [surefire:test]
[INFO] No tests to run.
[INFO] [jar:jar]
[INFO] Building jar: /home/continuum/data/working-directory/51/blocks/cocoon-template/cocoon-template-sample/target/cocoon-template-sample-1.1.0-SNAPSHOT.jar
[INFO] [install:install]
[INFO] Installing /home/continuum/data/working-directory/51/blocks/cocoon-template/cocoon-template-sample/target/cocoon-template-sample-1.1.0-SNAPSHOT.jar to /home/continuum/.m2/repository/org/apache/cocoon/cocoon-template-sample/1.1.0-SNAPSHOT/cocoon-template-sample-1.1.0-SNAPSHOT.jar
[INFO] ----------------------------------------------------------------------------
[INFO] Building Cocoon Batik Block Samples
[INFO]    task-segment: [clean, install]
[INFO] ----------------------------------------------------------------------------
[INFO] [clean:clean]
[INFO] Deleting directory /home/continuum/data/working-directory/51/blocks/cocoon-batik/cocoon-batik-sample/target
[INFO] Deleting directory /home/continuum/data/working-directory/51/blocks/cocoon-batik/cocoon-batik-sample/target/classes
[INFO] Deleting directory /home/continuum/data/working-directory/51/blocks/cocoon-batik/cocoon-batik-sample/target/test-classes
[INFO] Deleting directory /home/continuum/data/working-directory/51/blocks/cocoon-batik/cocoon-batik-sample/target/site
[INFO] [enforcer:enforce-once {execution: enforce-maven}]
[INFO] [resources:resources]
[INFO] Using default encoding to copy filtered resources.
[INFO] [compiler:compile]
[INFO] No sources to compile
[INFO] [resources:testResources]
[INFO] Using default encoding to copy filtered resources.
[INFO] [compiler:testCompile]
[INFO] No sources to compile
[INFO] [surefire:test]
[INFO] No tests to run.
[INFO] [jar:jar]
[INFO] Building jar: /home/continuum/data/working-directory/51/blocks/cocoon-batik/cocoon-batik-sample/target/cocoon-batik-sample-1.0.0-SNAPSHOT.jar
[INFO] [install:install]
[INFO] Installing /home/continuum/data/working-directory/51/blocks/cocoon-batik/cocoon-batik-sample/target/cocoon-batik-sample-1.0.0-SNAPSHOT.jar to /home/continuum/.m2/repository/org/apache/cocoon/cocoon-batik-sample/1.0.0-SNAPSHOT/cocoon-batik-sample-1.0.0-SNAPSHOT.jar
[INFO] ----------------------------------------------------------------------------
[INFO] Building Cocoon Welcome (Samples)
[INFO]    task-segment: [clean, install]
[INFO] ----------------------------------------------------------------------------
[INFO] [clean:clean]
[INFO] Deleting directory /home/continuum/data/working-directory/51/blocks/cocoon-welcome/target
[INFO] Deleting directory /home/continuum/data/working-directory/51/blocks/cocoon-welcome/target/classes
[INFO] Deleting directory /home/continuum/data/working-directory/51/blocks/cocoon-welcome/target/test-classes
[INFO] Deleting directory /home/continuum/data/working-directory/51/blocks/cocoon-welcome/target/site
[INFO] [enforcer:enforce-once {execution: enforce-maven}]
[INFO] [resources:resources]
[INFO] Using default encoding to copy filtered resources.
[INFO] [compiler:compile]
[INFO] No sources to compile
[INFO] Preparing cocoon:rcl
[WARNING] Removing: rcl from forked lifecycle, to prevent recursive invocation.
[INFO] [enforcer:enforce-once {execution: enforce-maven}]
[INFO] [resources:resources]
[INFO] Using default encoding to copy filtered resources.
[INFO] [compiler:compile]
[INFO] No sources to compile
[INFO] [cocoon:rcl {execution: rcl}]
[INFO] Creating a reloading Cocoon web application.
[INFO] Deploying string-template to WEB-INF/log4j.xml
[INFO] Adding lib to WEB-INF/lib: org.apache.commons:commons-jci-core:1.0:jar
[INFO] Adding lib to WEB-INF/lib: commons-logging:commons-logging:1.1:jar
[INFO] Adding lib to WEB-INF/lib: javax.servlet:servlet-api:2.3:jar
[INFO] Adding lib to WEB-INF/lib: org.apache.commons:commons-jci-fam:1.0:jar
[INFO] Adding lib to WEB-INF/lib: commons-logging:commons-logging-api:1.1:jar
[INFO] Adding lib to WEB-INF/lib: org.apache.cocoon:cocoon-rcl-webapp-wrapper:1.0.0-M1:jar
[INFO] Adding lib to WEB-INF/lib: log4j:log4j:1.2.14:jar
[INFO] Adding lib to WEB-INF/lib: commons-io:commons-io:1.3.1:jar
[INFO] No patches to apply
[INFO] [resources:testResources]
[INFO] Using default encoding to copy filtered resources.
[INFO] [compiler:testCompile]
[INFO] No sources to compile
[INFO] [surefire:test]
[INFO] No tests to run.
[INFO] [jar:jar]
[INFO] Building jar: /home/continuum/data/working-directory/51/blocks/cocoon-welcome/target/cocoon-welcome-1.0.0-M1-SNAPSHOT.jar
[INFO] [install:install]
[INFO] Installing /home/continuum/data/working-directory/51/blocks/cocoon-welcome/target/cocoon-welcome-1.0.0-M1-SNAPSHOT.jar to /home/continuum/.m2/repository/org/apache/cocoon/cocoon-welcome/1.0.0-M1-SNAPSHOT/cocoon-welcome-1.0.0-M1-SNAPSHOT.jar
[INFO] ----------------------------------------------------------------------------
[INFO] Building Asciiart Block Implementation
[INFO]    task-segment: [clean, install]
[INFO] ----------------------------------------------------------------------------
[INFO] [clean:clean]
[INFO] Deleting directory /home/continuum/data/working-directory/51/blocks/cocoon-asciiart/cocoon-asciiart-impl/target
[INFO] Deleting directory /home/continuum/data/working-directory/51/blocks/cocoon-asciiart/cocoon-asciiart-impl/target/classes
[INFO] Deleting directory /home/continuum/data/working-directory/51/blocks/cocoon-asciiart/cocoon-asciiart-impl/target/test-classes
[INFO] Deleting directory /home/continuum/data/working-directory/51/blocks/cocoon-asciiart/cocoon-asciiart-impl/target/site
[INFO] [enforcer:enforce-once {execution: enforce-maven}]
[INFO] [resources:resources]
[INFO] Using default encoding to copy filtered resources.
[INFO] [compiler:compile]
[INFO] Compiling 2 source files to /home/continuum/data/working-directory/51/blocks/cocoon-asciiart/cocoon-asciiart-impl/target/classes
[INFO] [resources:testResources]
[INFO] Using default encoding to copy filtered resources.
[INFO] [compiler:testCompile]
[INFO] Compiling 1 source file to /home/continuum/data/working-directory/51/blocks/cocoon-asciiart/cocoon-asciiart-impl/target/test-classes
[INFO] [surefire:test]
[INFO] Surefire report directory: /home/continuum/data/working-directory/51/blocks/cocoon-asciiart/cocoon-asciiart-impl/target/surefire-reports

-------------------------------------------------------
 T E S T S
-------------------------------------------------------
Running org.apache.cocoon.generation.asciiart.AsciiArtPadTestCase
test1()
<!-- lines --> 
<path d="M 10 18L 10 18"/>
<path d="M 160 18L 160 18"/>
<path d="M 10 42L 10 42"/>
<path d="M 140 42L 140 42"/>
<path d="M 160 42L 160 42"/>
<path d="M 10 66L 10 66"/>
<path d="M 70 66L 70 66"/>
<path d="M 140 66L 140 66"/>
<path d="M 10 90L 10 90"/>
<path d="M 70 90L 70 90"/>
<path d="M 10 114L 10 114"/>
<path d="M 150 114L 150 114"/>
<path d="M 40 150L 40 150"/>
<path d="M 120 150L 120 150"/>
<path d="M 40 174L 40 174"/>
<path d="M 120 174L 120 174"/>
<path d="M 10 198L 10 198"/>
<path d="M 150 198L 150 198"/>
<path d="M 10 222L 10 222"/>
<path d="M 160 222L 160 222"/>
<path d="M 40 246L 40 246"/>
<path d="M 130 246L 130 246"/>
<path d="M 40 270L 40 270"/>
<path d="M 130 270L 130 270"/>
<path d="M 40 306L 40 306"/>
<path d="M 130 306L 130 306"/>
<path d="M 10 318L 10 318"/>
<path d="M 160 318L 160 318"/>
<path d="M 10 342L 10 342"/>
<path d="M 180 342L 180 342"/>
<path d="M 10 366L 10 366"/>
<path d="M 180 366L 180 366"/>
<path d="M 10 378L 10 378"/>
<path d="M 180 378L 180 378"/>
<path d="M 10 390L 10 390"/>
<path d="M 180 390L 180 390"/>
<path d="M 10 402L 10 402"/>
<path d="M 180 402L 180 402"/>
<path d="M 10 414L 10 414"/>
<path d="M 180 414L 180 414"/>
<path d="M 10 426L 10 426"/>
<path d="M 180 426L 180 426"/>
<path d="M 10 450L 10 450"/>
<path d="M 180 450L 180 450"/>
<path d="M 10 474L 10 474"/>
<path d="M 10 486L 10 486"/>
<path d="M 50 498L 50 498"/>
<path d="M 50 510L 50 510"/>
<path d="M 50 522L 50 522"/>
<path d="M 50 534L 50 534"/>
<path d="M 50 546L 50 546"/>
<path d="M 50 546L 60 558"/>
<path d="M 10 558L 20 570"/>
<path d="M 60 582L 70 594"/>
<path d="M 0 6L 0 6"/>
<path d="M 210 6L 210 6"/>
<path d="M 10 18L 160 18"/>
<path d="M 10 42L 160 42"/>
<path d="M 10 66L 140 66"/>
<path d="M 10 90L 70 90"/>
<path d="M 0 102L 0 102"/>
<path d="M 170 102L 170 102"/>
<path d="M 10 114L 150 114"/>
<path d="M 40 150L 120 150"/>
<path d="M 40 174L 120 174"/>
<path d="M 10 198L 150 198"/>
<path d="M 0 210L 0 210"/>
<path d="M 170 210L 170 210"/>
<path d="M 10 222L 160 222"/>
<path d="M 40 246L 130 246"/>
<path d="M 40 270L 130 270"/>
<path d="M 40 306L 130 306"/>
<path d="M 10 318L 160 318"/>
<path d="M 0 330L 0 330"/>
<path d="M 170 330L 170 330"/>
<path d="M 10 342L 180 342"/>
<path d="M 10 366L 180 366"/>
<path d="M 10 378L 10 378"/>
<path d="M 180 378L 180 378"/>
<path d="M 10 390L 10 390"/>
<path d="M 180 390L 180 390"/>
<path d="M 10 402L 10 402"/>
<path d="M 180 402L 180 402"/>
<path d="M 10 414L 10 414"/>
<path d="M 180 414L 180 414"/>
<path d="M 10 426L 180 426"/>
<path d="M 10 450L 180 450"/>
<path d="M 0 462L 0 462"/>
<path d="M 170 462L 170 462"/>
<path d="M 10 474L 40 474"/>
<path d="M 10 486L 40 486"/>
<path d="M 50 498L 80 498"/>
<path d="M 50 510L 80 510"/>
<path d="M 50 522L 80 522"/>
<path d="M 50 534L 80 534"/>
<path d="M 50 546L 80 546"/>
<path d="M 60 558L 80 558"/>
<path d="M 20 570L 40 570"/>
<path d="M 70 582L 90 582"/>
<path d="M 70 594L 90 594"/>
<path d="M 10 18L 10 90"/>
<path d="M 10 114L 10 198"/>
<path d="M 10 222L 10 318"/>
<path d="M 10 342L 10 450"/>
<path d="M 10 474L 10 558"/>
<path d="M 40 150L 40 174"/>
<path d="M 40 246L 40 306"/>
<path d="M 50 378L 50 414"/>
<path d="M 50 498L 50 546"/>
<path d="M 60 582L 60 582"/>
<path d="M 70 66L 70 90"/>
<path d="M 70 282L 70 294"/>
<path d="M 100 282L 100 294"/>
<path d="M 120 150L 120 174"/>
<path d="M 130 246L 130 306"/>
<path d="M 140 42L 140 66"/>
<path d="M 140 378L 140 414"/>
<path d="M 150 114L 150 198"/>
<path d="M 160 18L 160 42"/>
<path d="M 160 222L 160 318"/>
<path d="M 180 342L 180 450"/>

<!-- text --> 
<text x="30" y="33"><![CDATA[1st]]></text>
<text x="70" y="33"><![CDATA[quarter]]></text>
<text x="30" y="57"><![CDATA[2nd]]></text>
<text x="30" y="81"><![CDATA[3rd]]></text>
<text x="40" y="129"><![CDATA[container]]></text>
<text x="60" y="165"><![CDATA[part]]></text>
<text x="40" y="237"><![CDATA[Mail_Header]]></text>
<text x="60" y="261"><![CDATA[Body]]></text>
<text x="50" y="285"><![CDATA[a]]></text>
<text x="80" y="285"><![CDATA[a]]></text>
<text x="110" y="285"><![CDATA[a]]></text>
<text x="50" y="297"><![CDATA[1]]></text>
<text x="80" y="297"><![CDATA[2]]></text>
<text x="110" y="297"><![CDATA[3]]></text>
<text x="30" y="357"><![CDATA[header]]></text>
<text x="30" y="381"><![CDATA[c]]></text>
<text x="70" y="381"><![CDATA[col2]]></text>
<text x="160" y="381"><![CDATA[c]]></text>
<text x="30" y="393"><![CDATA[o]]></text>
<text x="160" y="393"><![CDATA[o]]></text>
<text x="30" y="405"><![CDATA[l]]></text>
<text x="160" y="405"><![CDATA[l]]></text>
<text x="30" y="417"><![CDATA[1]]></text>
<text x="160" y="417"><![CDATA[3]]></text>
<text x="70" y="441"><![CDATA[footer]]></text>
<text x="50" y="477"><![CDATA[stylesheets]]></text>
<text x="50" y="489"><![CDATA[docs]]></text>
<text x="90" y="501"><![CDATA[top_col_1]]></text>
<text x="90" y="513"><![CDATA[mid_col_1]]></text>
<text x="90" y="525"><![CDATA[mid_col_2]]></text>
<text x="90" y="537"><![CDATA[mid_col_3]]></text>
<text x="90" y="549"><![CDATA[mid_col_4]]></text>
<text x="90" y="561"><![CDATA[bottom_col_1]]></text>
<text x="50" y="573"><![CDATA[resources]]></text>
<text x="100" y="585"><![CDATA[styles]]></text>
<text x="100" y="597"><![CDATA[images]]></text>

Tests run: 2, Failures: 0, Errors: 0, Skipped: 0, Time elapsed: 0.108 sec

Results :

Tests run: 2, Failures: 0, Errors: 0, Skipped: 0

[INFO] [jar:jar]
[INFO] Building jar: /home/continuum/data/working-directory/51/blocks/cocoon-asciiart/cocoon-asciiart-impl/target/cocoon-asciiart-impl-1.0.0-SNAPSHOT.jar
[INFO] [install:install]
[INFO] Installing /home/continuum/data/working-directory/51/blocks/cocoon-asciiart/cocoon-asciiart-impl/target/cocoon-asciiart-impl-1.0.0-SNAPSHOT.jar to /home/continuum/.m2/repository/org/apache/cocoon/cocoon-asciiart-impl/1.0.0-SNAPSHOT/cocoon-asciiart-impl-1.0.0-SNAPSHOT.jar
[INFO] ----------------------------------------------------------------------------
[INFO] Building Asciiart Block Samples
[INFO]    task-segment: [clean, install]
[INFO] ----------------------------------------------------------------------------
[INFO] [clean:clean]
[INFO] Deleting directory /home/continuum/data/working-directory/51/blocks/cocoon-asciiart/cocoon-asciiart-sample/target
[INFO] Deleting directory /home/continuum/data/working-directory/51/blocks/cocoon-asciiart/cocoon-asciiart-sample/target/classes
[INFO] Deleting directory /home/continuum/data/working-directory/51/blocks/cocoon-asciiart/cocoon-asciiart-sample/target/test-classes
[INFO] Deleting directory /home/continuum/data/working-directory/51/blocks/cocoon-asciiart/cocoon-asciiart-sample/target/site
[INFO] [enforcer:enforce-once {execution: enforce-maven}]
[INFO] [resources:resources]
[INFO] Using default encoding to copy filtered resources.
[INFO] [compiler:compile]
[INFO] No sources to compile
[INFO] [resources:testResources]
[INFO] Using default encoding to copy filtered resources.
[INFO] [compiler:testCompile]
[INFO] No sources to compile
[INFO] [surefire:test]
[INFO] No tests to run.
[INFO] [jar:jar]
[INFO] Building jar: /home/continuum/data/working-directory/51/blocks/cocoon-asciiart/cocoon-asciiart-sample/target/cocoon-asciiart-sample-1.0.0-SNAPSHOT.jar
[INFO] [install:install]
[INFO] Installing /home/continuum/data/working-directory/51/blocks/cocoon-asciiart/cocoon-asciiart-sample/target/cocoon-asciiart-sample-1.0.0-SNAPSHOT.jar to /home/continuum/.m2/repository/org/apache/cocoon/cocoon-asciiart-sample/1.0.0-SNAPSHOT/cocoon-asciiart-sample-1.0.0-SNAPSHOT.jar
[INFO] ----------------------------------------------------------------------------
[INFO] Building cocoon-acegisecurity
[INFO]    task-segment: [clean, install]
[INFO] ----------------------------------------------------------------------------
[INFO] [clean:clean]
[INFO] Deleting directory /home/continuum/data/working-directory/51/blocks/cocoon-auth/cocoon-acegisecurity-sample/target
[INFO] Deleting directory /home/continuum/data/working-directory/51/blocks/cocoon-auth/cocoon-acegisecurity-sample/target/classes
[INFO] Deleting directory /home/continuum/data/working-directory/51/blocks/cocoon-auth/cocoon-acegisecurity-sample/target/test-classes
[INFO] Deleting directory /home/continuum/data/working-directory/51/blocks/cocoon-auth/cocoon-acegisecurity-sample/target/site
[INFO] [enforcer:enforce-once {execution: enforce-maven}]
[INFO] [resources:resources]
[INFO] Using default encoding to copy filtered resources.
Downloading: http://repo1.maven.org/maven2/org/springframework/spring-dao/2.4.1/spring-dao-2.4.1.pom
[INFO] [compiler:compile]
[INFO] Nothing to compile - all classes are up to date
[INFO] Preparing cocoon:rcl
[WARNING] Removing: rcl from forked lifecycle, to prevent recursive invocation.
[INFO] [enforcer:enforce-once {execution: enforce-maven}]
[INFO] [resources:resources]
[INFO] Using default encoding to copy filtered resources.
[INFO] [compiler:compile]
[INFO] Nothing to compile - all classes are up to date
[INFO] [cocoon:rcl {execution: rcl}]
[INFO] Creating a reloading Cocoon web application.
[INFO] Deploying string-template to WEB-INF/log4j.xml
[INFO] Adding lib to WEB-INF/lib: org.apache.commons:commons-jci-core:1.0:jar
[INFO] Adding lib to WEB-INF/lib: commons-logging:commons-logging:1.1:jar
[INFO] Adding lib to WEB-INF/lib: javax.servlet:servlet-api:2.3:jar
[INFO] Adding lib to WEB-INF/lib: org.apache.commons:commons-jci-fam:1.0:jar
[INFO] Adding lib to WEB-INF/lib: commons-logging:commons-logging-api:1.1:jar
[INFO] Adding lib to WEB-INF/lib: org.apache.cocoon:cocoon-rcl-webapp-wrapper:1.0.0-M1:jar
[INFO] Adding lib to WEB-INF/lib: log4j:log4j:1.2.14:jar
[INFO] Adding lib to WEB-INF/lib: commons-io:commons-io:1.3.1:jar
[INFO] Adding xpatch: /home/continuum/data/working-directory/51/blocks/cocoon-auth/cocoon-acegisecurity-sample/./src/main/resources/META-INF/cocoon/xpatch/acegi-filter-patch.xweb
[INFO] Applying patches to: WEB-INF/web.xml
[INFO] [resources:testResources]
[INFO] Using default encoding to copy filtered resources.
[INFO] [compiler:testCompile]
[INFO] No sources to compile
[INFO] [surefire:test]
[INFO] No tests to run.
[INFO] [jar:jar]
[INFO] Building jar: /home/continuum/data/working-directory/51/blocks/cocoon-auth/cocoon-acegisecurity-sample/target/cocoon-acegisecurity-sample-1.0.0-SNAPSHOT.jar
[INFO] [install:install]
[INFO] Installing /home/continuum/data/working-directory/51/blocks/cocoon-auth/cocoon-acegisecurity-sample/target/cocoon-acegisecurity-sample-1.0.0-SNAPSHOT.jar to /home/continuum/.m2/repository/org/apache/cocoon/cocoon-acegisecurity-sample/1.0.0-SNAPSHOT/cocoon-acegisecurity-sample-1.0.0-SNAPSHOT.jar
[INFO] ----------------------------------------------------------------------------
[INFO] Building Cocoon Authentication Block API
[INFO]    task-segment: [clean, install]
[INFO] ----------------------------------------------------------------------------
[INFO] [clean:clean]
[INFO] Deleting directory /home/continuum/data/working-directory/51/blocks/cocoon-auth/cocoon-auth-api/target
[INFO] Deleting directory /home/continuum/data/working-directory/51/blocks/cocoon-auth/cocoon-auth-api/target/classes
[INFO] Deleting directory /home/continuum/data/working-directory/51/blocks/cocoon-auth/cocoon-auth-api/target/test-classes
[INFO] Deleting directory /home/continuum/data/working-directory/51/blocks/cocoon-auth/cocoon-auth-api/target/site
[INFO] [enforcer:enforce-once {execution: enforce-maven}]
[INFO] [resources:resources]
[INFO] Using default encoding to copy filtered resources.
[INFO] [compiler:compile]
[INFO] Compiling 7 source files to /home/continuum/data/working-directory/51/blocks/cocoon-auth/cocoon-auth-api/target/classes
[INFO] [resources:testResources]
[INFO] Using default encoding to copy filtered resources.
[INFO] [compiler:testCompile]
[INFO] No sources to compile
[INFO] [surefire:test]
[INFO] No tests to run.
[INFO] [jar:jar]
[INFO] Building jar: /home/continuum/data/working-directory/51/blocks/cocoon-auth/cocoon-auth-api/target/cocoon-auth-api-1.1.0-SNAPSHOT.jar
[INFO] [install:install]
[INFO] Installing /home/continuum/data/working-directory/51/blocks/cocoon-auth/cocoon-auth-api/target/cocoon-auth-api-1.1.0-SNAPSHOT.jar to /home/continuum/.m2/repository/org/apache/cocoon/cocoon-auth-api/1.1.0-SNAPSHOT/cocoon-auth-api-1.1.0-SNAPSHOT.jar
[INFO] ----------------------------------------------------------------------------
[INFO] Building Cocoon Authentication Block Implementation
[INFO]    task-segment: [clean, install]
[INFO] ----------------------------------------------------------------------------
[INFO] [clean:clean]
[INFO] Deleting directory /home/continuum/data/working-directory/51/blocks/cocoon-auth/cocoon-auth-impl/target
[INFO] Deleting directory /home/continuum/data/working-directory/51/blocks/cocoon-auth/cocoon-auth-impl/target/classes
[INFO] Deleting directory /home/continuum/data/working-directory/51/blocks/cocoon-auth/cocoon-auth-impl/target/test-classes
[INFO] Deleting directory /home/continuum/data/working-directory/51/blocks/cocoon-auth/cocoon-auth-impl/target/site
[INFO] [enforcer:enforce-once {execution: enforce-maven}]
[INFO] [resources:resources]
[INFO] Using default encoding to copy filtered resources.
[INFO] [compiler:compile]
[INFO] Compiling 17 source files to /home/continuum/data/working-directory/51/blocks/cocoon-auth/cocoon-auth-impl/target/classes
[INFO] [resources:testResources]
[INFO] Using default encoding to copy filtered resources.
[INFO] [compiler:testCompile]
[INFO] No sources to compile
[INFO] [surefire:test]
[INFO] No tests to run.
[INFO] [jar:jar]
[INFO] Building jar: /home/continuum/data/working-directory/51/blocks/cocoon-auth/cocoon-auth-impl/target/cocoon-auth-impl-1.1.0-SNAPSHOT.jar
[INFO] [install:install]
[INFO] Installing /home/continuum/data/working-directory/51/blocks/cocoon-auth/cocoon-auth-impl/target/cocoon-auth-impl-1.1.0-SNAPSHOT.jar to /home/continuum/.m2/repository/org/apache/cocoon/cocoon-auth-impl/1.1.0-SNAPSHOT/cocoon-auth-impl-1.1.0-SNAPSHOT.jar
[INFO] ----------------------------------------------------------------------------
[INFO] Building Cocoon Authentication Block Sample
[INFO]    task-segment: [clean, install]
[INFO] ----------------------------------------------------------------------------
[INFO] [clean:clean]
[INFO] Deleting directory /home/continuum/data/working-directory/51/blocks/cocoon-auth/cocoon-auth-sample/target
[INFO] Deleting directory /home/continuum/data/working-directory/51/blocks/cocoon-auth/cocoon-auth-sample/target/classes
[INFO] Deleting directory /home/continuum/data/working-directory/51/blocks/cocoon-auth/cocoon-auth-sample/target/test-classes
[INFO] Deleting directory /home/continuum/data/working-directory/51/blocks/cocoon-auth/cocoon-auth-sample/target/site
[INFO] [enforcer:enforce-once {execution: enforce-maven}]
[INFO] [resources:resources]
[INFO] Using default encoding to copy filtered resources.
[INFO] [compiler:compile]
[INFO] No sources to compile
[INFO] [resources:testResources]
[INFO] Using default encoding to copy filtered resources.
[INFO] [compiler:testCompile]
[INFO] No sources to compile
[INFO] [surefire:test]
[INFO] No tests to run.
[INFO] [jar:jar]
[INFO] Building jar: /home/continuum/data/working-directory/51/blocks/cocoon-auth/cocoon-auth-sample/target/cocoon-auth-sample-1.0.0-SNAPSHOT.jar
[INFO] [install:install]
[INFO] Installing /home/continuum/data/working-directory/51/blocks/cocoon-auth/cocoon-auth-sample/target/cocoon-auth-sample-1.0.0-SNAPSHOT.jar to /home/continuum/.m2/repository/org/apache/cocoon/cocoon-auth-sample/1.0.0-SNAPSHOT/cocoon-auth-sample-1.0.0-SNAPSHOT.jar
[INFO] ----------------------------------------------------------------------------
[INFO] Building Authentication Framework Implementation
[INFO]    task-segment: [clean, install]
[INFO] ----------------------------------------------------------------------------
[INFO] [clean:clean]
[INFO] Deleting directory /home/continuum/data/working-directory/51/blocks/cocoon-authentication-fw/cocoon-authentication-fw-impl/target
[INFO] Deleting directory /home/continuum/data/working-directory/51/blocks/cocoon-authentication-fw/cocoon-authentication-fw-impl/target/classes
[INFO] Deleting directory /home/continuum/data/working-directory/51/blocks/cocoon-authentication-fw/cocoon-authentication-fw-impl/target/test-classes
[INFO] Deleting directory /home/continuum/data/working-directory/51/blocks/cocoon-authentication-fw/cocoon-authentication-fw-impl/target/site
[INFO] [enforcer:enforce-once {execution: enforce-maven}]
[INFO] [resources:resources]
[INFO] Using default encoding to copy filtered resources.
[INFO] [compiler:compile]
[INFO] Compiling 20 source files to /home/continuum/data/working-directory/51/blocks/cocoon-authentication-fw/cocoon-authentication-fw-impl/target/classes
[INFO] [resources:testResources]
[INFO] Using default encoding to copy filtered resources.
[INFO] [compiler:testCompile]
[INFO] No sources to compile
[INFO] [surefire:test]
[INFO] No tests to run.
[INFO] [jar:jar]
[INFO] Building jar: /home/continuum/data/working-directory/51/blocks/cocoon-authentication-fw/cocoon-authentication-fw-impl/target/cocoon-authentication-fw-impl-1.0.0-SNAPSHOT.jar
[INFO] [install:install]
[INFO] Installing /home/continuum/data/working-directory/51/blocks/cocoon-authentication-fw/cocoon-authentication-fw-impl/target/cocoon-authentication-fw-impl-1.0.0-SNAPSHOT.jar to /home/continuum/.m2/repository/org/apache/cocoon/cocoon-authentication-fw-impl/1.0.0-SNAPSHOT/cocoon-authentication-fw-impl-1.0.0-SNAPSHOT.jar
[INFO] ----------------------------------------------------------------------------
[INFO] Building Authentication Framework Sample Application
[INFO]    task-segment: [clean, install]
[INFO] ----------------------------------------------------------------------------
[INFO] [clean:clean]
[INFO] Deleting directory /home/continuum/data/working-directory/51/blocks/cocoon-authentication-fw/cocoon-authentication-fw-sample/target
[INFO] Deleting directory /home/continuum/data/working-directory/51/blocks/cocoon-authentication-fw/cocoon-authentication-fw-sample/target/classes
[INFO] Deleting directory /home/continuum/data/working-directory/51/blocks/cocoon-authentication-fw/cocoon-authentication-fw-sample/target/test-classes
[INFO] Deleting directory /home/continuum/data/working-directory/51/blocks/cocoon-authentication-fw/cocoon-authentication-fw-sample/target/site
[INFO] [enforcer:enforce-once {execution: enforce-maven}]
[INFO] [resources:resources]
[INFO] Using default encoding to copy filtered resources.
[INFO] [compiler:compile]
[INFO] No sources to compile
[INFO] [resources:testResources]
[INFO] Using default encoding to copy filtered resources.
[INFO] [compiler:testCompile]
[INFO] No sources to compile
[INFO] [surefire:test]
[INFO] No tests to run.
[INFO] [jar:jar]
[INFO] Building jar: /home/continuum/data/working-directory/51/blocks/cocoon-authentication-fw/cocoon-authentication-fw-sample/target/cocoon-authentication-fw-sample-1.0.0-SNAPSHOT.jar
[INFO] [install:install]
[INFO] Installing /home/continuum/data/working-directory/51/blocks/cocoon-authentication-fw/cocoon-authentication-fw-sample/target/cocoon-authentication-fw-sample-1.0.0-SNAPSHOT.jar to /home/continuum/.m2/repository/org/apache/cocoon/cocoon-authentication-fw-sample/1.0.0-SNAPSHOT/cocoon-authentication-fw-sample-1.0.0-SNAPSHOT.jar
[INFO] ----------------------------------------------------------------------------
[INFO] Building Axis Block Implementation
[INFO]    task-segment: [clean, install]
[INFO] ----------------------------------------------------------------------------
[INFO] [clean:clean]
[INFO] Deleting directory /home/continuum/data/working-directory/51/blocks/cocoon-axis/cocoon-axis-impl/target
[INFO] Deleting directory /home/continuum/data/working-directory/51/blocks/cocoon-axis/cocoon-axis-impl/target/classes
[INFO] Deleting directory /home/continuum/data/working-directory/51/blocks/cocoon-axis/cocoon-axis-impl/target/test-classes
[INFO] Deleting directory /home/continuum/data/working-directory/51/blocks/cocoon-axis/cocoon-axis-impl/target/site
[INFO] [enforcer:enforce-once {execution: enforce-maven}]
[INFO] [resources:resources]
[INFO] Using default encoding to copy filtered resources.
[INFO] [compiler:compile]
[INFO] Compiling 8 source files to /home/continuum/data/working-directory/51/blocks/cocoon-axis/cocoon-axis-impl/target/classes
[INFO] [resources:testResources]
[INFO] Using default encoding to copy filtered resources.
[INFO] [compiler:testCompile]
[INFO] No sources to compile
[INFO] [surefire:test]
[INFO] No tests to run.
[INFO] [jar:jar]
[INFO] Building jar: /home/continuum/data/working-directory/51/blocks/cocoon-axis/cocoon-axis-impl/target/cocoon-axis-impl-1.0.0-SNAPSHOT.jar
[INFO] [install:install]
[INFO] Installing /home/continuum/data/working-directory/51/blocks/cocoon-axis/cocoon-axis-impl/target/cocoon-axis-impl-1.0.0-SNAPSHOT.jar to /home/continuum/.m2/repository/org/apache/cocoon/cocoon-axis-impl/1.0.0-SNAPSHOT/cocoon-axis-impl-1.0.0-SNAPSHOT.jar
[INFO] ----------------------------------------------------------------------------
[INFO] Building Axis Block Samples
[INFO]    task-segment: [clean, install]
[INFO] ----------------------------------------------------------------------------
[INFO] [clean:clean]
[INFO] Deleting directory /home/continuum/data/working-directory/51/blocks/cocoon-axis/cocoon-axis-sample/target
[INFO] Deleting directory /home/continuum/data/working-directory/51/blocks/cocoon-axis/cocoon-axis-sample/target/classes
[INFO] Deleting directory /home/continuum/data/working-directory/51/blocks/cocoon-axis/cocoon-axis-sample/target/test-classes
[INFO] Deleting directory /home/continuum/data/working-directory/51/blocks/cocoon-axis/cocoon-axis-sample/target/site
[INFO] [enforcer:enforce-once {execution: enforce-maven}]
[INFO] [resources:resources]
[INFO] Using default encoding to copy filtered resources.
[INFO] [compiler:compile]
[INFO] No sources to compile
[INFO] [resources:testResources]
[INFO] Using default encoding to copy filtered resources.
[INFO] [compiler:testCompile]
[INFO] No sources to compile
[INFO] [surefire:test]
[INFO] No tests to run.
[INFO] [jar:jar]
[INFO] Building jar: /home/continuum/data/working-directory/51/blocks/cocoon-axis/cocoon-axis-sample/target/cocoon-axis-sample-1.0.0-SNAPSHOT.jar
[INFO] [install:install]
[INFO] Installing /home/continuum/data/working-directory/51/blocks/cocoon-axis/cocoon-axis-sample/target/cocoon-axis-sample-1.0.0-SNAPSHOT.jar to /home/continuum/.m2/repository/org/apache/cocoon/cocoon-axis-sample/1.0.0-SNAPSHOT/cocoon-axis-sample-1.0.0-SNAPSHOT.jar
[INFO] ----------------------------------------------------------------------------
[INFO] Building Bsf Block Implementation
[INFO]    task-segment: [clean, install]
[INFO] ----------------------------------------------------------------------------
[INFO] [clean:clean]
[INFO] Deleting directory /home/continuum/data/working-directory/51/blocks/cocoon-bsf/cocoon-bsf-impl/target
[INFO] Deleting directory /home/continuum/data/working-directory/51/blocks/cocoon-bsf/cocoon-bsf-impl/target/classes
[INFO] Deleting directory /home/continuum/data/working-directory/51/blocks/cocoon-bsf/cocoon-bsf-impl/target/test-classes
[INFO] Deleting directory /home/continuum/data/working-directory/51/blocks/cocoon-bsf/cocoon-bsf-impl/target/site
[INFO] [enforcer:enforce-once {execution: enforce-maven}]
[INFO] [resources:resources]
[INFO] Using default encoding to copy filtered resources.
[INFO] [compiler:compile]
[INFO] Compiling 2 source files to /home/continuum/data/working-directory/51/blocks/cocoon-bsf/cocoon-bsf-impl/target/classes
[INFO] [resources:testResources]
[INFO] Using default encoding to copy filtered resources.
[INFO] [compiler:testCompile]
[INFO] No sources to compile
[INFO] [surefire:test]
[INFO] No tests to run.
[INFO] [jar:jar]
[INFO] Building jar: /home/continuum/data/working-directory/51/blocks/cocoon-bsf/cocoon-bsf-impl/target/cocoon-bsf-impl-1.0.0-SNAPSHOT.jar
[INFO] [install:install]
[INFO] Installing /home/continuum/data/working-directory/51/blocks/cocoon-bsf/cocoon-bsf-impl/target/cocoon-bsf-impl-1.0.0-SNAPSHOT.jar to /home/continuum/.m2/repository/org/apache/cocoon/cocoon-bsf-impl/1.0.0-SNAPSHOT/cocoon-bsf-impl-1.0.0-SNAPSHOT.jar
[INFO] ----------------------------------------------------------------------------
[INFO] Building Bsf Block Samples
[INFO]    task-segment: [clean, install]
[INFO] ----------------------------------------------------------------------------
[INFO] [clean:clean]
[INFO] Deleting directory /home/continuum/data/working-directory/51/blocks/cocoon-bsf/cocoon-bsf-sample/target
[INFO] Deleting directory /home/continuum/data/working-directory/51/blocks/cocoon-bsf/cocoon-bsf-sample/target/classes
[INFO] Deleting directory /home/continuum/data/working-directory/51/blocks/cocoon-bsf/cocoon-bsf-sample/target/test-classes
[INFO] Deleting directory /home/continuum/data/working-directory/51/blocks/cocoon-bsf/cocoon-bsf-sample/target/site
[INFO] [enforcer:enforce-once {execution: enforce-maven}]
[INFO] [resources:resources]
[INFO] Using default encoding to copy filtered resources.
[INFO] [compiler:compile]
[INFO] No sources to compile
[INFO] [resources:testResources]
[INFO] Using default encoding to copy filtered resources.
[INFO] [compiler:testCompile]
[INFO] No sources to compile
[INFO] [surefire:test]
[INFO] No tests to run.
[INFO] [jar:jar]
[INFO] Building jar: /home/continuum/data/working-directory/51/blocks/cocoon-bsf/cocoon-bsf-sample/target/cocoon-bsf-sample-1.0.0-SNAPSHOT.jar
[INFO] [install:install]
[INFO] Installing /home/continuum/data/working-directory/51/blocks/cocoon-bsf/cocoon-bsf-sample/target/cocoon-bsf-sample-1.0.0-SNAPSHOT.jar to /home/continuum/.m2/repository/org/apache/cocoon/cocoon-bsf-sample/1.0.0-SNAPSHOT/cocoon-bsf-sample-1.0.0-SNAPSHOT.jar
[INFO] ----------------------------------------------------------------------------
[INFO] Building Cocoon Captcha Block Implementation
[INFO]    task-segment: [clean, install]
[INFO] ----------------------------------------------------------------------------
[INFO] [clean:clean]
[INFO] Deleting directory /home/continuum/data/working-directory/51/blocks/cocoon-captcha/cocoon-captcha-impl/target
[INFO] Deleting directory /home/continuum/data/working-directory/51/blocks/cocoon-captcha/cocoon-captcha-impl/target/classes
[INFO] Deleting directory /home/continuum/data/working-directory/51/blocks/cocoon-captcha/cocoon-captcha-impl/target/test-classes
[INFO] Deleting directory /home/continuum/data/working-directory/51/blocks/cocoon-captcha/cocoon-captcha-impl/target/site
[INFO] [enforcer:enforce-once {execution: enforce-maven}]
[INFO] [resources:resources]
[INFO] Using default encoding to copy filtered resources.
[INFO] [compiler:compile]
[INFO] Compiling 1 source file to /home/continuum/data/working-directory/51/blocks/cocoon-captcha/cocoon-captcha-impl/target/classes
[INFO] [resources:testResources]
[INFO] Using default encoding to copy filtered resources.
[INFO] [compiler:testCompile]
[INFO] No sources to compile
[INFO] [surefire:test]
[INFO] No tests to run.
[INFO] [jar:jar]
[INFO] Building jar: /home/continuum/data/working-directory/51/blocks/cocoon-captcha/cocoon-captcha-impl/target/cocoon-captcha-impl-1.1.0-SNAPSHOT.jar
[INFO] [install:install]
[INFO] Installing /home/continuum/data/working-directory/51/blocks/cocoon-captcha/cocoon-captcha-impl/target/cocoon-captcha-impl-1.1.0-SNAPSHOT.jar to /home/continuum/.m2/repository/org/apache/cocoon/cocoon-captcha-impl/1.1.0-SNAPSHOT/cocoon-captcha-impl-1.1.0-SNAPSHOT.jar
[INFO] ----------------------------------------------------------------------------
[INFO] Building Cocoon Captcha Block Sample
[INFO]    task-segment: [clean, install]
[INFO] ----------------------------------------------------------------------------
[INFO] [clean:clean]
[INFO] Deleting directory /home/continuum/data/working-directory/51/blocks/cocoon-captcha/cocoon-captcha-sample/target
[INFO] Deleting directory /home/continuum/data/working-directory/51/blocks/cocoon-captcha/cocoon-captcha-sample/target/classes
[INFO] Deleting directory /home/continuum/data/working-directory/51/blocks/cocoon-captcha/cocoon-captcha-sample/target/test-classes
[INFO] Deleting directory /home/continuum/data/working-directory/51/blocks/cocoon-captcha/cocoon-captcha-sample/target/site
[INFO] [enforcer:enforce-once {execution: enforce-maven}]
[INFO] [resources:resources]
[INFO] Using default encoding to copy filtered resources.
[INFO] [compiler:compile]
[INFO] No sources to compile
[INFO] [resources:testResources]
[INFO] Using default encoding to copy filtered resources.
[INFO] [compiler:testCompile]
[INFO] No sources to compile
[INFO] [surefire:test]
[INFO] No tests to run.
[INFO] [jar:jar]
[INFO] Building jar: /home/continuum/data/working-directory/51/blocks/cocoon-captcha/cocoon-captcha-sample/target/cocoon-captcha-sample-1.0.0-SNAPSHOT.jar
[INFO] [install:install]
[INFO] Installing /home/continuum/data/working-directory/51/blocks/cocoon-captcha/cocoon-captcha-sample/target/cocoon-captcha-sample-1.0.0-SNAPSHOT.jar to /home/continuum/.m2/repository/org/apache/cocoon/cocoon-captcha-sample/1.0.0-SNAPSHOT/cocoon-captcha-sample-1.0.0-SNAPSHOT.jar
[INFO] ----------------------------------------------------------------------------
[INFO] Building Chaperon Block Implementation
[INFO]    task-segment: [clean, install]
[INFO] ----------------------------------------------------------------------------
[INFO] [clean:clean]
[INFO] Deleting directory /home/continuum/data/working-directory/51/blocks/cocoon-chaperon/cocoon-chaperon-impl/target
[INFO] Deleting directory /home/continuum/data/working-directory/51/blocks/cocoon-chaperon/cocoon-chaperon-impl/target/classes
[INFO] Deleting directory /home/continuum/data/working-directory/51/blocks/cocoon-chaperon/cocoon-chaperon-impl/target/test-classes
[INFO] Deleting directory /home/continuum/data/working-directory/51/blocks/cocoon-chaperon/cocoon-chaperon-impl/target/site
[INFO] [enforcer:enforce-once {execution: enforce-maven}]
[INFO] [resources:resources]
[INFO] Using default encoding to copy filtered resources.
[INFO] [compiler:compile]
[INFO] Compiling 6 source files to /home/continuum/data/working-directory/51/blocks/cocoon-chaperon/cocoon-chaperon-impl/target/classes
[INFO] [resources:testResources]
[INFO] Using default encoding to copy filtered resources.
[INFO] [compiler:testCompile]
[INFO] Compiling 4 source files to /home/continuum/data/working-directory/51/blocks/cocoon-chaperon/cocoon-chaperon-impl/target/test-classes
[INFO] [surefire:test]
[INFO] Surefire report directory: /home/continuum/data/working-directory/51/blocks/cocoon-chaperon/cocoon-chaperon-impl/target/surefire-reports

-------------------------------------------------------
 T E S T S
-------------------------------------------------------
Running org.apache.cocoon.generation.TextGeneratorTestCase
log4j:WARN No appenders could be found for logger (org.springframework.util.ClassUtils).
log4j:WARN Please initialize the log4j system properly.
Tests run: 2, Failures: 0, Errors: 0, Skipped: 0, Time elapsed: 1.083 sec
Running org.apache.cocoon.transformation.PatternTransformerTestCase
Tests run: 1, Failures: 0, Errors: 0, Skipped: 0, Time elapsed: 0.226 sec
Running org.apache.cocoon.transformation.LexicalTransformerTestCase
Tests run: 2, Failures: 0, Errors: 0, Skipped: 0, Time elapsed: 0.249 sec
Running org.apache.cocoon.transformation.ParserTransformerTestCase
Tests run: 2, Failures: 0, Errors: 0, Skipped: 0, Time elapsed: 0.303 sec

Results :

Tests run: 7, Failures: 0, Errors: 0, Skipped: 0

[INFO] [jar:jar]
[INFO] Building jar: /home/continuum/data/working-directory/51/blocks/cocoon-chaperon/cocoon-chaperon-impl/target/cocoon-chaperon-impl-1.0.0-SNAPSHOT.jar
[INFO] [install:install]
[INFO] Installing /home/continuum/data/working-directory/51/blocks/cocoon-chaperon/cocoon-chaperon-impl/target/cocoon-chaperon-impl-1.0.0-SNAPSHOT.jar to /home/continuum/.m2/repository/org/apache/cocoon/cocoon-chaperon-impl/1.0.0-SNAPSHOT/cocoon-chaperon-impl-1.0.0-SNAPSHOT.jar
[INFO] ----------------------------------------------------------------------------
[INFO] Building Chaperon Block Samples
[INFO]    task-segment: [clean, install]
[INFO] ----------------------------------------------------------------------------
[INFO] [clean:clean]
[INFO] Deleting directory /home/continuum/data/working-directory/51/blocks/cocoon-chaperon/cocoon-chaperon-sample/target
[INFO] Deleting directory /home/continuum/data/working-directory/51/blocks/cocoon-chaperon/cocoon-chaperon-sample/target/classes
[INFO] Deleting directory /home/continuum/data/working-directory/51/blocks/cocoon-chaperon/cocoon-chaperon-sample/target/test-classes
[INFO] Deleting directory /home/continuum/data/working-directory/51/blocks/cocoon-chaperon/cocoon-chaperon-sample/target/site
[INFO] [enforcer:enforce-once {execution: enforce-maven}]
[INFO] [resources:resources]
[INFO] Using default encoding to copy filtered resources.
[INFO] [compiler:compile]
[INFO] No sources to compile
[INFO] [resources:testResources]
[INFO] Using default encoding to copy filtered resources.
[INFO] [compiler:testCompile]
[INFO] No sources to compile
[INFO] [surefire:test]
[INFO] No tests to run.
[INFO] [jar:jar]
[INFO] Building jar: /home/continuum/data/working-directory/51/blocks/cocoon-chaperon/cocoon-chaperon-sample/target/cocoon-chaperon-sample-1.0.0-SNAPSHOT.jar
[INFO] [install:install]
[INFO] Installing /home/continuum/data/working-directory/51/blocks/cocoon-chaperon/cocoon-chaperon-sample/target/cocoon-chaperon-sample-1.0.0-SNAPSHOT.jar to /home/continuum/.m2/repository/org/apache/cocoon/cocoon-chaperon-sample/1.0.0-SNAPSHOT/cocoon-chaperon-sample-1.0.0-SNAPSHOT.jar
[INFO] ----------------------------------------------------------------------------
[INFO] Building Cron block implementation
[INFO]    task-segment: [clean, install]
[INFO] ----------------------------------------------------------------------------
[INFO] [clean:clean]
[INFO] Deleting directory /home/continuum/data/working-directory/51/blocks/cocoon-cron/cocoon-cron-impl/target
[INFO] Deleting directory /home/continuum/data/working-directory/51/blocks/cocoon-cron/cocoon-cron-impl/target/classes
[INFO] Deleting directory /home/continuum/data/working-directory/51/blocks/cocoon-cron/cocoon-cron-impl/target/test-classes
[INFO] Deleting directory /home/continuum/data/working-directory/51/blocks/cocoon-cron/cocoon-cron-impl/target/site
[INFO] [enforcer:enforce-once {execution: enforce-maven}]
[INFO] [resources:resources]
[INFO] Using default encoding to copy filtered resources.
[INFO] [compiler:compile]
[INFO] Compiling 16 source files to /home/continuum/data/working-directory/51/blocks/cocoon-cron/cocoon-cron-impl/target/classes
[INFO] [resources:testResources]
[INFO] Using default encoding to copy filtered resources.
[INFO] [compiler:testCompile]
[INFO] No sources to compile
[INFO] [surefire:test]
[INFO] No tests to run.
[INFO] [jar:jar]
[INFO] Building jar: /home/continuum/data/working-directory/51/blocks/cocoon-cron/cocoon-cron-impl/target/cocoon-cron-impl-1.0.0-SNAPSHOT.jar
[INFO] [install:install]
[INFO] Installing /home/continuum/data/working-directory/51/blocks/cocoon-cron/cocoon-cron-impl/target/cocoon-cron-impl-1.0.0-SNAPSHOT.jar to /home/continuum/.m2/repository/org/apache/cocoon/cocoon-cron-impl/1.0.0-SNAPSHOT/cocoon-cron-impl-1.0.0-SNAPSHOT.jar
[INFO] ----------------------------------------------------------------------------
[INFO] Building Cron Block Samples
[INFO]    task-segment: [clean, install]
[INFO] ----------------------------------------------------------------------------
[INFO] [clean:clean]
[INFO] Deleting directory /home/continuum/data/working-directory/51/blocks/cocoon-cron/cocoon-cron-sample/target
[INFO] Deleting directory /home/continuum/data/working-directory/51/blocks/cocoon-cron/cocoon-cron-sample/target/classes
[INFO] Deleting directory /home/continuum/data/working-directory/51/blocks/cocoon-cron/cocoon-cron-sample/target/test-classes
[INFO] Deleting directory /home/continuum/data/working-directory/51/blocks/cocoon-cron/cocoon-cron-sample/target/site
[INFO] [enforcer:enforce-once {execution: enforce-maven}]
[INFO] [resources:resources]
[INFO] Using default encoding to copy filtered resources.
[INFO] [compiler:compile]
[INFO] No sources to compile
[INFO] [resources:testResources]
[INFO] Using default encoding to copy filtered resources.
[INFO] [compiler:testCompile]
[INFO] No sources to compile
[INFO] [surefire:test]
[INFO] No tests to run.
[INFO] [jar:jar]
[INFO] Building jar: /home/continuum/data/working-directory/51/blocks/cocoon-cron/cocoon-cron-sample/target/cocoon-cron-sample-1.0.0-SNAPSHOT.jar
[INFO] [install:install]
[INFO] Installing /home/continuum/data/working-directory/51/blocks/cocoon-cron/cocoon-cron-sample/target/cocoon-cron-sample-1.0.0-SNAPSHOT.jar to /home/continuum/.m2/repository/org/apache/cocoon/cocoon-cron-sample/1.0.0-SNAPSHOT/cocoon-cron-sample-1.0.0-SNAPSHOT.jar
[INFO] ----------------------------------------------------------------------------
[INFO] Building Cocoon Database Block Mocks
[INFO]    task-segment: [clean, install]
[INFO] ----------------------------------------------------------------------------
[INFO] [clean:clean]
[INFO] Deleting directory /home/continuum/data/working-directory/51/blocks/cocoon-databases/cocoon-databases-mocks/target
[INFO] Deleting directory /home/continuum/data/working-directory/51/blocks/cocoon-databases/cocoon-databases-mocks/target/classes
[INFO] Deleting directory /home/continuum/data/working-directory/51/blocks/cocoon-databases/cocoon-databases-mocks/target/test-classes
[INFO] Deleting directory /home/continuum/data/working-directory/51/blocks/cocoon-databases/cocoon-databases-mocks/target/site
[INFO] [enforcer:enforce-once {execution: enforce-maven}]
[INFO] [resources:resources]
[INFO] Using default encoding to copy filtered resources.
[INFO] [compiler:compile]
[INFO] Compiling 5 source files to /home/continuum/data/working-directory/51/blocks/cocoon-databases/cocoon-databases-mocks/target/classes
[INFO] [resources:testResources]
[INFO] Using default encoding to copy filtered resources.
[INFO] [compiler:testCompile]
[INFO] Nothing to compile - all classes are up to date
[INFO] [surefire:test]
[INFO] No tests to run.
[INFO] [jar:jar]
[INFO] Building jar: /home/continuum/data/working-directory/51/blocks/cocoon-databases/cocoon-databases-mocks/target/cocoon-databases-mocks-1.1.0-SNAPSHOT.jar
[INFO] [install:install]
[INFO] Installing /home/continuum/data/working-directory/51/blocks/cocoon-databases/cocoon-databases-mocks/target/cocoon-databases-mocks-1.1.0-SNAPSHOT.jar to /home/continuum/.m2/repository/org/apache/cocoon/cocoon-databases-mocks/1.1.0-SNAPSHOT/cocoon-databases-mocks-1.1.0-SNAPSHOT.jar
[INFO] ----------------------------------------------------------------------------
[INFO] Building Cocoon Database Block Bridge for Avalon components
[INFO]    task-segment: [clean, install]
[INFO] ----------------------------------------------------------------------------
[INFO] [clean:clean]
[INFO] Deleting directory /home/continuum/data/working-directory/51/blocks/cocoon-databases/cocoon-databases-bridge/target
[INFO] Deleting directory /home/continuum/data/working-directory/51/blocks/cocoon-databases/cocoon-databases-bridge/target/classes
[INFO] Deleting directory /home/continuum/data/working-directory/51/blocks/cocoon-databases/cocoon-databases-bridge/target/test-classes
[INFO] Deleting directory /home/continuum/data/working-directory/51/blocks/cocoon-databases/cocoon-databases-bridge/target/site
[INFO] [enforcer:enforce-once {execution: enforce-maven}]
[INFO] [resources:resources]
[INFO] Using default encoding to copy filtered resources.
[INFO] [compiler:compile]
[INFO] Compiling 2 source files to /home/continuum/data/working-directory/51/blocks/cocoon-databases/cocoon-databases-bridge/target/classes
[INFO] [resources:testResources]
[INFO] Using default encoding to copy filtered resources.
[INFO] [compiler:testCompile]
[INFO] Nothing to compile - all classes are up to date
[INFO] [surefire:test]
[INFO] No tests to run.
[INFO] [jar:jar]
[INFO] Building jar: /home/continuum/data/working-directory/51/blocks/cocoon-databases/cocoon-databases-bridge/target/cocoon-databases-bridge-1.1.0-SNAPSHOT.jar
[INFO] [install:install]
[INFO] Installing /home/continuum/data/working-directory/51/blocks/cocoon-databases/cocoon-databases-bridge/target/cocoon-databases-bridge-1.1.0-SNAPSHOT.jar to /home/continuum/.m2/repository/org/apache/cocoon/cocoon-databases-bridge/1.1.0-SNAPSHOT/cocoon-databases-bridge-1.1.0-SNAPSHOT.jar
[INFO] ----------------------------------------------------------------------------
[INFO] Building Cocoon Database Block Implementation
[INFO]    task-segment: [clean, install]
[INFO] ----------------------------------------------------------------------------
[INFO] [clean:clean]
[INFO] Deleting directory /home/continuum/data/working-directory/51/blocks/cocoon-databases/cocoon-databases-impl/target
[INFO] Deleting directory /home/continuum/data/working-directory/51/blocks/cocoon-databases/cocoon-databases-impl/target/classes
[INFO] Deleting directory /home/continuum/data/working-directory/51/blocks/cocoon-databases/cocoon-databases-impl/target/test-classes
[INFO] Deleting directory /home/continuum/data/working-directory/51/blocks/cocoon-databases/cocoon-databases-impl/target/site
[INFO] [enforcer:enforce-once {execution: enforce-maven}]
[INFO] [resources:resources]
[INFO] Using default encoding to copy filtered resources.
[INFO] [compiler:compile]
[INFO] Compiling 34 source files to /home/continuum/data/working-directory/51/blocks/cocoon-databases/cocoon-databases-impl/target/classes
[INFO] [resources:testResources]
[INFO] Using default encoding to copy filtered resources.
[INFO] [compiler:testCompile]
[INFO] Nothing to compile - all classes are up to date
[INFO] [surefire:test]
[INFO] No tests to run.
[INFO] [jar:jar]
[INFO] Building jar: /home/continuum/data/working-directory/51/blocks/cocoon-databases/cocoon-databases-impl/target/cocoon-databases-impl-1.1.0-SNAPSHOT.jar
[INFO] [install:install]
[INFO] Installing /home/continuum/data/working-directory/51/blocks/cocoon-databases/cocoon-databases-impl/target/cocoon-databases-impl-1.1.0-SNAPSHOT.jar to /home/continuum/.m2/repository/org/apache/cocoon/cocoon-databases-impl/1.1.0-SNAPSHOT/cocoon-databases-impl-1.1.0-SNAPSHOT.jar
[INFO] ----------------------------------------------------------------------------
[INFO] Building Cocoon Hsqldb Server Block Implementation
[INFO]    task-segment: [clean, install]
[INFO] ----------------------------------------------------------------------------
[INFO] [clean:clean]
[INFO] Deleting directory /home/continuum/data/working-directory/51/blocks/cocoon-databases/cocoon-databases-hsqldb-server/target
[INFO] Deleting directory /home/continuum/data/working-directory/51/blocks/cocoon-databases/cocoon-databases-hsqldb-server/target/classes
[INFO] Deleting directory /home/continuum/data/working-directory/51/blocks/cocoon-databases/cocoon-databases-hsqldb-server/target/test-classes
[INFO] Deleting directory /home/continuum/data/working-directory/51/blocks/cocoon-databases/cocoon-databases-hsqldb-server/target/site
[INFO] [enforcer:enforce-once {execution: enforce-maven}]
[INFO] [resources:resources]
[INFO] Using default encoding to copy filtered resources.
[INFO] [compiler:compile]
[INFO] Compiling 1 source file to /home/continuum/data/working-directory/51/blocks/cocoon-databases/cocoon-databases-hsqldb-server/target/classes
[INFO] [resources:testResources]
[INFO] Using default encoding to copy filtered resources.
[INFO] [compiler:testCompile]
[INFO] No sources to compile
[INFO] [surefire:test]
[INFO] No tests to run.
[INFO] [jar:jar]
[INFO] Building jar: /home/continuum/data/working-directory/51/blocks/cocoon-databases/cocoon-databases-hsqldb-server/target/cocoon-databases-hsqldb-server-1.1.0-SNAPSHOT.jar
[INFO] [install:install]
[INFO] Installing /home/continuum/data/working-directory/51/blocks/cocoon-databases/cocoon-databases-hsqldb-server/target/cocoon-databases-hsqldb-server-1.1.0-SNAPSHOT.jar to /home/continuum/.m2/repository/org/apache/cocoon/cocoon-databases-hsqldb-server/1.1.0-SNAPSHOT/cocoon-databases-hsqldb-server-1.1.0-SNAPSHOT.jar
[INFO] ----------------------------------------------------------------------------
[INFO] Building Cocoon Hsqldb Client Implementation
[INFO]    task-segment: [clean, install]
[INFO] ----------------------------------------------------------------------------
[INFO] [clean:clean]
[INFO] Deleting directory /home/continuum/data/working-directory/51/blocks/cocoon-databases/cocoon-databases-hsqldb-client/target
[INFO] Deleting directory /home/continuum/data/working-directory/51/blocks/cocoon-databases/cocoon-databases-hsqldb-client/target/classes
[INFO] Deleting directory /home/continuum/data/working-directory/51/blocks/cocoon-databases/cocoon-databases-hsqldb-client/target/test-classes
[INFO] Deleting directory /home/continuum/data/working-directory/51/blocks/cocoon-databases/cocoon-databases-hsqldb-client/target/site
[INFO] [enforcer:enforce-once {execution: enforce-maven}]
[INFO] [resources:resources]
[INFO] Using default encoding to copy filtered resources.
[INFO] [compiler:compile]
[INFO] No sources to compile
[INFO] [resources:testResources]
[INFO] Using default encoding to copy filtered resources.
[INFO] [compiler:testCompile]
[INFO] No sources to compile
[INFO] [surefire:test]
[INFO] No tests to run.
[INFO] [jar:jar]
[INFO] Building jar: /home/continuum/data/working-directory/51/blocks/cocoon-databases/cocoon-databases-hsqldb-client/target/cocoon-databases-hsqldb-client-1.1.0-SNAPSHOT.jar
[INFO] [install:install]
[INFO] Installing /home/continuum/data/working-directory/51/blocks/cocoon-databases/cocoon-databases-hsqldb-client/target/cocoon-databases-hsqldb-client-1.1.0-SNAPSHOT.jar to /home/continuum/.m2/repository/org/apache/cocoon/cocoon-databases-hsqldb-client/1.1.0-SNAPSHOT/cocoon-databases-hsqldb-client-1.1.0-SNAPSHOT.jar
[INFO] ----------------------------------------------------------------------------
[INFO] Building Cocoon Databases Block Samples
[INFO]    task-segment: [clean, install]
[INFO] ----------------------------------------------------------------------------
[INFO] [clean:clean]
[INFO] Deleting directory /home/continuum/data/working-directory/51/blocks/cocoon-databases/cocoon-databases-sample/target
[INFO] Deleting directory /home/continuum/data/working-directory/51/blocks/cocoon-databases/cocoon-databases-sample/target/classes
[INFO] Deleting directory /home/continuum/data/working-directory/51/blocks/cocoon-databases/cocoon-databases-sample/target/test-classes
[INFO] Deleting directory /home/continuum/data/working-directory/51/blocks/cocoon-databases/cocoon-databases-sample/target/site
[INFO] [enforcer:enforce-once {execution: enforce-maven}]
[INFO] [resources:resources]
[INFO] Using default encoding to copy filtered resources.
[INFO] [compiler:compile]
[INFO] No sources to compile
[INFO] [resources:testResources]
[INFO] Using default encoding to copy filtered resources.
[INFO] [compiler:testCompile]
[INFO] No sources to compile
[INFO] [surefire:test]
[INFO] No tests to run.
[INFO] [jar:jar]
[INFO] Building jar: /home/continuum/data/working-directory/51/blocks/cocoon-databases/cocoon-databases-sample/target/cocoon-databases-sample-1.0.0-SNAPSHOT.jar
[INFO] [install:install]
[INFO] Installing /home/continuum/data/working-directory/51/blocks/cocoon-databases/cocoon-databases-sample/target/cocoon-databases-sample-1.0.0-SNAPSHOT.jar to /home/continuum/.m2/repository/org/apache/cocoon/cocoon-databases-sample/1.0.0-SNAPSHOT/cocoon-databases-sample-1.0.0-SNAPSHOT.jar
[INFO] ----------------------------------------------------------------------------
[INFO] Building Cocoon ODBC client Implementation
[INFO]    task-segment: [clean, install]
[INFO] ----------------------------------------------------------------------------
[INFO] [clean:clean]
[INFO] Deleting directory /home/continuum/data/working-directory/51/blocks/cocoon-databases/cocoon-databases-odbc-client/target
[INFO] Deleting directory /home/continuum/data/working-directory/51/blocks/cocoon-databases/cocoon-databases-odbc-client/target/classes
[INFO] Deleting directory /home/continuum/data/working-directory/51/blocks/cocoon-databases/cocoon-databases-odbc-client/target/test-classes
[INFO] Deleting directory /home/continuum/data/working-directory/51/blocks/cocoon-databases/cocoon-databases-odbc-client/target/site
[INFO] [enforcer:enforce-once {execution: enforce-maven}]
[INFO] [resources:resources]
[INFO] Using default encoding to copy filtered resources.
[INFO] [compiler:compile]
[INFO] No sources to compile
[INFO] [resources:testResources]
[INFO] Using default encoding to copy filtered resources.
[INFO] [compiler:testCompile]
[INFO] No sources to compile
[INFO] [surefire:test]
[INFO] No tests to run.
[INFO] [jar:jar]
[INFO] Building jar: /home/continuum/data/working-directory/51/blocks/cocoon-databases/cocoon-databases-odbc-client/target/cocoon-databases-odbc-client-1.0.0-SNAPSHOT.jar
[INFO] [install:install]
[INFO] Installing /home/continuum/data/working-directory/51/blocks/cocoon-databases/cocoon-databases-odbc-client/target/cocoon-databases-odbc-client-1.0.0-SNAPSHOT.jar to /home/continuum/.m2/repository/org/apache/cocoon/cocoon-databases-odbc-client/1.0.0-SNAPSHOT/cocoon-databases-odbc-client-1.0.0-SNAPSHOT.jar
[INFO] ----------------------------------------------------------------------------
[INFO] Building Cocoon Oracle client Implementation
[INFO]    task-segment: [clean, install]
[INFO] ----------------------------------------------------------------------------
[INFO] [clean:clean]
[INFO] Deleting directory /home/continuum/data/working-directory/51/blocks/cocoon-databases/cocoon-databases-oracle-client/target
[INFO] Deleting directory /home/continuum/data/working-directory/51/blocks/cocoon-databases/cocoon-databases-oracle-client/target/classes
[INFO] Deleting directory /home/continuum/data/working-directory/51/blocks/cocoon-databases/cocoon-databases-oracle-client/target/test-classes
[INFO] Deleting directory /home/continuum/data/working-directory/51/blocks/cocoon-databases/cocoon-databases-oracle-client/target/site
[INFO] [enforcer:enforce-once {execution: enforce-maven}]
[INFO] [resources:resources]
[INFO] Using default encoding to copy filtered resources.
[INFO] [compiler:compile]
[INFO] No sources to compile
[INFO] [resources:testResources]
[INFO] Using default encoding to copy filtered resources.
[INFO] [compiler:testCompile]
[INFO] No sources to compile
[INFO] [surefire:test]
[INFO] No tests to run.
[INFO] [jar:jar]
[INFO] Building jar: /home/continuum/data/working-directory/51/blocks/cocoon-databases/cocoon-databases-oracle-client/target/cocoon-databases-oracle-client-1.0.0-SNAPSHOT.jar
[INFO] [install:install]
[INFO] Installing /home/continuum/data/working-directory/51/blocks/cocoon-databases/cocoon-databases-oracle-client/target/cocoon-databases-oracle-client-1.0.0-SNAPSHOT.jar to /home/continuum/.m2/repository/org/apache/cocoon/cocoon-databases-oracle-client/1.0.0-SNAPSHOT/cocoon-databases-oracle-client-1.0.0-SNAPSHOT.jar
[INFO] ----------------------------------------------------------------------------
[INFO] Building Cocoon PostgreSQL client Implementation
[INFO]    task-segment: [clean, install]
[INFO] ----------------------------------------------------------------------------
[INFO] [clean:clean]
[INFO] Deleting directory /home/continuum/data/working-directory/51/blocks/cocoon-databases/cocoon-databases-postgresql-client/target
[INFO] Deleting directory /home/continuum/data/working-directory/51/blocks/cocoon-databases/cocoon-databases-postgresql-client/target/classes
[INFO] Deleting directory /home/continuum/data/working-directory/51/blocks/cocoon-databases/cocoon-databases-postgresql-client/target/test-classes
[INFO] Deleting directory /home/continuum/data/working-directory/51/blocks/cocoon-databases/cocoon-databases-postgresql-client/target/site
[INFO] [enforcer:enforce-once {execution: enforce-maven}]
[INFO] [resources:resources]
[INFO] Using default encoding to copy filtered resources.
[INFO] [compiler:compile]
[INFO] No sources to compile
[INFO] [resources:testResources]
[INFO] Using default encoding to copy filtered resources.
[INFO] [compiler:testCompile]
[INFO] No sources to compile
[INFO] [surefire:test]
[INFO] No tests to run.
[INFO] [jar:jar]
[INFO] Building jar: /home/continuum/data/working-directory/51/blocks/cocoon-databases/cocoon-databases-postgresql-client/target/cocoon-databases-postgresql-client-1.0.0-SNAPSHOT.jar
[INFO] [install:install]
[INFO] Installing /home/continuum/data/working-directory/51/blocks/cocoon-databases/cocoon-databases-postgresql-client/target/cocoon-databases-postgresql-client-1.0.0-SNAPSHOT.jar to /home/continuum/.m2/repository/org/apache/cocoon/cocoon-databases-postgresql-client/1.0.0-SNAPSHOT/cocoon-databases-postgresql-client-1.0.0-SNAPSHOT.jar
[INFO] ----------------------------------------------------------------------------
[INFO] Building Deli Block Implementation
[INFO]    task-segment: [clean, install]
[INFO] ----------------------------------------------------------------------------
[INFO] [clean:clean]
[INFO] Deleting directory /home/continuum/data/working-directory/51/blocks/cocoon-deli/cocoon-deli-impl/target
[INFO] Deleting directory /home/continuum/data/working-directory/51/blocks/cocoon-deli/cocoon-deli-impl/target/classes
[INFO] Deleting directory /home/continuum/data/working-directory/51/blocks/cocoon-deli/cocoon-deli-impl/target/test-classes
[INFO] Deleting directory /home/continuum/data/working-directory/51/blocks/cocoon-deli/cocoon-deli-impl/target/site
[INFO] [enforcer:enforce-once {execution: enforce-maven}]
[INFO] [resources:resources]
[INFO] Using default encoding to copy filtered resources.
[INFO] [compiler:compile]
[INFO] Compiling 3 source files to /home/continuum/data/working-directory/51/blocks/cocoon-deli/cocoon-deli-impl/target/classes
[INFO] [resources:testResources]
[INFO] Using default encoding to copy filtered resources.
[INFO] [compiler:testCompile]
[INFO] No sources to compile
[INFO] [surefire:test]
[INFO] No tests to run.
[INFO] [jar:jar]
[INFO] Building jar: /home/continuum/data/working-directory/51/blocks/cocoon-deli/cocoon-deli-impl/target/cocoon-deli-impl-1.0.0-SNAPSHOT.jar
[INFO] [install:install]
[INFO] Installing /home/continuum/data/working-directory/51/blocks/cocoon-deli/cocoon-deli-impl/target/cocoon-deli-impl-1.0.0-SNAPSHOT.jar to /home/continuum/.m2/repository/org/apache/cocoon/cocoon-deli-impl/1.0.0-SNAPSHOT/cocoon-deli-impl-1.0.0-SNAPSHOT.jar
[INFO] ----------------------------------------------------------------------------
[INFO] Building Deli Block Samples
[INFO]    task-segment: [clean, install]
[INFO] ----------------------------------------------------------------------------
[INFO] [clean:clean]
[INFO] Deleting directory /home/continuum/data/working-directory/51/blocks/cocoon-deli/cocoon-deli-sample/target
[INFO] Deleting directory /home/continuum/data/working-directory/51/blocks/cocoon-deli/cocoon-deli-sample/target/classes
[INFO] Deleting directory /home/continuum/data/working-directory/51/blocks/cocoon-deli/cocoon-deli-sample/target/test-classes
[INFO] Deleting directory /home/continuum/data/working-directory/51/blocks/cocoon-deli/cocoon-deli-sample/target/site
[INFO] [enforcer:enforce-once {execution: enforce-maven}]
[INFO] [resources:resources]
[INFO] Using default encoding to copy filtered resources.
[INFO] [compiler:compile]
[INFO] No sources to compile
[INFO] [resources:testResources]
[INFO] Using default encoding to copy filtered resources.
[INFO] [compiler:testCompile]
[INFO] No sources to compile
[INFO] [surefire:test]
[INFO] No tests to run.
[INFO] [jar:jar]
[INFO] Building jar: /home/continuum/data/working-directory/51/blocks/cocoon-deli/cocoon-deli-sample/target/cocoon-deli-sample-1.0.0-SNAPSHOT.jar
[INFO] [install:install]
[INFO] Installing /home/continuum/data/working-directory/51/blocks/cocoon-deli/cocoon-deli-sample/target/cocoon-deli-sample-1.0.0-SNAPSHOT.jar to /home/continuum/.m2/repository/org/apache/cocoon/cocoon-deli-sample/1.0.0-SNAPSHOT/cocoon-deli-sample-1.0.0-SNAPSHOT.jar
[INFO] ----------------------------------------------------------------------------
[INFO] Building JMS Block Implementation
[INFO]    task-segment: [clean, install]
[INFO] ----------------------------------------------------------------------------
[INFO] [clean:clean]
[INFO] Deleting directory /home/continuum/data/working-directory/51/blocks/cocoon-jms/cocoon-jms-impl/target
[INFO] Deleting directory /home/continuum/data/working-directory/51/blocks/cocoon-jms/cocoon-jms-impl/target/classes
[INFO] Deleting directory /home/continuum/data/working-directory/51/blocks/cocoon-jms/cocoon-jms-impl/target/test-classes
[INFO] Deleting directory /home/continuum/data/working-directory/51/blocks/cocoon-jms/cocoon-jms-impl/target/site
[INFO] [enforcer:enforce-once {execution: enforce-maven}]
[INFO] [resources:resources]
[INFO] Using default encoding to copy filtered resources.
[INFO] [compiler:compile]
[INFO] Compiling 11 source files to /home/continuum/data/working-directory/51/blocks/cocoon-jms/cocoon-jms-impl/target/classes
[INFO] [resources:testResources]
[INFO] Using default encoding to copy filtered resources.
[INFO] [compiler:testCompile]
[INFO] No sources to compile
[INFO] [surefire:test]
[INFO] No tests to run.
[INFO] [jar:jar]
[INFO] Building jar: /home/continuum/data/working-directory/51/blocks/cocoon-jms/cocoon-jms-impl/target/cocoon-jms-impl-1.0.0-SNAPSHOT.jar
[INFO] [install:install]
[INFO] Installing /home/continuum/data/working-directory/51/blocks/cocoon-jms/cocoon-jms-impl/target/cocoon-jms-impl-1.0.0-SNAPSHOT.jar to /home/continuum/.m2/repository/org/apache/cocoon/cocoon-jms-impl/1.0.0-SNAPSHOT/cocoon-jms-impl-1.0.0-SNAPSHOT.jar
[INFO] ----------------------------------------------------------------------------
[INFO] Building Eventcache Block Implementation
[INFO]    task-segment: [clean, install]
[INFO] ----------------------------------------------------------------------------
[INFO] [clean:clean]
[INFO] Deleting directory /home/continuum/data/working-directory/51/blocks/cocoon-eventcache/cocoon-eventcache-impl/target
[INFO] Deleting directory /home/continuum/data/working-directory/51/blocks/cocoon-eventcache/cocoon-eventcache-impl/target/classes
[INFO] Deleting directory /home/continuum/data/working-directory/51/blocks/cocoon-eventcache/cocoon-eventcache-impl/target/test-classes
[INFO] Deleting directory /home/continuum/data/working-directory/51/blocks/cocoon-eventcache/cocoon-eventcache-impl/target/site
[INFO] [enforcer:enforce-once {execution: enforce-maven}]
[INFO] [resources:resources]
[INFO] Using default encoding to copy filtered resources.
[INFO] [compiler:compile]
[INFO] Compiling 19 source files to /home/continuum/data/working-directory/51/blocks/cocoon-eventcache/cocoon-eventcache-impl/target/classes
[INFO] [resources:testResources]
[INFO] Using default encoding to copy filtered resources.
[INFO] [compiler:testCompile]
[INFO] No sources to compile
[INFO] [surefire:test]
[INFO] No tests to run.
[INFO] [jar:jar]
[INFO] Building jar: /home/continuum/data/working-directory/51/blocks/cocoon-eventcache/cocoon-eventcache-impl/target/cocoon-eventcache-impl-1.0.0-SNAPSHOT.jar
[INFO] [install:install]
[INFO] Installing /home/continuum/data/working-directory/51/blocks/cocoon-eventcache/cocoon-eventcache-impl/target/cocoon-eventcache-impl-1.0.0-SNAPSHOT.jar to /home/continuum/.m2/repository/org/apache/cocoon/cocoon-eventcache-impl/1.0.0-SNAPSHOT/cocoon-eventcache-impl-1.0.0-SNAPSHOT.jar
[INFO] ----------------------------------------------------------------------------
[INFO] Building Eventcache Block Samples
[INFO]    task-segment: [clean, install]
[INFO] ----------------------------------------------------------------------------
[INFO] [clean:clean]
[INFO] Deleting directory /home/continuum/data/working-directory/51/blocks/cocoon-eventcache/cocoon-eventcache-sample/target
[INFO] Deleting directory /home/continuum/data/working-directory/51/blocks/cocoon-eventcache/cocoon-eventcache-sample/target/classes
[INFO] Deleting directory /home/continuum/data/working-directory/51/blocks/cocoon-eventcache/cocoon-eventcache-sample/target/test-classes
[INFO] Deleting directory /home/continuum/data/working-directory/51/blocks/cocoon-eventcache/cocoon-eventcache-sample/target/site
[INFO] [enforcer:enforce-once {execution: enforce-maven}]
[INFO] [resources:resources]
[INFO] Using default encoding to copy filtered resources.
[INFO] [compiler:compile]
[INFO] No sources to compile
[INFO] [resources:testResources]
[INFO] Using default encoding to copy filtered resources.
[INFO] [compiler:testCompile]
[INFO] No sources to compile
[INFO] [surefire:test]
[INFO] No tests to run.
[INFO] [jar:jar]
[INFO] Building jar: /home/continuum/data/working-directory/51/blocks/cocoon-eventcache/cocoon-eventcache-sample/target/cocoon-eventcache-sample-1.0.0-SNAPSHOT.jar
[INFO] [install:install]
[INFO] Installing /home/continuum/data/working-directory/51/blocks/cocoon-eventcache/cocoon-eventcache-sample/target/cocoon-eventcache-sample-1.0.0-SNAPSHOT.jar to /home/continuum/.m2/repository/org/apache/cocoon/cocoon-eventcache-sample/1.0.0-SNAPSHOT/cocoon-eventcache-sample-1.0.0-SNAPSHOT.jar
[INFO] ----------------------------------------------------------------------------
[INFO] Building Taglib Block Implementation
[INFO]    task-segment: [clean, install]
[INFO] ----------------------------------------------------------------------------
[INFO] [clean:clean]
[INFO] Deleting directory /home/continuum/data/working-directory/51/blocks/cocoon-taglib/cocoon-taglib-impl/target
[INFO] Deleting directory /home/continuum/data/working-directory/51/blocks/cocoon-taglib/cocoon-taglib-impl/target/classes
[INFO] Deleting directory /home/continuum/data/working-directory/51/blocks/cocoon-taglib/cocoon-taglib-impl/target/test-classes
[INFO] Deleting directory /home/continuum/data/working-directory/51/blocks/cocoon-taglib/cocoon-taglib-impl/target/site
[INFO] [enforcer:enforce-once {execution: enforce-maven}]
[INFO] [resources:resources]
[INFO] Using default encoding to copy filtered resources.
[INFO] [compiler:compile]
[INFO] Compiling 36 source files to /home/continuum/data/working-directory/51/blocks/cocoon-taglib/cocoon-taglib-impl/target/classes
[INFO] [resources:testResources]
[INFO] Using default encoding to copy filtered resources.
[INFO] [compiler:testCompile]
[INFO] No sources to compile
[INFO] [surefire:test]
[INFO] No tests to run.
[INFO] [jar:jar]
[INFO] Building jar: /home/continuum/data/working-directory/51/blocks/cocoon-taglib/cocoon-taglib-impl/target/cocoon-taglib-impl-1.0.0-SNAPSHOT.jar
[INFO] [install:install]
[INFO] Installing /home/continuum/data/working-directory/51/blocks/cocoon-taglib/cocoon-taglib-impl/target/cocoon-taglib-impl-1.0.0-SNAPSHOT.jar to /home/continuum/.m2/repository/org/apache/cocoon/cocoon-taglib-impl/1.0.0-SNAPSHOT/cocoon-taglib-impl-1.0.0-SNAPSHOT.jar
[INFO] ----------------------------------------------------------------------------
[INFO] Building Portal Block [modules]
[INFO]    task-segment: [clean, install]
[INFO] ----------------------------------------------------------------------------
[INFO] [clean:clean]
[INFO] Deleting directory /home/continuum/data/working-directory/51/blocks/cocoon-portal/target
[INFO] Deleting directory /home/continuum/data/working-directory/51/blocks/cocoon-portal/target/classes
[INFO] Deleting directory /home/continuum/data/working-directory/51/blocks/cocoon-portal/target/test-classes
[INFO] Deleting directory /home/continuum/data/working-directory/51/blocks/cocoon-portal/target/site
[INFO] [enforcer:enforce-once {execution: enforce-maven}]
[INFO] [site:attach-descriptor]
[INFO] [install:install]
[INFO] Installing /home/continuum/data/working-directory/51/blocks/cocoon-portal/pom.xml to /home/continuum/.m2/repository/org/apache/cocoon/cocoon-portal/1-SNAPSHOT/cocoon-portal-1-SNAPSHOT.pom
[INFO] ----------------------------------------------------------------------------
[INFO] Building Portal Block API
[INFO]    task-segment: [clean, install]
[INFO] ----------------------------------------------------------------------------
[INFO] [clean:clean]
[INFO] Deleting directory /home/continuum/data/working-directory/51/blocks/cocoon-portal/cocoon-portal-api/target
[INFO] Deleting directory /home/continuum/data/working-directory/51/blocks/cocoon-portal/cocoon-portal-api/target/classes
[INFO] Deleting directory /home/continuum/data/working-directory/51/blocks/cocoon-portal/cocoon-portal-api/target/test-classes
[INFO] Deleting directory /home/continuum/data/working-directory/51/blocks/cocoon-portal/cocoon-portal-api/target/site
[INFO] [enforcer:enforce-once {execution: enforce-maven}]
[INFO] [resources:resources]
[INFO] Using default encoding to copy filtered resources.
[INFO] [compiler:compile]
[INFO] Compiling 6 source files to /home/continuum/data/working-directory/51/blocks/cocoon-portal/cocoon-portal-api/target/classes
[INFO] [resources:testResources]
[INFO] Using default encoding to copy filtered resources.
[INFO] [compiler:testCompile]
[INFO] No sources to compile
[INFO] [surefire:test]
[INFO] No tests to run.
[INFO] [jar:jar]
[INFO] Building jar: /home/continuum/data/working-directory/51/blocks/cocoon-portal/cocoon-portal-api/target/cocoon-portal-api-1.0.0-SNAPSHOT.jar
[INFO] [install:install]
[INFO] Installing /home/continuum/data/working-directory/51/blocks/cocoon-portal/cocoon-portal-api/target/cocoon-portal-api-1.0.0-SNAPSHOT.jar to /home/continuum/.m2/repository/org/apache/cocoon/cocoon-portal-api/1.0.0-SNAPSHOT/cocoon-portal-api-1.0.0-SNAPSHOT.jar
[INFO] ----------------------------------------------------------------------------
[INFO] Building Cocoon Serializers Charsets
[INFO]    task-segment: [clean, install]
[INFO] ----------------------------------------------------------------------------
[INFO] [clean:clean]
[INFO] Deleting directory /home/continuum/data/working-directory/51/blocks/cocoon-serializers/cocoon-serializers-charsets/target
[INFO] Deleting directory /home/continuum/data/working-directory/51/blocks/cocoon-serializers/cocoon-serializers-charsets/target/classes
[INFO] Deleting directory /home/continuum/data/working-directory/51/blocks/cocoon-serializers/cocoon-serializers-charsets/target/test-classes
[INFO] Deleting directory /home/continuum/data/working-directory/51/blocks/cocoon-serializers/cocoon-serializers-charsets/target/site
[INFO] [enforcer:enforce-once {execution: enforce-maven}]
[INFO] [resources:resources]
[INFO] Using default encoding to copy filtered resources.
[INFO] [compiler:compile]
[INFO] Compiling 193 source files to /home/continuum/data/working-directory/51/blocks/cocoon-serializers/cocoon-serializers-charsets/target/classes
[INFO] [resources:testResources]
[INFO] Using default encoding to copy filtered resources.
[INFO] [compiler:testCompile]
[INFO] No sources to compile
[INFO] [surefire:test]
[INFO] No tests to run.
[INFO] [jar:jar]
[INFO] Building jar: /home/continuum/data/working-directory/51/blocks/cocoon-serializers/cocoon-serializers-charsets/target/cocoon-serializers-charsets-1.0.0-SNAPSHOT.jar
[INFO] [install:install]
[INFO] Installing /home/continuum/data/working-directory/51/blocks/cocoon-serializers/cocoon-serializers-charsets/target/cocoon-serializers-charsets-1.0.0-SNAPSHOT.jar to /home/continuum/.m2/repository/org/apache/cocoon/cocoon-serializers-charsets/1.0.0-SNAPSHOT/cocoon-serializers-charsets-1.0.0-SNAPSHOT.jar
[INFO] ----------------------------------------------------------------------------
[INFO] Building Portal Block Implementation
[INFO]    task-segment: [clean, install]
[INFO] ----------------------------------------------------------------------------
[INFO] [clean:clean]
[INFO] Deleting directory /home/continuum/data/working-directory/51/blocks/cocoon-portal/cocoon-portal-impl/target
[INFO] Deleting directory /home/continuum/data/working-directory/51/blocks/cocoon-portal/cocoon-portal-impl/target/classes
[INFO] Deleting directory /home/continuum/data/working-directory/51/blocks/cocoon-portal/cocoon-portal-impl/target/test-classes
[INFO] Deleting directory /home/continuum/data/working-directory/51/blocks/cocoon-portal/cocoon-portal-impl/target/site
[INFO] [enforcer:enforce-once {execution: enforce-maven}]
[INFO] [resources:resources]
[INFO] Using default encoding to copy filtered resources.
[INFO] [compiler:compile]
[INFO] Compiling 162 source files to /home/continuum/data/working-directory/51/blocks/cocoon-portal/cocoon-portal-impl/target/classes
[INFO] [resources:testResources]
[INFO] Using default encoding to copy filtered resources.
[INFO] [compiler:testCompile]
[INFO] Compiling 1 source file to /home/continuum/data/working-directory/51/blocks/cocoon-portal/cocoon-portal-impl/target/test-classes
[INFO] [surefire:test]
[INFO] Surefire report directory: /home/continuum/data/working-directory/51/blocks/cocoon-portal/cocoon-portal-impl/target/surefire-reports

-------------------------------------------------------
 T E S T S
-------------------------------------------------------
Running org.apache.cocoon.portal.event.impl.DefaultEventManagerTestCase
log4j:WARN No appenders could be found for logger (org.apache.cocoon.portal.event.impl.DefaultEventManager).
log4j:WARN Please initialize the log4j system properly.
Tests run: 7, Failures: 0, Errors: 0, Skipped: 0, Time elapsed: 0.143 sec

Results :

Tests run: 7, Failures: 0, Errors: 0, Skipped: 0

[INFO] [jar:jar]
[INFO] Building jar: /home/continuum/data/working-directory/51/blocks/cocoon-portal/cocoon-portal-impl/target/cocoon-portal-impl-1.0.0-SNAPSHOT.jar
[INFO] [install:install]
[INFO] Installing /home/continuum/data/working-directory/51/blocks/cocoon-portal/cocoon-portal-impl/target/cocoon-portal-impl-1.0.0-SNAPSHOT.jar to /home/continuum/.m2/repository/org/apache/cocoon/cocoon-portal-impl/1.0.0-SNAPSHOT/cocoon-portal-impl-1.0.0-SNAPSHOT.jar
[INFO] ----------------------------------------------------------------------------
[INFO] Building Faces Block Implementation
[INFO]    task-segment: [clean, install]
[INFO] ----------------------------------------------------------------------------
[INFO] [clean:clean]
[INFO] Deleting directory /home/continuum/data/working-directory/51/blocks/cocoon-faces/cocoon-faces-impl/target
[INFO] Deleting directory /home/continuum/data/working-directory/51/blocks/cocoon-faces/cocoon-faces-impl/target/classes
[INFO] Deleting directory /home/continuum/data/working-directory/51/blocks/cocoon-faces/cocoon-faces-impl/target/test-classes
[INFO] Deleting directory /home/continuum/data/working-directory/51/blocks/cocoon-faces/cocoon-faces-impl/target/site
[INFO] [enforcer:enforce-once {execution: enforce-maven}]
[INFO] [resources:resources]
[INFO] Using default encoding to copy filtered resources.
Downloading: http://people.apache.org/repo/m1-snapshot-repository/myfaces/poms/myfaces-api-r233484.pom
Downloading: http://repo1.maven.org/maven2/myfaces/myfaces-api/r233484/myfaces-api-r233484.pom
Downloading: http://people.apache.org/repo/m1-snapshot-repository/myfaces/poms/myfaces-impl-r233484.pom
Downloading: http://repo1.maven.org/maven2/myfaces/myfaces-impl/r233484/myfaces-impl-r233484.pom
[INFO] [compiler:compile]
[INFO] Nothing to compile - all classes are up to date
[INFO] [resources:testResources]
[INFO] Using default encoding to copy filtered resources.
[INFO] [compiler:testCompile]
[INFO] No sources to compile
[INFO] [surefire:test]
[INFO] No tests to run.
[INFO] [jar:jar]
[INFO] Building jar: /home/continuum/data/working-directory/51/blocks/cocoon-faces/cocoon-faces-impl/target/cocoon-faces-impl-1.0.0-SNAPSHOT.jar
[INFO] [install:install]
[INFO] Installing /home/continuum/data/working-directory/51/blocks/cocoon-faces/cocoon-faces-impl/target/cocoon-faces-impl-1.0.0-SNAPSHOT.jar to /home/continuum/.m2/repository/org/apache/cocoon/cocoon-faces-impl/1.0.0-SNAPSHOT/cocoon-faces-impl-1.0.0-SNAPSHOT.jar
[INFO] ----------------------------------------------------------------------------
[INFO] Building Faces Block Samples
[INFO]    task-segment: [clean, install]
[INFO] ----------------------------------------------------------------------------
[INFO] [clean:clean]
[INFO] Deleting directory /home/continuum/data/working-directory/51/blocks/cocoon-faces/cocoon-faces-sample/target
[INFO] Deleting directory /home/continuum/data/working-directory/51/blocks/cocoon-faces/cocoon-faces-sample/target/classes
[INFO] Deleting directory /home/continuum/data/working-directory/51/blocks/cocoon-faces/cocoon-faces-sample/target/test-classes
[INFO] Deleting directory /home/continuum/data/working-directory/51/blocks/cocoon-faces/cocoon-faces-sample/target/site
[INFO] [enforcer:enforce-once {execution: enforce-maven}]
[INFO] [resources:resources]
[INFO] Using default encoding to copy filtered resources.
[INFO] [compiler:compile]
[INFO] No sources to compile
[INFO] [resources:testResources]
[INFO] Using default encoding to copy filtered resources.
[INFO] [compiler:testCompile]
[INFO] No sources to compile
[INFO] [surefire:test]
[INFO] No tests to run.
[INFO] [jar:jar]
[INFO] Building jar: /home/continuum/data/working-directory/51/blocks/cocoon-faces/cocoon-faces-sample/target/cocoon-faces-sample-1.0.0-SNAPSHOT.jar
[INFO] [install:install]
[INFO] Installing /home/continuum/data/working-directory/51/blocks/cocoon-faces/cocoon-faces-sample/target/cocoon-faces-sample-1.0.0-SNAPSHOT.jar to /home/continuum/.m2/repository/org/apache/cocoon/cocoon-faces-sample/1.0.0-SNAPSHOT/cocoon-faces-sample-1.0.0-SNAPSHOT.jar
[INFO] ----------------------------------------------------------------------------
[INFO] Building Cocoon FOP Block Implementation
[INFO]    task-segment: [clean, install]
[INFO] ----------------------------------------------------------------------------
[INFO] [clean:clean]
[INFO] Deleting directory /home/continuum/data/working-directory/51/blocks/cocoon-fop/cocoon-fop-impl/target
[INFO] Deleting directory /home/continuum/data/working-directory/51/blocks/cocoon-fop/cocoon-fop-impl/target/classes
[INFO] Deleting directory /home/continuum/data/working-directory/51/blocks/cocoon-fop/cocoon-fop-impl/target/test-classes
[INFO] Deleting directory /home/continuum/data/working-directory/51/blocks/cocoon-fop/cocoon-fop-impl/target/site
[INFO] [enforcer:enforce-once {execution: enforce-maven}]
[INFO] [resources:resources]
[INFO] Using default encoding to copy filtered resources.
[INFO] [compiler:compile]
[INFO] Compiling 3 source files to /home/continuum/data/working-directory/51/blocks/cocoon-fop/cocoon-fop-impl/target/classes
[INFO] [resources:testResources]
[INFO] Using default encoding to copy filtered resources.
[INFO] [compiler:testCompile]
[INFO] No sources to compile
[INFO] [surefire:test]
[INFO] No tests to run.
[INFO] [jar:jar]
[INFO] Building jar: /home/continuum/data/working-directory/51/blocks/cocoon-fop/cocoon-fop-impl/target/cocoon-fop-impl-1.1.0-SNAPSHOT.jar
[INFO] [install:install]
[INFO] Installing /home/continuum/data/working-directory/51/blocks/cocoon-fop/cocoon-fop-impl/target/cocoon-fop-impl-1.1.0-SNAPSHOT.jar to /home/continuum/.m2/repository/org/apache/cocoon/cocoon-fop-impl/1.1.0-SNAPSHOT/cocoon-fop-impl-1.1.0-SNAPSHOT.jar
[INFO] ----------------------------------------------------------------------------
[INFO] Building Cocoon FOP Block Samples
[INFO]    task-segment: [clean, install]
[INFO] ----------------------------------------------------------------------------
[INFO] [clean:clean]
[INFO] Deleting directory /home/continuum/data/working-directory/51/blocks/cocoon-fop/cocoon-fop-sample/target
[INFO] Deleting directory /home/continuum/data/working-directory/51/blocks/cocoon-fop/cocoon-fop-sample/target/classes
[INFO] Deleting directory /home/continuum/data/working-directory/51/blocks/cocoon-fop/cocoon-fop-sample/target/test-classes
[INFO] Deleting directory /home/continuum/data/working-directory/51/blocks/cocoon-fop/cocoon-fop-sample/target/site
[INFO] [enforcer:enforce-once {execution: enforce-maven}]
[INFO] [resources:resources]
[INFO] Using default encoding to copy filtered resources.
[INFO] [compiler:compile]
[INFO] No sources to compile
[INFO] [resources:testResources]
[INFO] Using default encoding to copy filtered resources.
[INFO] [compiler:testCompile]
[INFO] No sources to compile
[INFO] [surefire:test]
[INFO] No tests to run.
[INFO] [jar:jar]
[INFO] Building jar: /home/continuum/data/working-directory/51/blocks/cocoon-fop/cocoon-fop-sample/target/cocoon-fop-sample-1.0.0-SNAPSHOT.jar
[INFO] [install:install]
[INFO] Installing /home/continuum/data/working-directory/51/blocks/cocoon-fop/cocoon-fop-sample/target/cocoon-fop-sample-1.0.0-SNAPSHOT.jar to /home/continuum/.m2/repository/org/apache/cocoon/cocoon-fop-sample/1.0.0-SNAPSHOT/cocoon-fop-sample-1.0.0-SNAPSHOT.jar
[INFO] ----------------------------------------------------------------------------
[INFO] Building Cocoon FOP 0.9x Block Implementation
[INFO]    task-segment: [clean, install]
[INFO] ----------------------------------------------------------------------------
[INFO] [clean:clean]
[INFO] Deleting directory /home/continuum/data/working-directory/51/blocks/cocoon-fop/cocoon-fop-ng-impl/target
[INFO] Deleting directory /home/continuum/data/working-directory/51/blocks/cocoon-fop/cocoon-fop-ng-impl/target/classes
[INFO] Deleting directory /home/continuum/data/working-directory/51/blocks/cocoon-fop/cocoon-fop-ng-impl/target/test-classes
[INFO] Deleting directory /home/continuum/data/working-directory/51/blocks/cocoon-fop/cocoon-fop-ng-impl/target/site
[INFO] [enforcer:enforce-once {execution: enforce-maven}]
[INFO] [resources:resources]
[INFO] Using default encoding to copy filtered resources.
[INFO] [compiler:compile]
[INFO] Compiling 1 source file to /home/continuum/data/working-directory/51/blocks/cocoon-fop/cocoon-fop-ng-impl/target/classes
[INFO] [resources:testResources]
[INFO] Using default encoding to copy filtered resources.
[INFO] [compiler:testCompile]
[INFO] No sources to compile
[INFO] [surefire:test]
[INFO] No tests to run.
[INFO] [jar:jar]
[INFO] Building jar: /home/continuum/data/working-directory/51/blocks/cocoon-fop/cocoon-fop-ng-impl/target/cocoon-fop-ng-impl-1.0.0-SNAPSHOT.jar
[INFO] [install:install]
[INFO] Installing /home/continuum/data/working-directory/51/blocks/cocoon-fop/cocoon-fop-ng-impl/target/cocoon-fop-ng-impl-1.0.0-SNAPSHOT.jar to /home/continuum/.m2/repository/org/apache/cocoon/cocoon-fop-ng-impl/1.0.0-SNAPSHOT/cocoon-fop-ng-impl-1.0.0-SNAPSHOT.jar
[INFO] ----------------------------------------------------------------------------
[INFO] Building Cocoon FOP 0.9x Block Samples
[INFO]    task-segment: [clean, install]
[INFO] ----------------------------------------------------------------------------
[INFO] [clean:clean]
[INFO] Deleting directory /home/continuum/data/working-directory/51/blocks/cocoon-fop/cocoon-fop-ng-sample/target
[INFO] Deleting directory /home/continuum/data/working-directory/51/blocks/cocoon-fop/cocoon-fop-ng-sample/target/classes
[INFO] Deleting directory /home/continuum/data/working-directory/51/blocks/cocoon-fop/cocoon-fop-ng-sample/target/test-classes
[INFO] Deleting directory /home/continuum/data/working-directory/51/blocks/cocoon-fop/cocoon-fop-ng-sample/target/site
[INFO] [enforcer:enforce-once {execution: enforce-maven}]
[INFO] [resources:resources]
[INFO] Using default encoding to copy filtered resources.
[INFO] [compiler:compile]
[INFO] No sources to compile
[INFO] [resources:testResources]
[INFO] Using default encoding to copy filtered resources.
[INFO] [compiler:testCompile]
[INFO] No sources to compile
[INFO] [surefire:test]
[INFO] No tests to run.
[INFO] [jar:jar]
[INFO] Building jar: /home/continuum/data/working-directory/51/blocks/cocoon-fop/cocoon-fop-ng-sample/target/cocoon-fop-ng-sample-1.0.0-SNAPSHOT.jar
[INFO] [install:install]
[INFO] Installing /home/continuum/data/working-directory/51/blocks/cocoon-fop/cocoon-fop-ng-sample/target/cocoon-fop-ng-sample-1.0.0-SNAPSHOT.jar to /home/continuum/.m2/repository/org/apache/cocoon/cocoon-fop-ng-sample/1.0.0-SNAPSHOT/cocoon-fop-ng-sample-1.0.0-SNAPSHOT.jar
[INFO] ----------------------------------------------------------------------------
[INFO] Building Cocoon HTML Block Implementation
[INFO]    task-segment: [clean, install]
[INFO] ----------------------------------------------------------------------------
[INFO] [clean:clean]
[INFO] Deleting directory /home/continuum/data/working-directory/51/blocks/cocoon-html/cocoon-html-impl/target
[INFO] Deleting directory /home/continuum/data/working-directory/51/blocks/cocoon-html/cocoon-html-impl/target/classes
[INFO] Deleting directory /home/continuum/data/working-directory/51/blocks/cocoon-html/cocoon-html-impl/target/test-classes
[INFO] Deleting directory /home/continuum/data/working-directory/51/blocks/cocoon-html/cocoon-html-impl/target/site
[INFO] [enforcer:enforce-once {execution: enforce-maven}]
[INFO] [resources:resources]
[INFO] Using default encoding to copy filtered resources.
[INFO] [compiler:compile]
[INFO] Compiling 6 source files to /home/continuum/data/working-directory/51/blocks/cocoon-html/cocoon-html-impl/target/classes
[INFO] ------------------------------------------------------------------------
[ERROR] BUILD FAILURE
[INFO] ------------------------------------------------------------------------
[INFO] Compilation failure
/home/continuum/data/working-directory/51/blocks/cocoon-html/cocoon-html-impl/src/main/java/org/apache/cocoon/components/NekoHtmlSaxParser.java:[38,91] cannot resolve symbol
symbol  : method defaultCharset ()
location: class java.nio.charset.Charset



/home/continuum/data/working-directory/51/blocks/cocoon-html/cocoon-html-impl/src/main/java/org/apache/cocoon/components/NekoHtmlSaxParser.java:[38,91] cannot resolve symbol
symbol  : method defaultCharset ()
location: class java.nio.charset.Charset


[INFO] ------------------------------------------------------------------------
[INFO] For more information, run Maven with the -e switch
[INFO] ------------------------------------------------------------------------
[INFO] Total time: 9 minutes 6 seconds
[INFO] Finished at: Thu Apr 03 22:01:48 PDT 2008
[INFO] Final Memory: 119M/346M
[INFO] ------------------------------------------------------------------------

****************************************************************************



Mime
View raw message