cocoon-dev mailing list archives

Site index · List index
Message view « Date » · « Thread »
Top « Date » · « Thread »
From Continuum VMBuild Server <contin...@apache.org>
Subject [continuum] BUILD FAILURE: Apache Cocoon [build root]
Date Thu, 17 Apr 2008 04:10:38 GMT
Online report : http://vmbuild.apache.org/continuum/buildResult.action?buildId=77901&projectId=51

Build statistics:
  State: Failed
  Previous State: Failed
  Started at: Wed 16 Apr 2008 21:05:49 -0700
  Finished at: Wed 16 Apr 2008 21:08:19 -0700
  Total time: 2m 29s
  Build Trigger: Schedule
  Build Number: 255
  Exit code: 1
  Building machine hostname: vmbuild.apache.org
  Operating system : Linux(unknown)
  Java Home version : 
          java version "1.4.2_15"
          Java(TM) 2 Runtime Environment, Standard Edition (build 1.4.2_15-b02)
          Java HotSpot(TM) Client VM (build 1.4.2_15-b02, mixed mode)
        
  Builder version :
          Maven version: 2.0.7
          Java version: 1.4.2_15
          OS name: "linux" version: "2.6.20-16-server" arch: "i386"
    
****************************************************************************
SCM Changes:
****************************************************************************
Changed: joerg @ Wed 16 Apr 2008 19:58:06 -0700
Comment: minor refactoring
Files changed:
  /cocoon/trunk/core/cocoon-core/src/main/java/org/apache/cocoon/servlet/multipart/MultipartHttpServletRequest.java
( 648934 )

Changed: joerg @ Wed 16 Apr 2008 20:17:53 -0700
Comment: fix whitespace
Files changed:
  /cocoon/trunk/core/cocoon-core/src/main/java/org/apache/cocoon/servlet/multipart/MultipartHttpServletRequest.java
( 648938 )

Changed: joerg @ Wed 16 Apr 2008 20:32:57 -0700
Comment: fix inconsistencies between inline parts and file parts when multiple fields of the
same name exist (http://marc.info/?l=xml-cocoon-dev&m=120835513330316&w=4)
Files changed:
  /cocoon/trunk/core/cocoon-core/src/changes/changes.xml ( 648942 )
  /cocoon/trunk/core/cocoon-core/src/main/java/org/apache/cocoon/servlet/multipart/MultipartParser.java
( 648942 )

****************************************************************************
Dependencies Changes:
****************************************************************************
No dependencies changed


****************************************************************************
Build Defintion:
****************************************************************************
POM filename: pom.xml
Goals: clean install   
Arguments: --batch-mode -P allblocks,it
Build Fresh: false
Always Build: false
Default Build Definition: true
Schedule: DEFAULT_SCHEDULE
Profile Name: Java 1.4, Large Memory
Description: 


****************************************************************************
Test Summary:
****************************************************************************
Tests: 357
Failures: 0
Total time: 99778

****************************************************************************
Output:
****************************************************************************
[INFO] Scanning for projects...
[INFO] Reactor build order: 
[INFO]   Apache Cocoon
[INFO]   Cocoon Tools [modules]
[INFO]   Cocoon 2.2 Archetype: Block
[INFO]   Cocoon 2.2 Archetype: Block (plain)
[INFO]   Cocoon 2.2 Archetype: Web Application
[INFO]   Cocoon Integration Test Framework [maven-plugin]
[INFO]   Cocoon Maven Reports
[INFO]   Cocoon Maven 2 Plugin
[INFO]   Cocoon Maven Javadocs Script Report
[INFO]   Cocoon Maven Javadocs Script Report
[INFO]   Cocoon Reloading ClassLoader - Webapp Wrapper
[INFO]   Cocoon Reloading ClassLoader - Spring reloader
[INFO]   Cocoon Configuration API
[INFO]   Cocoon Spring Configurator
[INFO]   Cocoon: JNet
[INFO]   Cocoon: Block Deployment
[INFO]   Cocoon Core [modules]
[INFO]   Cocoon Pipeline API
[INFO]   Cocoon Util
[INFO]   Cocoon XML API
[INFO]   Cocoon Expression Language API
[INFO]   Cocoon Pipeline Implementation
[INFO]   Cocoon XML Implementation
[INFO]   Cocoon Pipeline Components
[INFO]   Cocoon Sitemap API
[INFO]   Cocoon XML Utilities
[INFO]   Cocoon Expression Language Implementation.
[INFO]   Cocoon Thread API
[INFO]   Cocoon Sitemap Implementation
[INFO]   Cocoon Sitemap Components
[INFO]   Cocoon XML Resolver
[INFO]   Cocoon Store Implementation
[INFO]   Cocoon Thread Implementation
[INFO]   Cocoon Core
[INFO]   Cocoon Servlet Service Implementation
[INFO]   Cocoon Blocks [modules]
[INFO]   Cocoon Linkrewriter Block Implementation
[INFO]   Cocoon Servlet Service Components
[INFO]   Cocoon Ajax Block Implementation
[INFO]   Cocoon Template Framework Block Implementation
[INFO]   Cocoon Samples Style Default Block
[INFO]   Cocoon Ajax Block Sample
[INFO]   Cocoon Apples Block Implementation
[INFO]   Session Framework Implementation
[INFO]   XSP Block Implementation
[INFO]   Cocoon Main Core Sample Block
[INFO]   Cocoon Flowscript Block Implementation
[INFO]   Cocoon Forms Block Implementation
[INFO]   Cocoon Apples Block Samples
[INFO]   Cocoon Additional Sample Block
[INFO]   Cocoon Batik Block Implementation
[INFO]   Cocoon Forms Block Samples
[INFO]   Cocoon Integration Tests Block
[INFO]   Cocoon Linkrewriter Block Samples
[INFO]   Cocoon Template Block Samples
[INFO]   Cocoon Batik Block Samples
[INFO]   Cocoon Welcome (Samples)
[INFO]   Asciiart Block Implementation
[INFO]   Asciiart Block Samples
[INFO]   cocoon-acegisecurity
[INFO]   Cocoon Authentication Block API
[INFO]   Cocoon Authentication Block Implementation
[INFO]   Cocoon Authentication Block Sample
[INFO]   Authentication Framework Implementation
[INFO]   Authentication Framework Sample Application
[INFO]   Axis Block Implementation
[INFO]   Axis Block Samples
[INFO]   Bsf Block Implementation
[INFO]   Bsf Block Samples
[INFO]   Cocoon Captcha Block Implementation
[INFO]   Cocoon Captcha Block Sample
[INFO]   Chaperon Block Implementation
[INFO]   Chaperon Block Samples
[INFO]   Cron block implementation
[INFO]   Cron Block Samples
[INFO]   Cocoon Database Block Mocks
[INFO]   Cocoon Database Block Bridge for Avalon components
[INFO]   Cocoon Database Block Implementation
[INFO]   Cocoon Hsqldb Server Block Implementation
[INFO]   Cocoon Hsqldb Client Implementation
[INFO]   Cocoon Databases Block Samples
[INFO]   Cocoon ODBC client Implementation
[INFO]   Cocoon Oracle client Implementation
[INFO]   Cocoon PostgreSQL client Implementation
[INFO]   Deli Block Implementation
[INFO]   Deli Block Samples
[INFO]   JMS Block Implementation
[INFO]   Eventcache Block Implementation
[INFO]   Eventcache Block Samples
[INFO]   Taglib Block Implementation
[INFO]   Portal Block [modules]
[INFO]   Portal Block API
[INFO]   Cocoon Serializers Charsets
[INFO]   Portal Block Implementation
[INFO]   Faces Block Implementation
[INFO]   Faces Block Samples
[INFO]   Cocoon FOP Block Implementation
[INFO]   Cocoon FOP Block Samples
[INFO]   Cocoon FOP 0.9x Block Implementation
[INFO]   Cocoon FOP 0.9x Block Samples
[INFO]   Cocoon HTML Block Implementation
[INFO]   Cocoon Html Block Sample
[INFO]   Image Operation Block Implementation
[INFO]   Image Operation Block Samples
[INFO]   Itext Block Implementation
[INFO]   Itext Block Samples
[INFO]   Javaflow Block
[INFO]   Javaflow Block Samples
[INFO]   JCR Block [modules]
[INFO]   JCR Block Implementation
[INFO]   JCR Block Sample
[INFO]   Jfor Block Implementation
[INFO]   Jfor Block Samples
[INFO]   JMS Block Samples
[INFO]   Jsp Block Mocks
[INFO]   Jsp Block Implementation
[INFO]   Jsp Block Samples
[INFO]   Lucene Block Implementation
[INFO]   Lucene Block Samples
[INFO]   Cocoon Mail Block Implementation
[INFO]   Cocoon Mail Block Sample
[INFO]   Midi Block Implementation
[INFO]   Midi Block Samples
[INFO]   Naming Block Implementation
[INFO]   Naming Block Samples
[INFO]   Ojb Block Mocks
[INFO]   Ojb Block Implementation
[INFO]   Querybean Block Implementation
[INFO]   Ojb Block Samples
[INFO]   Petstore Block Implementation
[INFO]   Velocity Block [modules]
[INFO]   Velocity Block Implementation
[INFO]   Petstore Block Samples
[INFO]   Poi Block Implementation
[INFO]   Poi Block Samples
[INFO]   Portal Block CAuth Support
[INFO]   Portal Block Bridges Implementation
[INFO]   Cocoon Serializers Block Implementation
[INFO]   Portal Block Sitemap
[INFO]   Portal Block Portlet Implementation
[INFO]   Cocoon Portal Castor Converter
[INFO]   Portal Block Sample
[INFO]   Profiler Block
[INFO]   Profiler Block Samples
[INFO]   Proxy Block Implementation
[INFO]   Proxy Block Samples
[INFO]   Python Block Mocks
[INFO]   Python Block Implementation
[INFO]   Qdox Block Implementation
[INFO]   Qdox Block Samples
[INFO]   Querybean Block Samples
[INFO]   Repository Block Implementation
[INFO]   Scratchpad Block Implementation
[INFO]   Scratchpad Block Samples
[INFO]   Session Framework Sample Application
[INFO]   Slide Block Implementation
[INFO]   Slide Block Samples
[INFO]   Slop Block Implementation
[INFO]   Slop Block Samples
[INFO]   Stx Block Implementation
[INFO]   Stx Block Samples
[INFO]   Taglib Block Samples
[INFO]   Tour Block [modules]
[INFO]   Tour Block Implementation
[INFO]   Tour Block Samples
[INFO]   Validation Block [modules]
[INFO]   Validation Block Implementation
[INFO]   Validation Block Sample
[INFO]   Velocity Block Samples
[INFO]   Web3 Block [modules]
[INFO]   Web3 Block Mocks
[INFO]   Web3 Block Implementation
[INFO]   Web3 Block Samples
[INFO]   Webdav Block [modules]
[INFO]   Webdav Block Implementation
[INFO]   Webdav Block Samples
[INFO]   XMLDB Block's Implementation
[INFO]   XMLDB Block's Samples
[INFO]   XSP Block Samples
[INFO]   Cocoon Licenses
[INFO]   Cocoon Commons [modules]
[INFO]   Cocoon Servlet Service Sample Blocks
[INFO]   Cocoon Webapp
[INFO]   Cocoon Distributions [modules]
[INFO]   Cocoon Subprojects [modules]
[INFO]   Apache Cocoon [build root]
[INFO] ----------------------------------------------------------------------------
[INFO] Building Apache Cocoon
[INFO]    task-segment: [clean, install]
[INFO] ----------------------------------------------------------------------------
[INFO] [clean:clean]
[INFO] Deleting directory /home/continuum/data/working-directory/51/parent/target
[INFO] Deleting directory /home/continuum/data/working-directory/51/parent/target/classes
[INFO] Deleting directory /home/continuum/data/working-directory/51/parent/target/test-classes
[INFO] Deleting directory /home/continuum/data/working-directory/51/parent/target/site
[INFO] [enforcer:enforce-once {execution: enforce-maven}]
[INFO] [site:attach-descriptor]
[INFO] [install:install]
[INFO] Installing /home/continuum/data/working-directory/51/parent/pom.xml to /home/continuum/.m2/repository/org/apache/cocoon/cocoon/6-SNAPSHOT/cocoon-6-SNAPSHOT.pom
[INFO] ----------------------------------------------------------------------------
[INFO] Building Cocoon Tools [modules]
[INFO]    task-segment: [clean, install]
[INFO] ----------------------------------------------------------------------------
[INFO] [clean:clean]
[INFO] Deleting directory /home/continuum/data/working-directory/51/tools/target
[INFO] Deleting directory /home/continuum/data/working-directory/51/tools/target/classes
[INFO] Deleting directory /home/continuum/data/working-directory/51/tools/target/test-classes
[INFO] Deleting directory /home/continuum/data/working-directory/51/tools/target/site
[INFO] [enforcer:enforce-once {execution: enforce-maven}]
[INFO] [site:attach-descriptor]
[INFO] [install:install]
[INFO] Installing /home/continuum/data/working-directory/51/tools/pom.xml to /home/continuum/.m2/repository/org/apache/cocoon/cocoon-tools-modules/5-SNAPSHOT/cocoon-tools-modules-5-SNAPSHOT.pom
[INFO] ----------------------------------------------------------------------------
[INFO] Building Cocoon 2.2 Archetype: Block
[INFO]    task-segment: [clean, install]
[INFO] ----------------------------------------------------------------------------
[INFO] [clean:clean]
[INFO] Deleting directory /home/continuum/data/working-directory/51/tools/archetypes/cocoon-22-archetype-block/target
[INFO] Deleting directory /home/continuum/data/working-directory/51/tools/archetypes/cocoon-22-archetype-block/target/classes
[INFO] Deleting directory /home/continuum/data/working-directory/51/tools/archetypes/cocoon-22-archetype-block/target/test-classes
[INFO] Deleting directory /home/continuum/data/working-directory/51/tools/archetypes/cocoon-22-archetype-block/target/site
[INFO] [enforcer:enforce-once {execution: enforce-maven}]
[INFO] [resources:resources]
[INFO] Using default encoding to copy filtered resources.
[INFO] [compiler:compile]
[INFO] No sources to compile
[INFO] [resources:testResources]
[INFO] Using default encoding to copy filtered resources.
[INFO] [compiler:testCompile]
[INFO] No sources to compile
[INFO] [surefire:test]
[INFO] No tests to run.
[INFO] [jar:jar]
[INFO] Building jar: /home/continuum/data/working-directory/51/tools/archetypes/cocoon-22-archetype-block/target/cocoon-22-archetype-block-1.1.0-SNAPSHOT.jar
[INFO] [install:install]
[INFO] Installing /home/continuum/data/working-directory/51/tools/archetypes/cocoon-22-archetype-block/target/cocoon-22-archetype-block-1.1.0-SNAPSHOT.jar
to /home/continuum/.m2/repository/org/apache/cocoon/cocoon-22-archetype-block/1.1.0-SNAPSHOT/cocoon-22-archetype-block-1.1.0-SNAPSHOT.jar
[INFO] ----------------------------------------------------------------------------
[INFO] Building Cocoon 2.2 Archetype: Block (plain)
[INFO]    task-segment: [clean, install]
[INFO] ----------------------------------------------------------------------------
[INFO] [clean:clean]
[INFO] Deleting directory /home/continuum/data/working-directory/51/tools/archetypes/cocoon-22-archetype-block-plain/target
[INFO] Deleting directory /home/continuum/data/working-directory/51/tools/archetypes/cocoon-22-archetype-block-plain/target/classes
[INFO] Deleting directory /home/continuum/data/working-directory/51/tools/archetypes/cocoon-22-archetype-block-plain/target/test-classes
[INFO] Deleting directory /home/continuum/data/working-directory/51/tools/archetypes/cocoon-22-archetype-block-plain/target/site
[INFO] [enforcer:enforce-once {execution: enforce-maven}]
[INFO] [resources:resources]
[INFO] Using default encoding to copy filtered resources.
[INFO] [compiler:compile]
[INFO] No sources to compile
[INFO] [resources:testResources]
[INFO] Using default encoding to copy filtered resources.
[INFO] [compiler:testCompile]
[INFO] No sources to compile
[INFO] [surefire:test]
[INFO] No tests to run.
[INFO] [jar:jar]
[INFO] Building jar: /home/continuum/data/working-directory/51/tools/archetypes/cocoon-22-archetype-block-plain/target/cocoon-22-archetype-block-plain-1.1.0-SNAPSHOT.jar
[INFO] [install:install]
[INFO] Installing /home/continuum/data/working-directory/51/tools/archetypes/cocoon-22-archetype-block-plain/target/cocoon-22-archetype-block-plain-1.1.0-SNAPSHOT.jar
to /home/continuum/.m2/repository/org/apache/cocoon/cocoon-22-archetype-block-plain/1.1.0-SNAPSHOT/cocoon-22-archetype-block-plain-1.1.0-SNAPSHOT.jar
[INFO] ----------------------------------------------------------------------------
[INFO] Building Cocoon 2.2 Archetype: Web Application
[INFO]    task-segment: [clean, install]
[INFO] ----------------------------------------------------------------------------
[INFO] [clean:clean]
[INFO] Deleting directory /home/continuum/data/working-directory/51/tools/archetypes/cocoon-22-archetype-webapp/target
[INFO] Deleting directory /home/continuum/data/working-directory/51/tools/archetypes/cocoon-22-archetype-webapp/target/classes
[INFO] Deleting directory /home/continuum/data/working-directory/51/tools/archetypes/cocoon-22-archetype-webapp/target/test-classes
[INFO] Deleting directory /home/continuum/data/working-directory/51/tools/archetypes/cocoon-22-archetype-webapp/target/site
[INFO] [enforcer:enforce-once {execution: enforce-maven}]
[INFO] [resources:resources]
[INFO] Using default encoding to copy filtered resources.
[INFO] [compiler:compile]
[INFO] No sources to compile
[INFO] [resources:testResources]
[INFO] Using default encoding to copy filtered resources.
[INFO] [compiler:testCompile]
[INFO] No sources to compile
[INFO] [surefire:test]
[INFO] No tests to run.
[INFO] [jar:jar]
[INFO] Building jar: /home/continuum/data/working-directory/51/tools/archetypes/cocoon-22-archetype-webapp/target/cocoon-22-archetype-webapp-1.1.0-SNAPSHOT.jar
[INFO] [install:install]
[INFO] Installing /home/continuum/data/working-directory/51/tools/archetypes/cocoon-22-archetype-webapp/target/cocoon-22-archetype-webapp-1.1.0-SNAPSHOT.jar
to /home/continuum/.m2/repository/org/apache/cocoon/cocoon-22-archetype-webapp/1.1.0-SNAPSHOT/cocoon-22-archetype-webapp-1.1.0-SNAPSHOT.jar
[INFO] ----------------------------------------------------------------------------
[INFO] Building Cocoon Integration Test Framework [maven-plugin]
[INFO]    task-segment: [clean, install]
[INFO] ----------------------------------------------------------------------------
[INFO] [clean:clean]
[INFO] Deleting directory /home/continuum/data/working-directory/51/tools/cocoon-it-fw/target
[INFO] Deleting directory /home/continuum/data/working-directory/51/tools/cocoon-it-fw/target/classes
[INFO] Deleting directory /home/continuum/data/working-directory/51/tools/cocoon-it-fw/target/test-classes
[INFO] Deleting directory /home/continuum/data/working-directory/51/tools/cocoon-it-fw/target/site
[INFO] [enforcer:enforce-once {execution: enforce-maven}]
[INFO] [plugin:descriptor]
[INFO] Using 2 extractors.
[INFO] Applying extractor for language: java
[INFO] Extractor for language: java found 2 mojo descriptors.
[INFO] Applying extractor for language: bsh
[INFO] Extractor for language: bsh found 0 mojo descriptors.
[INFO] [resources:resources]
[INFO] Using default encoding to copy filtered resources.
[INFO] [compiler:compile]
[INFO] Compiling 5 source files to /home/continuum/data/working-directory/51/tools/cocoon-it-fw/target/classes
[INFO] [resources:testResources]
[INFO] Using default encoding to copy filtered resources.
[INFO] [compiler:testCompile]
[INFO] No sources to compile
[INFO] [surefire:test]
[INFO] No tests to run.
[INFO] [jar:jar]
[INFO] Building jar: /home/continuum/data/working-directory/51/tools/cocoon-it-fw/target/cocoon-it-fw-1.0.0-RC1-SNAPSHOT.jar
[INFO] [plugin:addPluginArtifactMetadata]
[INFO] [install:install]
[INFO] Installing /home/continuum/data/working-directory/51/tools/cocoon-it-fw/target/cocoon-it-fw-1.0.0-RC1-SNAPSHOT.jar
to /home/continuum/.m2/repository/org/apache/cocoon/cocoon-it-fw/1.0.0-RC1-SNAPSHOT/cocoon-it-fw-1.0.0-RC1-SNAPSHOT.jar
[INFO] [plugin:updateRegistry]
[INFO] ----------------------------------------------------------------------------
[INFO] Building Cocoon Maven Reports
[INFO]    task-segment: [clean, install]
[INFO] ----------------------------------------------------------------------------
[INFO] [clean:clean]
[INFO] Deleting directory /home/continuum/data/working-directory/51/tools/cocoon-maven-reports/target
[INFO] Deleting directory /home/continuum/data/working-directory/51/tools/cocoon-maven-reports/target/classes
[INFO] Deleting directory /home/continuum/data/working-directory/51/tools/cocoon-maven-reports/target/test-classes
[INFO] Deleting directory /home/continuum/data/working-directory/51/tools/cocoon-maven-reports/target/site
[INFO] [enforcer:enforce-once {execution: enforce-maven}]
[INFO] [resources:resources]
[INFO] Using default encoding to copy filtered resources.
[INFO] [compiler:compile]
[INFO] No sources to compile
[INFO] [resources:testResources]
[INFO] Using default encoding to copy filtered resources.
[INFO] [compiler:testCompile]
[INFO] No sources to compile
[INFO] [surefire:test]
[INFO] No tests to run.
[INFO] [jar:jar]
[INFO] Building jar: /home/continuum/data/working-directory/51/tools/cocoon-maven-reports/target/cocoon-maven-reports-1.0.0-SNAPSHOT.jar
[INFO] [install:install]
[INFO] Installing /home/continuum/data/working-directory/51/tools/cocoon-maven-reports/target/cocoon-maven-reports-1.0.0-SNAPSHOT.jar
to /home/continuum/.m2/repository/org/apache/cocoon/cocoon-maven-reports/1.0.0-SNAPSHOT/cocoon-maven-reports-1.0.0-SNAPSHOT.jar
[INFO] ----------------------------------------------------------------------------
[INFO] Building Cocoon Maven 2 Plugin
[INFO]    task-segment: [clean, install]
[INFO] ----------------------------------------------------------------------------
[INFO] [clean:clean]
[INFO] Deleting directory /home/continuum/data/working-directory/51/tools/cocoon-maven-plugin/target
[INFO] Deleting directory /home/continuum/data/working-directory/51/tools/cocoon-maven-plugin/target/classes
[INFO] Deleting directory /home/continuum/data/working-directory/51/tools/cocoon-maven-plugin/target/test-classes
[INFO] Deleting directory /home/continuum/data/working-directory/51/tools/cocoon-maven-plugin/target/site
[INFO] [enforcer:enforce-once {execution: enforce-maven}]
[INFO] [plugin:descriptor]
[WARNING] Goal prefix is: cocoon; Maven currently expects it to be cocoon
[INFO] Using 2 extractors.
[INFO] Applying extractor for language: java
[INFO] Extractor for language: java found 4 mojo descriptors.
[INFO] Applying extractor for language: bsh
[INFO] Extractor for language: bsh found 0 mojo descriptors.
[INFO] [resources:resources]
[INFO] Using default encoding to copy filtered resources.
[INFO] [compiler:compile]
[INFO] Compiling 24 source files to /home/continuum/data/working-directory/51/tools/cocoon-maven-plugin/target/classes
[INFO] [resources:testResources]
[INFO] Using default encoding to copy filtered resources.
[INFO] [compiler:testCompile]
[INFO] Compiling 1 source file to /home/continuum/data/working-directory/51/tools/cocoon-maven-plugin/target/test-classes
[INFO] [surefire:test]
[INFO] Surefire report directory: /home/continuum/data/working-directory/51/tools/cocoon-maven-plugin/target/surefire-reports

-------------------------------------------------------
 T E S T S
-------------------------------------------------------
Running org.apache.cocoon.maven.rcl.RwmPropertiesTest
log4j:WARN No appenders could be found for logger (org.apache.commons.configuration.ConfigurationUtils).
log4j:WARN Please initialize the log4j system properly.
Tests run: 4, Failures: 0, Errors: 0, Skipped: 0, Time elapsed: 0.251 sec

Results :

Tests run: 4, Failures: 0, Errors: 0, Skipped: 0

[INFO] [jar:jar]
[INFO] Building jar: /home/continuum/data/working-directory/51/tools/cocoon-maven-plugin/target/cocoon-maven-plugin-1.0.0-RC1-SNAPSHOT.jar
[INFO] [plugin:addPluginArtifactMetadata]
[INFO] [install:install]
[INFO] Installing /home/continuum/data/working-directory/51/tools/cocoon-maven-plugin/target/cocoon-maven-plugin-1.0.0-RC1-SNAPSHOT.jar
to /home/continuum/.m2/repository/org/apache/cocoon/cocoon-maven-plugin/1.0.0-RC1-SNAPSHOT/cocoon-maven-plugin-1.0.0-RC1-SNAPSHOT.jar
[INFO] [plugin:updateRegistry]
[INFO] ----------------------------------------------------------------------------
[INFO] Building Cocoon Maven Javadocs Script Report
[INFO]    task-segment: [clean, install]
[INFO] ----------------------------------------------------------------------------
[INFO] [clean:clean]
[INFO] Deleting directory /home/continuum/data/working-directory/51/tools/cocoon-maven-docs-cleaner-plugin/target
[INFO] Deleting directory /home/continuum/data/working-directory/51/tools/cocoon-maven-docs-cleaner-plugin/target/classes
[INFO] Deleting directory /home/continuum/data/working-directory/51/tools/cocoon-maven-docs-cleaner-plugin/target/test-classes
[INFO] Deleting directory /home/continuum/data/working-directory/51/tools/cocoon-maven-docs-cleaner-plugin/target/site
[INFO] [enforcer:enforce-once {execution: enforce-maven}]
[INFO] [plugin:descriptor]
[WARNING] Goal prefix is: cocoon-docs-cleaner; Maven currently expects it to be cocoondocs-cleaner
[INFO] Using 2 extractors.
[INFO] Applying extractor for language: java
[INFO] Extractor for language: java found 1 mojo descriptors.
[INFO] Applying extractor for language: bsh
[INFO] Extractor for language: bsh found 0 mojo descriptors.
[INFO] [resources:resources]
[INFO] Using default encoding to copy filtered resources.
[INFO] [compiler:compile]
[INFO] Compiling 1 source file to /home/continuum/data/working-directory/51/tools/cocoon-maven-docs-cleaner-plugin/target/classes
[INFO] [resources:testResources]
[INFO] Using default encoding to copy filtered resources.
[INFO] [compiler:testCompile]
[INFO] No sources to compile
[INFO] [surefire:test]
[INFO] No tests to run.
[INFO] [jar:jar]
[INFO] Building jar: /home/continuum/data/working-directory/51/tools/cocoon-maven-docs-cleaner-plugin/target/cocoon-maven-docs-cleaner-plugin-1.0.0-M1-SNAPSHOT.jar
[INFO] [plugin:addPluginArtifactMetadata]
[INFO] [install:install]
[INFO] Installing /home/continuum/data/working-directory/51/tools/cocoon-maven-docs-cleaner-plugin/target/cocoon-maven-docs-cleaner-plugin-1.0.0-M1-SNAPSHOT.jar
to /home/continuum/.m2/repository/org/apache/cocoon/cocoon-maven-docs-cleaner-plugin/1.0.0-M1-SNAPSHOT/cocoon-maven-docs-cleaner-plugin-1.0.0-M1-SNAPSHOT.jar
[INFO] [plugin:updateRegistry]
[INFO] ----------------------------------------------------------------------------
[INFO] Building Cocoon Maven Javadocs Script Report
[INFO]    task-segment: [clean, install]
[INFO] ----------------------------------------------------------------------------
[INFO] [clean:clean]
[INFO] Deleting directory /home/continuum/data/working-directory/51/tools/cocoon-maven-javadocs-script-report/target
[INFO] Deleting directory /home/continuum/data/working-directory/51/tools/cocoon-maven-javadocs-script-report/target/classes
[INFO] Deleting directory /home/continuum/data/working-directory/51/tools/cocoon-maven-javadocs-script-report/target/test-classes
[INFO] Deleting directory /home/continuum/data/working-directory/51/tools/cocoon-maven-javadocs-script-report/target/site
[INFO] [enforcer:enforce-once {execution: enforce-maven}]
[INFO] [plugin:descriptor]
[INFO] Using 2 extractors.
[INFO] Applying extractor for language: java
[INFO] Extractor for language: java found 1 mojo descriptors.
[INFO] Applying extractor for language: bsh
[INFO] Extractor for language: bsh found 0 mojo descriptors.
[INFO] [resources:resources]
[INFO] Using default encoding to copy filtered resources.
[INFO] [compiler:compile]
[INFO] Compiling 1 source file to /home/continuum/data/working-directory/51/tools/cocoon-maven-javadocs-script-report/target/classes
[INFO] [resources:testResources]
[INFO] Using default encoding to copy filtered resources.
[INFO] [compiler:testCompile]
[INFO] No sources to compile
[INFO] [surefire:test]
[INFO] No tests to run.
[INFO] [jar:jar]
[INFO] Building jar: /home/continuum/data/working-directory/51/tools/cocoon-maven-javadocs-script-report/target/cocoon-maven-javadocs-script-report-1.0.0-M2-SNAPSHOT.jar
[INFO] [plugin:addPluginArtifactMetadata]
[INFO] [install:install]
[INFO] Installing /home/continuum/data/working-directory/51/tools/cocoon-maven-javadocs-script-report/target/cocoon-maven-javadocs-script-report-1.0.0-M2-SNAPSHOT.jar
to /home/continuum/.m2/repository/org/apache/cocoon/cocoon-maven-javadocs-script-report/1.0.0-M2-SNAPSHOT/cocoon-maven-javadocs-script-report-1.0.0-M2-SNAPSHOT.jar
[INFO] [plugin:updateRegistry]
[INFO] ----------------------------------------------------------------------------
[INFO] Building Cocoon Reloading ClassLoader - Webapp Wrapper
[INFO]    task-segment: [clean, install]
[INFO] ----------------------------------------------------------------------------
[INFO] [clean:clean]
[INFO] Deleting directory /home/continuum/data/working-directory/51/tools/cocoon-rcl/cocoon-rcl-webapp-wrapper/target
[INFO] Deleting directory /home/continuum/data/working-directory/51/tools/cocoon-rcl/cocoon-rcl-webapp-wrapper/target/classes
[INFO] Deleting directory /home/continuum/data/working-directory/51/tools/cocoon-rcl/cocoon-rcl-webapp-wrapper/target/test-classes
[INFO] Deleting directory /home/continuum/data/working-directory/51/tools/cocoon-rcl/cocoon-rcl-webapp-wrapper/target/site
[INFO] [enforcer:enforce-once {execution: enforce-maven}]
[INFO] [resources:resources]
[INFO] Using default encoding to copy filtered resources.
[INFO] [compiler:compile]
[INFO] Compiling 9 source files to /home/continuum/data/working-directory/51/tools/cocoon-rcl/cocoon-rcl-webapp-wrapper/target/classes
[INFO] [resources:testResources]
[INFO] Using default encoding to copy filtered resources.
[INFO] [compiler:testCompile]
[INFO] No sources to compile
[INFO] [surefire:test]
[INFO] No tests to run.
[INFO] [jar:jar]
[INFO] Building jar: /home/continuum/data/working-directory/51/tools/cocoon-rcl/cocoon-rcl-webapp-wrapper/target/cocoon-rcl-webapp-wrapper-1.0.0-RC1-SNAPSHOT.jar
[INFO] [install:install]
[INFO] Installing /home/continuum/data/working-directory/51/tools/cocoon-rcl/cocoon-rcl-webapp-wrapper/target/cocoon-rcl-webapp-wrapper-1.0.0-RC1-SNAPSHOT.jar
to /home/continuum/.m2/repository/org/apache/cocoon/cocoon-rcl-webapp-wrapper/1.0.0-RC1-SNAPSHOT/cocoon-rcl-webapp-wrapper-1.0.0-RC1-SNAPSHOT.jar
[INFO] ----------------------------------------------------------------------------
[INFO] Building Cocoon Reloading ClassLoader - Spring reloader
[INFO]    task-segment: [clean, install]
[INFO] ----------------------------------------------------------------------------
[INFO] [clean:clean]
[INFO] Deleting directory /home/continuum/data/working-directory/51/tools/cocoon-rcl/cocoon-rcl-spring-reloader/target
[INFO] Deleting directory /home/continuum/data/working-directory/51/tools/cocoon-rcl/cocoon-rcl-spring-reloader/target/classes
[INFO] Deleting directory /home/continuum/data/working-directory/51/tools/cocoon-rcl/cocoon-rcl-spring-reloader/target/test-classes
[INFO] Deleting directory /home/continuum/data/working-directory/51/tools/cocoon-rcl/cocoon-rcl-spring-reloader/target/site
[INFO] [enforcer:enforce-once {execution: enforce-maven}]
[INFO] [resources:resources]
[INFO] Using default encoding to copy filtered resources.
[INFO] [compiler:compile]
[INFO] Compiling 2 source files to /home/continuum/data/working-directory/51/tools/cocoon-rcl/cocoon-rcl-spring-reloader/target/classes
[INFO] [resources:testResources]
[INFO] Using default encoding to copy filtered resources.
[INFO] [compiler:testCompile]
[INFO] No sources to compile
[INFO] [surefire:test]
[INFO] No tests to run.
[INFO] [jar:jar]
[INFO] Building jar: /home/continuum/data/working-directory/51/tools/cocoon-rcl/cocoon-rcl-spring-reloader/target/cocoon-rcl-spring-reloader-1.0.0-RC1-SNAPSHOT.jar
[INFO] [install:install]
[INFO] Installing /home/continuum/data/working-directory/51/tools/cocoon-rcl/cocoon-rcl-spring-reloader/target/cocoon-rcl-spring-reloader-1.0.0-RC1-SNAPSHOT.jar
to /home/continuum/.m2/repository/org/apache/cocoon/cocoon-rcl-spring-reloader/1.0.0-RC1-SNAPSHOT/cocoon-rcl-spring-reloader-1.0.0-RC1-SNAPSHOT.jar
[INFO] ----------------------------------------------------------------------------
[INFO] Building Cocoon Configuration API
[INFO]    task-segment: [clean, install]
[INFO] ----------------------------------------------------------------------------
[INFO] [clean:clean]
[INFO] Deleting directory /home/continuum/data/working-directory/51/core/cocoon-configuration/cocoon-configuration-api/target
[INFO] Deleting directory /home/continuum/data/working-directory/51/core/cocoon-configuration/cocoon-configuration-api/target/classes
[INFO] Deleting directory /home/continuum/data/working-directory/51/core/cocoon-configuration/cocoon-configuration-api/target/test-classes
[INFO] Deleting directory /home/continuum/data/working-directory/51/core/cocoon-configuration/cocoon-configuration-api/target/site
[INFO] [enforcer:enforce-once {execution: enforce-maven}]
[INFO] [resources:resources]
[INFO] Using default encoding to copy filtered resources.
[INFO] [compiler:compile]
[INFO] Compiling 5 source files to /home/continuum/data/working-directory/51/core/cocoon-configuration/cocoon-configuration-api/target/classes
[INFO] [resources:testResources]
[INFO] Using default encoding to copy filtered resources.
[INFO] [compiler:testCompile]
[INFO] No sources to compile
[INFO] [surefire:test]
[INFO] No tests to run.
[INFO] [jar:jar]
[INFO] Building jar: /home/continuum/data/working-directory/51/core/cocoon-configuration/cocoon-configuration-api/target/cocoon-configuration-api-1.0.3-SNAPSHOT.jar
[INFO] [install:install]
[INFO] Installing /home/continuum/data/working-directory/51/core/cocoon-configuration/cocoon-configuration-api/target/cocoon-configuration-api-1.0.3-SNAPSHOT.jar
to /home/continuum/.m2/repository/org/apache/cocoon/cocoon-configuration-api/1.0.3-SNAPSHOT/cocoon-configuration-api-1.0.3-SNAPSHOT.jar
[INFO] ----------------------------------------------------------------------------
[INFO] Building Cocoon Spring Configurator
[INFO]    task-segment: [clean, install]
[INFO] ----------------------------------------------------------------------------
[INFO] [clean:clean]
[INFO] Deleting directory /home/continuum/data/working-directory/51/core/cocoon-configuration/cocoon-spring-configurator/target
[INFO] Deleting directory /home/continuum/data/working-directory/51/core/cocoon-configuration/cocoon-spring-configurator/target/classes
[INFO] Deleting directory /home/continuum/data/working-directory/51/core/cocoon-configuration/cocoon-spring-configurator/target/test-classes
[INFO] Deleting directory /home/continuum/data/working-directory/51/core/cocoon-configuration/cocoon-spring-configurator/target/site
[INFO] [enforcer:enforce-once {execution: enforce-maven}]
[INFO] [resources:resources]
[INFO] Using default encoding to copy filtered resources.
[INFO] [compiler:compile]
[INFO] Compiling 20 source files to /home/continuum/data/working-directory/51/core/cocoon-configuration/cocoon-spring-configurator/target/classes
[INFO] [resources:testResources]
[INFO] Using default encoding to copy filtered resources.
[INFO] [compiler:testCompile]
[INFO] No sources to compile
[INFO] [surefire:test]
[INFO] No tests to run.
[INFO] [jar:jar]
[INFO] Building jar: /home/continuum/data/working-directory/51/core/cocoon-configuration/cocoon-spring-configurator/target/cocoon-spring-configurator-1.0.3-SNAPSHOT.jar
[INFO] [install:install]
[INFO] Installing /home/continuum/data/working-directory/51/core/cocoon-configuration/cocoon-spring-configurator/target/cocoon-spring-configurator-1.0.3-SNAPSHOT.jar
to /home/continuum/.m2/repository/org/apache/cocoon/cocoon-spring-configurator/1.0.3-SNAPSHOT/cocoon-spring-configurator-1.0.3-SNAPSHOT.jar
[INFO] ----------------------------------------------------------------------------
[INFO] Building Cocoon: JNet
[INFO]    task-segment: [clean, install]
[INFO] ----------------------------------------------------------------------------
[INFO] [clean:clean]
[INFO] Deleting directory /home/continuum/data/working-directory/51/subprojects/cocoon-jnet/target
[INFO] Deleting directory /home/continuum/data/working-directory/51/subprojects/cocoon-jnet/target/classes
[INFO] Deleting directory /home/continuum/data/working-directory/51/subprojects/cocoon-jnet/target/test-classes
[INFO] Deleting directory /home/continuum/data/working-directory/51/subprojects/cocoon-jnet/target/site
[INFO] [enforcer:enforce-once {execution: enforce-maven}]
[INFO] [resources:resources]
[INFO] Using default encoding to copy filtered resources.
[INFO] [compiler:compile]
[INFO] Compiling 10 source files to /home/continuum/data/working-directory/51/subprojects/cocoon-jnet/target/classes
[INFO] ------------------------------------------------------------------------
[ERROR] BUILD FAILURE
[INFO] ------------------------------------------------------------------------
[INFO] Compilation failure

/home/continuum/data/working-directory/51/subprojects/cocoon-jnet/src/main/java/org/apache/excalibur/sourceresolve/jnet/source/SourceURLStreamHandler.java:[20,16]
cannot resolve symbol
symbol  : class Proxy 
location: package net

/home/continuum/data/working-directory/51/subprojects/cocoon-jnet/src/main/java/org/apache/excalibur/sourceresolve/jnet/source/SourceURLStreamHandler.java:[42,52]
cannot resolve symbol
symbol  : class Proxy 
location: class org.apache.excalibur.sourceresolve.jnet.source.SourceURLStreamHandler


[INFO] ------------------------------------------------------------------------
[INFO] For more information, run Maven with the -e switch
[INFO] ------------------------------------------------------------------------
[INFO] Total time: 2 minutes 14 seconds
[INFO] Finished at: Wed Apr 16 21:08:18 PDT 2008
[INFO] Final Memory: 102M/185M
[INFO] ------------------------------------------------------------------------

****************************************************************************



Mime
View raw message