cocoon-dev mailing list archives

Site index · List index
Message view « Date » · « Thread »
Top « Date » · « Thread »
From Joerg Heinicke <joerg.heini...@gmx.de>
Subject Re: [continuum] BUILD FAILURE: Apache Cocoon [build root]
Date Mon, 07 Jan 2008 00:45:24 GMT
On 06.01.2008 05:05, Continuum VMBuild Server wrote:

> Online report : 
> http://vmbuild.apache.org/continuum/buildResult.action?buildId=35020&projectId=51

> 
> 
> Build statistics:
>  State: Failed
>  Previous State: Ok
>  Started at: Sun 6 Jan 2008 02:01:03 -0800
>  Finished at: Sun 6 Jan 2008 02:03:40 -0800
>  Total time: 2m 37s
>  Build Trigger: Schedule
>  Build Number: 110
>  Exit code: 1
>  Building machine hostname: vmbuild.apache.org
>  Operating system : Linux(unknown)
>  Java Home version :          java version "1.4.2_15"
>          Java(TM) 2 Runtime Environment, Standard Edition (build 
> 1.4.2_15-b02)
>          Java HotSpot(TM) Client VM (build 1.4.2_15-b02, mixed mode)
>         Builder version :
>          Maven version: 2.0.7
>          Java version: 1.4.2_15
>          OS name: "linux" version: "2.6.20-16-server" arch: "i386"
>    
> **************************************************************************** 
> 
> SCM Changes:
> **************************************************************************** 
> 
> Changed: rgoers @ Sun 6 Jan 2008 01:35:48 -0800
> Comment: Created XPathXMLFileModule to fix problems with XMLFileModule. 
> Added getAttributeValue to JXPathHelper and changed all references to 
> getAttribute to use it instead. Moved registration of VariableResolver 
> to BridgeElementParser from SitemapElementParser to make it available to 
> all Avalon components (i.e. input modules).

> [INFO] 
> ---------------------------------------------------------------------------- 
> 
> [INFO] Building Cocoon Sitemap Implementation
> [INFO]    task-segment: [clean, install]
> [INFO] 
> ---------------------------------------------------------------------------- 

> [INFO] [resources:testResources]
> [INFO] Using default encoding to copy filtered resources.
> [INFO] [compiler:testCompile]
> [INFO] Compiling 11 source files to 
> /home/continuum/data/working-directory/51/core/cocoon-sitemap/cocoon-sitemap-impl/target/test-classes

> 
> [INFO] 
> ------------------------------------------------------------------------
> [ERROR] BUILD FAILURE
> [INFO] 
> ------------------------------------------------------------------------
> [INFO] Compilation failure
> /home/continuum/data/working-directory/51/core/cocoon-sitemap/cocoon-sitemap-impl/src/test/java/org/apache/cocoon/environment/mock/MockRequestAttributes.java:[133,52]

> cannot resolve symbol
> symbol  : method getAttributeNames (int)
> location: interface org.apache.cocoon.environment.Request

There seems to be a missing change, Ralph.

Joerg

Mime
View raw message