cocoon-dev mailing list archives

Site index · List index
Message view « Date » · « Thread »
Top « Date » · « Thread »
From Reinhard Poetz <reinh...@apache.org>
Subject Re: [continuum] BUILD FAILURE: Apache Cocoon [build root]
Date Mon, 31 Dec 2007 13:25:45 GMT
Was it me who caused these test errors?

Continuum VMBuild Server wrote:
> ---------------------------------------------------------------------------- 
> 
> [INFO] Building Cocoon Forms Block Implementation
> [INFO]    task-segment: [clean, install]
> [INFO] 
> ---------------------------------------------------------------------------- 
> 
> [INFO] [clean:clean]
> [INFO] Deleting directory 
> /home/continuum/data/working-directory/51/blocks/cocoon-forms/cocoon-forms-impl/target

> 
> [INFO] Deleting directory 
> /home/continuum/data/working-directory/51/blocks/cocoon-forms/cocoon-forms-impl/target/classes

> 
> [INFO] Deleting directory 
> /home/continuum/data/working-directory/51/blocks/cocoon-forms/cocoon-forms-impl/target/test-classes

> 
> [INFO] Deleting directory 
> /home/continuum/data/working-directory/51/blocks/cocoon-forms/cocoon-forms-impl/target/site

> 
> [INFO] [enforcer:enforce-once {execution: enforce-maven}]
> [INFO] [resources:resources]
> [INFO] Using default encoding to copy filtered resources.
> [INFO] [compiler:compile]
> [INFO] Compiling 395 source files to 
> /home/continuum/data/working-directory/51/blocks/cocoon-forms/cocoon-forms-impl/target/classes

> 
> [INFO] [resources:testResources]
> [INFO] Using default encoding to copy filtered resources.
> [INFO] [compiler:testCompile]
> [INFO] Compiling 11 source files to 
> /home/continuum/data/working-directory/51/blocks/cocoon-forms/cocoon-forms-impl/target/test-classes

> 
> [INFO] [surefire:test]
> [INFO] Surefire report directory: 
> /home/continuum/data/working-directory/51/blocks/cocoon-forms/cocoon-forms-impl/target/surefire-reports

> 
> 
> -------------------------------------------------------
> T E S T S
> -------------------------------------------------------
> Running org.apache.cocoon.forms.datatype.FlowJXPathSelectionListTestCase
> log4j:WARN No appenders could be found for logger 
> (org.springframework.util.ClassUtils).
> log4j:WARN Please initialize the log4j system properly.
> Tests run: 2, Failures: 0, Errors: 2, Skipped: 0, Time elapsed: 5.269 
> sec <<< FAILURE!
> Running org.apache.cocoon.forms.datatype.DynamicSelectionListTestCase
> Tests run: 1, Failures: 0, Errors: 1, Skipped: 0, Time elapsed: 0.587 
> sec <<< FAILURE!
> Running org.apache.cocoon.forms.datatype.convertor.EnumConvertorTestCase
> Tests run: 2, Failures: 0, Errors: 0, Skipped: 0, Time elapsed: 0.012 sec
> Running 
> org.apache.cocoon.forms.datatype.convertor.EnumConvertorBuilderTestCase
> Tests run: 1, Failures: 0, Errors: 0, Skipped: 0, Time elapsed: 0.006 sec
> Running 
> org.apache.cocoon.forms.datatype.validationruleimpl.EmailValidationRuleTest
> Tests run: 2, Failures: 0, Errors: 0, Skipped: 0, Time elapsed: 0.043 sec
> Running org.apache.cocoon.forms.datatype.EnumSelectionListTestCase
> Tests run: 2, Failures: 0, Errors: 2, Skipped: 0, Time elapsed: 0.762 
> sec <<< FAILURE!
> Running org.apache.cocoon.forms.formmodel.GroupTestCase
> Tests run: 1, Failures: 0, Errors: 0, Skipped: 0, Time elapsed: 0.676 sec
> Running org.apache.cocoon.forms.formmodel.FieldTestCase
> [INFO] deprecation - The 'action-command' attribute is deprecated and 
> replaced by 'command', at [unknown location]
> [INFO] deprecation - The 'action-command' attribute is deprecated and 
> replaced by 'command', at [unknown location]
> [INFO] deprecation - The 'action-command' attribute is deprecated and 
> replaced by 'command', at [unknown location]
> [INFO] deprecation - The 'action-command' attribute is deprecated and 
> replaced by 'command', at [unknown location]
> [INFO] deprecation - The 'action-command' attribute is deprecated and 
> replaced by 'command', at [unknown location]
> [INFO] deprecation - The 'action-command' attribute is deprecated and 
> replaced by 'command', at [unknown location]
> Tests run: 6, Failures: 0, Errors: 0, Skipped: 0, Time elapsed: 2.307 sec
> 
> Results :
> 
> Tests in error: 
>  testGenerateSaxFragment(org.apache.cocoon.forms.datatype.FlowJXPathSelectionListTestCase)

> 
>  testGenerateSaxFragmentWithNull(org.apache.cocoon.forms.datatype.FlowJXPathSelectionListTestCase)

> 
>  testGenerateSaxFragment(org.apache.cocoon.forms.datatype.DynamicSelectionListTestCase)

> 
>  testGenerateSaxFragment(org.apache.cocoon.forms.datatype.EnumSelectionListTestCase)

> 
>  testGenerateSaxFragmentNullable(org.apache.cocoon.forms.datatype.EnumSelectionListTestCase)

> 
> 
> Tests run: 17, Failures: 0, Errors: 5, Skipped: 0
> 
> [INFO] 
> ------------------------------------------------------------------------
> [ERROR] BUILD FAILURE
> [INFO] 
> ------------------------------------------------------------------------
> [INFO] There are test failures.
> [INFO] 
> ------------------------------------------------------------------------
> [INFO] For more information, run Maven with the -e switch
> [INFO] 
> ------------------------------------------------------------------------
> [INFO] Total time: 6 minutes 5 seconds
> [INFO] Finished at: Mon Dec 31 04:06:33 PST 2007
> [INFO] Final Memory: 98M/178M
> [INFO] 
> ------------------------------------------------------------------------
> 
> **************************************************************************** 

-- 
Reinhard Pötz                            Managing Director, {Indoqa} GmbH
                           http://www.indoqa.com/en/people/reinhard.poetz/

Member of the Apache Software Foundation
Apache Cocoon Committer, PMC member, PMC Chair        reinhard@apache.org
_________________________________________________________________________

Mime
View raw message