cocoon-dev mailing list archives

Site index · List index
Message view « Date » · « Thread »
Top « Date » · « Thread »
From Continuum VMBuild Server <contin...@apache.org>
Subject [continuum] BUILD FAILURE: Apache Cocoon [build root]
Date Wed, 17 Oct 2007 04:19:22 GMT
Online report : http://vmbuild.apache.org/continuum/buildResult.action?buildId=14116&projectId=51

Build statistics:
  State: Failed
  Previous State: Ok
  Started at: Tue 16 Oct 2007 21:13:27 -0700
  Finished at: Tue 16 Oct 2007 21:17:21 -0700
  Total time: 3m 53s
  Build Trigger: Schedule
  Build Number: 57
  Exit code: 1
  Building machine hostname: vmbuild.apache.org
  Operating system : Linux(unknown)
  Java Home version : 
          java version "1.4.2_15"
          Java(TM) 2 Runtime Environment, Standard Edition (build 1.4.2_15-b02)
          Java HotSpot(TM) Client VM (build 1.4.2_15-b02, mixed mode)
        
  Builder version :
          Maven version: 2.0.7
          Java version: 1.4.2_15
          OS name: "linux" version: "2.6.20-16-server" arch: "i386"
    
****************************************************************************
SCM Changes:
****************************************************************************
Changed: vgritsenko @ Tue 16 Oct 2007 20:08:33 -0700
Comment: saner logging defaults: tone down spring messages a notch.
Files changed:
  /cocoon/trunk/core/cocoon-core/src/main/resources/META-INF/cocoon/properties/core.properties ( 585337 )
  /cocoon/trunk/core/cocoon-core/src/main/resources/META-INF/cocoon/properties/dev/core.properties ( 585337 )
  /cocoon/trunk/core/cocoon-webapp/src/main/webapp/WEB-INF/cocoon/log4j.xml ( 585337 )
  /cocoon/trunk/tools/archetypes/cocoon-22-archetype-webapp/src/main/resources/archetype-resources/src/main/webapp/WEB-INF/log4j.xml ( 585337 )
  /cocoon/trunk/tools/cocoon-maven-plugin/src/main/resources/org/apache/cocoon/maven/rcl/WEB-INF/log4j.xml ( 585337 )

Changed: vgritsenko @ Tue 16 Oct 2007 20:10:57 -0700
Comment: use new abstractlogenabled - commons logging
Files changed:
  /cocoon/trunk/blocks/cocoon-apples/cocoon-apples-sample/src/main/java/org/apache/cocoon/components/flow/apples/samples/BindingWoodyApple.java ( 585341 )
  /cocoon/trunk/blocks/cocoon-apples/cocoon-apples-sample/src/main/java/org/apache/cocoon/components/flow/apples/samples/CalculationApple.java ( 585341 )
  /cocoon/trunk/blocks/cocoon-apples/cocoon-apples-sample/src/main/java/org/apache/cocoon/components/flow/apples/samples/GuessGameApple.java ( 585341 )
  /cocoon/trunk/blocks/cocoon-apples/cocoon-apples-sample/src/main/java/org/apache/cocoon/components/flow/apples/samples/HanoiApple.java ( 585341 )

Changed: vgritsenko @ Tue 16 Oct 2007 20:11:14 -0700
Comment: use new abstractlogenabled - commons logging
Files changed:
  /cocoon/trunk/blocks/cocoon-axis/cocoon-axis-impl/src/main/java/org/apache/cocoon/components/axis/SoapServer.java ( 585342 )
  /cocoon/trunk/blocks/cocoon-axis/cocoon-axis-impl/src/main/java/org/apache/cocoon/components/axis/SoapServerImpl.java ( 585342 )
  /cocoon/trunk/blocks/cocoon-axis/cocoon-axis-impl/src/main/java/org/apache/cocoon/webservices/AbstractLogEnabledService.java ( 585342 )

Changed: vgritsenko @ Tue 16 Oct 2007 20:37:19 -0700
Comment: fix exception handling - there could be a situation with ignored exception
Files changed:
  /cocoon/trunk/core/cocoon-core/src/main/java/org/apache/cocoon/components/source/impl/CachingSource.java ( 585350 )

Changed: vgritsenko @ Tue 16 Oct 2007 20:52:17 -0700
Comment: iuse new abstractlogenabled - commons logging
Files changed:
  /cocoon/trunk/core/cocoon-core/src/main/java/org/apache/cocoon/components/crawler/SimpleCocoonCrawlerImpl.java ( 585353 )
  /cocoon/trunk/core/cocoon-core/src/main/java/org/apache/cocoon/components/persistence/RequestDataStoreImpl.java ( 585353 )
  /cocoon/trunk/core/cocoon-core/src/main/java/org/apache/cocoon/components/source/CocoonSourceResolver.java ( 585353 )
  /cocoon/trunk/core/cocoon-core/src/main/java/org/apache/cocoon/components/source/helpers/DelaySourceRefresher.java ( 585353 )
  /cocoon/trunk/core/cocoon-core/src/main/java/org/apache/cocoon/components/source/impl/BlockContextSourceFactory.java ( 585353 )
  /cocoon/trunk/core/cocoon-core/src/main/java/org/apache/cocoon/i18n/XMLResourceBundle.java ( 585353 )
  /cocoon/trunk/core/cocoon-core/src/main/java/org/apache/cocoon/i18n/XMLResourceBundleFactory.java ( 585353 )
  /cocoon/trunk/core/cocoon-core/src/main/java/org/apache/cocoon/transformation/helpers/DefaultIncludeCacheManager.java ( 585353 )
  /cocoon/trunk/core/cocoon-core/src/main/java/org/apache/cocoon/transformation/helpers/ModifiableSourceIncludeCacheStorageProxy.java ( 585353 )
  /cocoon/trunk/core/cocoon-core/src/main/java/org/apache/cocoon/transformation/helpers/StoreIncludeCacheStorageProxy.java ( 585353 )
  /cocoon/trunk/core/cocoon-core/src/main/java/org/apache/cocoon/xml/LoggingContentHandler.java ( 585353 )
  /cocoon/trunk/core/cocoon-core/src/main/java/org/apache/cocoon/xml/LoggingEntityResolver.java ( 585353 )
  /cocoon/trunk/core/cocoon-core/src/test/java/org/apache/cocoon/components/source/impl/XMLizableSource.java ( 585353 )
  /cocoon/trunk/core/cocoon-core/src/test/java/org/apache/cocoon/components/source/impl/XMLizableSourceFactory.java ( 585353 )

Changed: vgritsenko @ Tue 16 Oct 2007 20:59:05 -0700
Comment: AbstractLogEnabled switch
Files changed:
  /cocoon/trunk/blocks/cocoon-cron/cocoon-cron-impl/src/main/java/org/apache/cocoon/components/cron/QuartzDriverDelegate.java ( 585354 )
  /cocoon/trunk/blocks/cocoon-cron/cocoon-cron-impl/src/main/java/org/apache/cocoon/components/cron/QuartzJobScheduler.java ( 585354 )
  /cocoon/trunk/blocks/cocoon-cron/cocoon-cron-impl/src/main/java/org/apache/cocoon/components/cron/QuartzJobStoreCMT.java ( 585354 )
  /cocoon/trunk/blocks/cocoon-cron/cocoon-cron-impl/src/main/java/org/apache/cocoon/components/cron/QuartzJobStoreTX.java ( 585354 )
  /cocoon/trunk/blocks/cocoon-cron/cocoon-cron-impl/src/main/java/org/apache/cocoon/components/cron/ServiceableCronJob.java ( 585354 )

****************************************************************************
Dependencies Changes:
****************************************************************************
No dependencies changed


****************************************************************************
Build Defintion:
****************************************************************************
POM filename: pom.xml
Goals: clean install   
Arguments: --batch-mode -P allblocks
Build Fresh: false
Always Build: false
Default Build Definition: true
Schedule: DEFAULT_SCHEDULE
Profile Name: Java 1.4, Large Memory
Description: 


****************************************************************************
Test Summary:
****************************************************************************
Tests: 184
Failures: 0
Total time: 31714

****************************************************************************
Output:
****************************************************************************
[INFO] Scanning for projects...
[INFO] Reactor build order: 
[INFO]   Apache Cocoon
[INFO]   Cocoon Configuration API
[INFO]   Cocoon Spring Configurator
[INFO]   Cocoon Core [modules]
[INFO]   Cocoon Pipeline API
[INFO]   Cocoon Util
[INFO]   Cocoon XML API
[INFO]   Cocoon Expression Language API
[INFO]   Cocoon Pipeline Implementation
[INFO]   Cocoon XML Implementation
[INFO]   Cocoon Pipeline Components
[INFO]   Cocoon Sitemap API
[INFO]   Cocoon XML Utilities
[INFO]   Cocoon Expression Language Implementation.
[INFO]   Cocoon Thread API
[INFO]   Cocoon Sitemap Implementation
[INFO]   Cocoon Sitemap Components
[INFO]   Cocoon XML Resolver
[INFO]   Cocoon Store Implementation
[INFO]   Cocoon Thread Implementation
[INFO]   Cocoon Core
[INFO]   Cocoon Servlet Service Implementation
[INFO]   Cocoon Blocks [modules]
[INFO]   Cocoon Linkrewriter Block Implementation
[INFO]   Cocoon Servlet Service Components
[INFO]   Cocoon Ajax Block Implementation
[INFO]   Cocoon Template Framework Block Implementation
[INFO]   Cocoon Samples Style Default Block
[INFO]   Cocoon Ajax Block Sample
[INFO]   Cocoon Apples Block Implementation
[INFO]   Session Framework Implementation
[INFO]   XSP Block Implementation
[INFO]   Cocoon Main Core Sample Block
[INFO]   Cocoon Flowscript Block Implementation
[INFO]   Cocoon Forms Block Implementation
[INFO]   Cocoon Apples Block Samples
[INFO]   Cocoon Additional Sample Block
[INFO]   Cocoon Batik Block Implementation
[INFO]   Cocoon Forms Block Samples
[INFO]   Cocoon Linkrewriter Block Samples
[INFO]   Cocoon Template Block Samples
[INFO]   Cocoon Batik Block Samples
[INFO]   Cocoon Tools [modules]
[INFO]   Cocoon Reloading ClassLoader - Spring reloader
[INFO]   Cocoon Reloading ClassLoader - Webapp Wrapper
[INFO]   Cocoon Maven 2 Plugin
[INFO]   Cocoon Welcome (Samples)
[INFO]   Asciiart Block Implementation
[INFO]   Asciiart Block Samples
[INFO]   cocoon-acegisecurity
[INFO]   Cocoon Authentication Block API
[INFO]   Cocoon Authentication Block Implementation
[INFO]   Cocoon Authentication Block Sample
[INFO]   Authentication Framework Implementation
[INFO]   Authentication Framework Sample Application
[INFO]   Axis Block Implementation
[INFO]   Axis Block Samples
[INFO]   Bsf Block Implementation
[INFO]   Bsf Block Samples
[INFO]   Cocoon Captcha Block Implementation
[INFO]   Cocoon Captcha Block Sample
[INFO]   Chaperon Block Implementation
[INFO]   Chaperon Block Samples
[INFO]   Cron block implementation
[INFO]   Cron Block Samples
[INFO]   Cocoon Database Block Mocks
[INFO]   Cocoon Database Block Implementation
[INFO]   Cocoon Hsqldb Server Block Implementation
[INFO]   Cocoon Hsqldb Client Implementation
[INFO]   Cocoon Databases Block Samples
[INFO]   Cocoon ODBC client Implementation
[INFO]   Cocoon Oracle client Implementation
[INFO]   Cocoon PostgreSQL client Implementation
[INFO]   Deli Block Implementation
[INFO]   Deli Block Samples
[INFO]   JMS Block Implementation
[INFO]   Eventcache Block Implementation
[INFO]   Eventcache Block Samples
[INFO]   Taglib Block Implementation
[INFO]   Portal Block [modules]
[INFO]   Portal Block API
[INFO]   Cocoon Serializers Charsets
[INFO]   Portal Block Implementation
[INFO]   Faces Block Implementation
[INFO]   Faces Block Samples
[INFO]   Cocoon FOP Block Implementation
[INFO]   Cocoon FOP Block Samples
[INFO]   Cocoon FOP 0.9x Block Implementation
[INFO]   Cocoon FOP 0.9x Block Samples
[INFO]   Cocoon HTML Block Implementation
[INFO]   Cocoon Html Block Sample
[INFO]   Image Operation Block Implementation
[INFO]   Image Operation Block Samples
[INFO]   Itext Block Implementation
[INFO]   Itext Block Samples
[INFO]   Javaflow Block
[INFO]   Javaflow Block Samples
[INFO]   Jfor Block Implementation
[INFO]   Jfor Block Samples
[INFO]   JMS Block Samples
[INFO]   Jsp Block Mocks
[INFO]   Jsp Block Implementation
[INFO]   Jsp Block Samples
[INFO]   Lucene Block Implementation
[INFO]   Lucene Block Samples
[INFO]   Cocoon Mail Block Implementation
[INFO]   Cocoon Mail Block Sample
[INFO]   Midi Block Implementation
[INFO]   Midi Block Samples
[INFO]   Naming Block Implementation
[INFO]   Naming Block Samples
[INFO]   Ojb Block Mocks
[INFO]   Ojb Block Implementation
[INFO]   Querybean Block Implementation
[INFO]   Ojb Block Samples
[INFO]   Petstore Block Implementation
[INFO]   Velocity Block [modules]
[INFO]   Velocity Block Implementation
[INFO]   Petstore Block Samples
[INFO]   Poi Block Implementation
[INFO]   Poi Block Samples
[INFO]   Portal Block CAuth Support
[INFO]   Portal Block Bridges Implementation
[INFO]   Cocoon Serializers Block Implementation
[INFO]   Portal Block Sitemap
[INFO]   Portal Block Portlet Implementation
[INFO]   Portal Block Portlet Implementation
[INFO]   Portal Block WSRP Implementation
[INFO]   Portal Tools Block Implementation
[INFO]   Portal Block Sample
[INFO]   Profiler Block
[INFO]   Profiler Block Samples
[INFO]   Proxy Block Implementation
[INFO]   Proxy Block Samples
[INFO]   Python Block Mocks
[INFO]   Python Block Implementation
[INFO]   Qdox Block Implementation
[INFO]   Qdox Block Samples
[INFO]   Querybean Block Samples
[INFO]   Repository Block Implementation
[INFO]   Scratchpad Block Implementation
[INFO]   Scratchpad Block Samples
[INFO]   Session Framework Sample Application
[INFO]   Slide Block Implementation
[INFO]   Slide Block Samples
[INFO]   Slop Block Implementation
[INFO]   Slop Block Samples
[INFO]   Stx Block Implementation
[INFO]   Stx Block Samples
[INFO]   Taglib Block Samples
[INFO]   Tour Block [modules]
[INFO]   Tour Block Implementation
[INFO]   Tour Block Samples
[INFO]   Validation Block [modules]
[INFO]   Validation Block Implementation
[INFO]   Validation Block Sample
[INFO]   Velocity Block Samples
[INFO]   Web3 Block [modules]
[INFO]   Web3 Block Mocks
[INFO]   Web3 Block Implementation
[INFO]   Web3 Block Samples
[INFO]   Webdav Block [modules]
[INFO]   Webdav Block Implementation
[INFO]   Webdav Block Samples
[INFO]   XMLDB Block's Implementation
[INFO]   XMLDB Block's Samples
[INFO]   XSP Block Samples
[INFO]   Cocoon Licenses
[INFO]   Cocoon Commons [modules]
[INFO]   Cocoon Servlet Service Sample Blocks
[INFO]   Cocoon Webapp
[INFO]   Cocoon 2.2 Archetype: Block
[INFO]   Cocoon 2.2 Archetype: Block (plain)
[INFO]   Cocoon 2.2 Archetype: Web Application
[INFO]   Cocoon Maven Reports
[INFO]   Cocoon Maven Javadocs Script Report
[INFO]   Cocoon Maven Javadocs Script Report
[INFO]   Cocoon Distributions [modules]
[INFO]   Apache Cocoon [build root]
[INFO] ----------------------------------------------------------------------------
[INFO] Building Apache Cocoon
[INFO]    task-segment: [clean, install]
[INFO] ----------------------------------------------------------------------------
[INFO] [clean:clean]
[INFO] Deleting directory /home/continuum/data/working-directory/51/parent/target
[INFO] Deleting directory /home/continuum/data/working-directory/51/parent/target/classes
[INFO] Deleting directory /home/continuum/data/working-directory/51/parent/target/test-classes
[INFO] Deleting directory /home/continuum/data/working-directory/51/parent/target/site
[INFO] [enforcer:enforce-once {execution: enforce-maven}]
[INFO] [site:attach-descriptor]
[INFO] [install:install]
[INFO] Installing /home/continuum/data/working-directory/51/parent/pom.xml to /home/continuum/.m2/repository/org/apache/cocoon/cocoon/6-SNAPSHOT/cocoon-6-SNAPSHOT.pom
[INFO] ----------------------------------------------------------------------------
[INFO] Building Cocoon Configuration API
[INFO]    task-segment: [clean, install]
[INFO] ----------------------------------------------------------------------------
[INFO] [clean:clean]
[INFO] Deleting directory /home/continuum/data/working-directory/51/core/cocoon-configuration/cocoon-configuration-api/target
[INFO] Deleting directory /home/continuum/data/working-directory/51/core/cocoon-configuration/cocoon-configuration-api/target/classes
[INFO] Deleting directory /home/continuum/data/working-directory/51/core/cocoon-configuration/cocoon-configuration-api/target/test-classes
[INFO] Deleting directory /home/continuum/data/working-directory/51/core/cocoon-configuration/cocoon-configuration-api/target/site
[INFO] [enforcer:enforce-once {execution: enforce-maven}]
[INFO] [resources:resources]
[INFO] Using default encoding to copy filtered resources.
[INFO] [compiler:compile]
[INFO] Compiling 5 source files to /home/continuum/data/working-directory/51/core/cocoon-configuration/cocoon-configuration-api/target/classes
[INFO] [resources:testResources]
[INFO] Using default encoding to copy filtered resources.
[INFO] [compiler:testCompile]
[INFO] No sources to compile
[INFO] [surefire:test]
[INFO] No tests to run.
[INFO] [jar:jar]
[INFO] Building jar: /home/continuum/data/working-directory/51/core/cocoon-configuration/cocoon-configuration-api/target/cocoon-configuration-api-1.0.2-SNAPSHOT.jar
[INFO] [install:install]
[INFO] Installing /home/continuum/data/working-directory/51/core/cocoon-configuration/cocoon-configuration-api/target/cocoon-configuration-api-1.0.2-SNAPSHOT.jar to /home/continuum/.m2/repository/org/apache/cocoon/cocoon-configuration-api/1.0.2-SNAPSHOT/cocoon-configuration-api-1.0.2-SNAPSHOT.jar
[INFO] ----------------------------------------------------------------------------
[INFO] Building Cocoon Spring Configurator
[INFO]    task-segment: [clean, install]
[INFO] ----------------------------------------------------------------------------
[INFO] [clean:clean]
[INFO] Deleting directory /home/continuum/data/working-directory/51/core/cocoon-configuration/cocoon-spring-configurator/target
[INFO] Deleting directory /home/continuum/data/working-directory/51/core/cocoon-configuration/cocoon-spring-configurator/target/classes
[INFO] Deleting directory /home/continuum/data/working-directory/51/core/cocoon-configuration/cocoon-spring-configurator/target/test-classes
[INFO] Deleting directory /home/continuum/data/working-directory/51/core/cocoon-configuration/cocoon-spring-configurator/target/site
[INFO] [enforcer:enforce-once {execution: enforce-maven}]
[INFO] [resources:resources]
[INFO] Using default encoding to copy filtered resources.
[INFO] [compiler:compile]
[INFO] Compiling 22 source files to /home/continuum/data/working-directory/51/core/cocoon-configuration/cocoon-spring-configurator/target/classes
[INFO] [resources:testResources]
[INFO] Using default encoding to copy filtered resources.
[INFO] [compiler:testCompile]
[INFO] No sources to compile
[INFO] [surefire:test]
[INFO] No tests to run.
[INFO] [jar:jar]
[INFO] Building jar: /home/continuum/data/working-directory/51/core/cocoon-configuration/cocoon-spring-configurator/target/cocoon-spring-configurator-1.0.2-SNAPSHOT.jar
[INFO] [install:install]
[INFO] Installing /home/continuum/data/working-directory/51/core/cocoon-configuration/cocoon-spring-configurator/target/cocoon-spring-configurator-1.0.2-SNAPSHOT.jar to /home/continuum/.m2/repository/org/apache/cocoon/cocoon-spring-configurator/1.0.2-SNAPSHOT/cocoon-spring-configurator-1.0.2-SNAPSHOT.jar
[INFO] ----------------------------------------------------------------------------
[INFO] Building Cocoon Core [modules]
[INFO]    task-segment: [clean, install]
[INFO] ----------------------------------------------------------------------------
[INFO] [clean:clean]
[INFO] Deleting directory /home/continuum/data/working-directory/51/core/target
[INFO] Deleting directory /home/continuum/data/working-directory/51/core/target/classes
[INFO] Deleting directory /home/continuum/data/working-directory/51/core/target/test-classes
[INFO] Deleting directory /home/continuum/data/working-directory/51/core/target/site
[INFO] [enforcer:enforce-once {execution: enforce-maven}]
[INFO] [site:attach-descriptor]
[INFO] [install:install]
[INFO] Installing /home/continuum/data/working-directory/51/core/pom.xml to /home/continuum/.m2/repository/org/apache/cocoon/cocoon-core-modules/6-SNAPSHOT/cocoon-core-modules-6-SNAPSHOT.pom
[INFO] ----------------------------------------------------------------------------
[INFO] Building Cocoon Pipeline API
[INFO]    task-segment: [clean, install]
[INFO] ----------------------------------------------------------------------------
[INFO] [clean:clean]
[INFO] Deleting directory /home/continuum/data/working-directory/51/core/cocoon-pipeline/cocoon-pipeline-api/target
[INFO] Deleting directory /home/continuum/data/working-directory/51/core/cocoon-pipeline/cocoon-pipeline-api/target/classes
[INFO] Deleting directory /home/continuum/data/working-directory/51/core/cocoon-pipeline/cocoon-pipeline-api/target/test-classes
[INFO] Deleting directory /home/continuum/data/working-directory/51/core/cocoon-pipeline/cocoon-pipeline-api/target/site
[INFO] [enforcer:enforce-once {execution: enforce-maven}]
[INFO] [resources:resources]
[INFO] Using default encoding to copy filtered resources.
[INFO] [compiler:compile]
[INFO] Compiling 45 source files to /home/continuum/data/working-directory/51/core/cocoon-pipeline/cocoon-pipeline-api/target/classes
[INFO] [resources:testResources]
[INFO] Using default encoding to copy filtered resources.
[INFO] [compiler:testCompile]
[INFO] Compiling 1 source file to /home/continuum/data/working-directory/51/core/cocoon-pipeline/cocoon-pipeline-api/target/test-classes
[INFO] [surefire:test]
[INFO] Surefire report directory: /home/continuum/data/working-directory/51/core/cocoon-pipeline/cocoon-pipeline-api/target/surefire-reports

-------------------------------------------------------
 T E S T S
-------------------------------------------------------
Running org.apache.cocoon.util.location.LocationTestCase
Tests run: 3, Failures: 0, Errors: 0, Skipped: 0, Time elapsed: 0.087 sec

Results :

Tests run: 3, Failures: 0, Errors: 0, Skipped: 0

[INFO] [jar:jar]
[INFO] Building jar: /home/continuum/data/working-directory/51/core/cocoon-pipeline/cocoon-pipeline-api/target/cocoon-pipeline-api-1.0.0-RC3-SNAPSHOT.jar
[INFO] [install:install]
[INFO] Installing /home/continuum/data/working-directory/51/core/cocoon-pipeline/cocoon-pipeline-api/target/cocoon-pipeline-api-1.0.0-RC3-SNAPSHOT.jar to /home/continuum/.m2/repository/org/apache/cocoon/cocoon-pipeline-api/1.0.0-RC3-SNAPSHOT/cocoon-pipeline-api-1.0.0-RC3-SNAPSHOT.jar
[INFO] ----------------------------------------------------------------------------
[INFO] Building Cocoon Util
[INFO]    task-segment: [clean, install]
[INFO] ----------------------------------------------------------------------------
[INFO] [clean:clean]
[INFO] Deleting directory /home/continuum/data/working-directory/51/core/cocoon-util/target
[INFO] Deleting directory /home/continuum/data/working-directory/51/core/cocoon-util/target/classes
[INFO] Deleting directory /home/continuum/data/working-directory/51/core/cocoon-util/target/test-classes
[INFO] Deleting directory /home/continuum/data/working-directory/51/core/cocoon-util/target/site
[INFO] [enforcer:enforce-once {execution: enforce-maven}]
[INFO] [resources:resources]
[INFO] Using default encoding to copy filtered resources.
[INFO] [compiler:compile]
[INFO] Compiling 24 source files to /home/continuum/data/working-directory/51/core/cocoon-util/target/classes
[INFO] [resources:testResources]
[INFO] Using default encoding to copy filtered resources.
[INFO] [compiler:testCompile]
[INFO] Compiling 5 source files to /home/continuum/data/working-directory/51/core/cocoon-util/target/test-classes
[INFO] [surefire:test]
[INFO] Surefire report directory: /home/continuum/data/working-directory/51/core/cocoon-util/target/surefire-reports

-------------------------------------------------------
 T E S T S
-------------------------------------------------------
Running org.apache.cocoon.util.test.DeprecationTestCase
Tests run: 8, Failures: 0, Errors: 0, Skipped: 0, Time elapsed: 0.07 sec
Running org.apache.cocoon.util.test.IOUtilsTestCase
Tests run: 2, Failures: 0, Errors: 0, Skipped: 0, Time elapsed: 0.058 sec
Running org.apache.cocoon.util.test.NetUtilsTestCase
Tests run: 8, Failures: 0, Errors: 0, Skipped: 0, Time elapsed: 0.018 sec
Running org.apache.cocoon.util.test.MIMEUtilsTestCase
Tests run: 1, Failures: 0, Errors: 0, Skipped: 0, Time elapsed: 0.01 sec
Running org.apache.cocoon.util.WildcardMatcherHelperTestCase
Tests run: 40, Failures: 0, Errors: 0, Skipped: 0, Time elapsed: 0.064 sec

Results :

Tests run: 59, Failures: 0, Errors: 0, Skipped: 0

[INFO] [jar:jar]
[INFO] Building jar: /home/continuum/data/working-directory/51/core/cocoon-util/target/cocoon-util-1.0.0-RC3-SNAPSHOT.jar
[INFO] [install:install]
[INFO] Installing /home/continuum/data/working-directory/51/core/cocoon-util/target/cocoon-util-1.0.0-RC3-SNAPSHOT.jar to /home/continuum/.m2/repository/org/apache/cocoon/cocoon-util/1.0.0-RC3-SNAPSHOT/cocoon-util-1.0.0-RC3-SNAPSHOT.jar
[INFO] ----------------------------------------------------------------------------
[INFO] Building Cocoon XML API
[INFO]    task-segment: [clean, install]
[INFO] ----------------------------------------------------------------------------
[INFO] [clean:clean]
[INFO] Deleting directory /home/continuum/data/working-directory/51/core/cocoon-xml/cocoon-xml-api/target
[INFO] Deleting directory /home/continuum/data/working-directory/51/core/cocoon-xml/cocoon-xml-api/target/classes
[INFO] Deleting directory /home/continuum/data/working-directory/51/core/cocoon-xml/cocoon-xml-api/target/test-classes
[INFO] Deleting directory /home/continuum/data/working-directory/51/core/cocoon-xml/cocoon-xml-api/target/site
[INFO] [enforcer:enforce-once {execution: enforce-maven}]
[INFO] [resources:resources]
[INFO] Using default encoding to copy filtered resources.
[INFO] [compiler:compile]
[INFO] Compiling 2 source files to /home/continuum/data/working-directory/51/core/cocoon-xml/cocoon-xml-api/target/classes
[INFO] [resources:testResources]
[INFO] Using default encoding to copy filtered resources.
[INFO] [compiler:testCompile]
[INFO] No sources to compile
[INFO] [surefire:test]
[INFO] No tests to run.
[INFO] [jar:jar]
[INFO] Building jar: /home/continuum/data/working-directory/51/core/cocoon-xml/cocoon-xml-api/target/cocoon-xml-api-1.0.0-RC3-SNAPSHOT.jar
[INFO] [install:install]
[INFO] Installing /home/continuum/data/working-directory/51/core/cocoon-xml/cocoon-xml-api/target/cocoon-xml-api-1.0.0-RC3-SNAPSHOT.jar to /home/continuum/.m2/repository/org/apache/cocoon/cocoon-xml-api/1.0.0-RC3-SNAPSHOT/cocoon-xml-api-1.0.0-RC3-SNAPSHOT.jar
[INFO] ----------------------------------------------------------------------------
[INFO] Building Cocoon Expression Language API
[INFO]    task-segment: [clean, install]
[INFO] ----------------------------------------------------------------------------
[INFO] [clean:clean]
[INFO] Deleting directory /home/continuum/data/working-directory/51/core/cocoon-expression-language/cocoon-expression-language-api/target
[INFO] Deleting directory /home/continuum/data/working-directory/51/core/cocoon-expression-language/cocoon-expression-language-api/target/classes
[INFO] Deleting directory /home/continuum/data/working-directory/51/core/cocoon-expression-language/cocoon-expression-language-api/target/test-classes
[INFO] Deleting directory /home/continuum/data/working-directory/51/core/cocoon-expression-language/cocoon-expression-language-api/target/site
[INFO] [enforcer:enforce-once {execution: enforce-maven}]
[INFO] [resources:resources]
[INFO] Using default encoding to copy filtered resources.
[INFO] [compiler:compile]
[INFO] Compiling 8 source files to /home/continuum/data/working-directory/51/core/cocoon-expression-language/cocoon-expression-language-api/target/classes
[INFO] [resources:testResources]
[INFO] Using default encoding to copy filtered resources.
[INFO] [compiler:testCompile]
[INFO] No sources to compile
[INFO] [surefire:test]
[INFO] No tests to run.
[INFO] [jar:jar]
[INFO] Building jar: /home/continuum/data/working-directory/51/core/cocoon-expression-language/cocoon-expression-language-api/target/cocoon-expression-language-api-1.0.0-RC3-SNAPSHOT.jar
[INFO] [install:install]
[INFO] Installing /home/continuum/data/working-directory/51/core/cocoon-expression-language/cocoon-expression-language-api/target/cocoon-expression-language-api-1.0.0-RC3-SNAPSHOT.jar to /home/continuum/.m2/repository/org/apache/cocoon/cocoon-expression-language-api/1.0.0-RC3-SNAPSHOT/cocoon-expression-language-api-1.0.0-RC3-SNAPSHOT.jar
[INFO] ----------------------------------------------------------------------------
[INFO] Building Cocoon Pipeline Implementation
[INFO]    task-segment: [clean, install]
[INFO] ----------------------------------------------------------------------------
[INFO] [clean:clean]
[INFO] Deleting directory /home/continuum/data/working-directory/51/core/cocoon-pipeline/cocoon-pipeline-impl/target
[INFO] Deleting directory /home/continuum/data/working-directory/51/core/cocoon-pipeline/cocoon-pipeline-impl/target/classes
[INFO] Deleting directory /home/continuum/data/working-directory/51/core/cocoon-pipeline/cocoon-pipeline-impl/target/test-classes
[INFO] Deleting directory /home/continuum/data/working-directory/51/core/cocoon-pipeline/cocoon-pipeline-impl/target/site
[INFO] [enforcer:enforce-once {execution: enforce-maven}]
[INFO] [resources:resources]
[INFO] Using default encoding to copy filtered resources.
[INFO] [compiler:compile]
[INFO] Compiling 89 source files to /home/continuum/data/working-directory/51/core/cocoon-pipeline/cocoon-pipeline-impl/target/classes
[INFO] [resources:testResources]
[INFO] Using default encoding to copy filtered resources.
[INFO] [compiler:testCompile]
[INFO] Compiling 8 source files to /home/continuum/data/working-directory/51/core/cocoon-pipeline/cocoon-pipeline-impl/target/test-classes
[INFO] [surefire:test]
[INFO] Surefire report directory: /home/continuum/data/working-directory/51/core/cocoon-pipeline/cocoon-pipeline-impl/target/surefire-reports

-------------------------------------------------------
 T E S T S
-------------------------------------------------------
Running org.apache.cocoon.xml.SaxBufferTestCase
consuming: 400000.0 documents per second
parsed:9389.0 documents per second
recalling: 434782.0 documents per second
Tests run: 3, Failures: 0, Errors: 0, Skipped: 0, Time elapsed: 1.253 sec
Running org.apache.cocoon.xml.dom.DOMBuilderTestCase
Tests run: 1, Failures: 0, Errors: 0, Skipped: 0, Time elapsed: 0.034 sec
Running org.apache.cocoon.components.sax.XMLByteStreamCompilerInterpreterTestCase
consuming: 196078.0 documents per second
parsed: 13440.0 documents per second
recalling: 101010.0 documents per second
Tests run: 4, Failures: 0, Errors: 0, Skipped: 0, Time elapsed: 1.008 sec
Running org.apache.cocoon.xml.dom.DOMBuilderStreamerTestCase
<?xml version="1.0" encoding="UTF-8"?>
<root/>
<?xml version="1.0" encoding="UTF-8"?>
<!--abcd--><root/>
Tests run: 7, Failures: 0, Errors: 0, Skipped: 0, Time elapsed: 0.055 sec

Results :

Tests run: 15, Failures: 0, Errors: 0, Skipped: 0

[INFO] [jar:jar]
[INFO] Building jar: /home/continuum/data/working-directory/51/core/cocoon-pipeline/cocoon-pipeline-impl/target/cocoon-pipeline-impl-1.0.0-RC3-SNAPSHOT.jar
[INFO] [jar:test-jar {execution: default}]
[INFO] Building jar: /home/continuum/data/working-directory/51/core/cocoon-pipeline/cocoon-pipeline-impl/target/cocoon-pipeline-impl-1.0.0-RC3-SNAPSHOT-tests.jar
[INFO] [install:install]
[INFO] Installing /home/continuum/data/working-directory/51/core/cocoon-pipeline/cocoon-pipeline-impl/target/cocoon-pipeline-impl-1.0.0-RC3-SNAPSHOT.jar to /home/continuum/.m2/repository/org/apache/cocoon/cocoon-pipeline-impl/1.0.0-RC3-SNAPSHOT/cocoon-pipeline-impl-1.0.0-RC3-SNAPSHOT.jar
[INFO] Installing /home/continuum/data/working-directory/51/core/cocoon-pipeline/cocoon-pipeline-impl/target/cocoon-pipeline-impl-1.0.0-RC3-SNAPSHOT-tests.jar to /home/continuum/.m2/repository/org/apache/cocoon/cocoon-pipeline-impl/1.0.0-RC3-SNAPSHOT/cocoon-pipeline-impl-1.0.0-RC3-SNAPSHOT-tests.jar
[INFO] ----------------------------------------------------------------------------
[INFO] Building Cocoon XML Implementation
[INFO]    task-segment: [clean, install]
[INFO] ----------------------------------------------------------------------------
[INFO] [clean:clean]
[INFO] Deleting directory /home/continuum/data/working-directory/51/core/cocoon-xml/cocoon-xml-impl/target
[INFO] Deleting directory /home/continuum/data/working-directory/51/core/cocoon-xml/cocoon-xml-impl/target/classes
[INFO] Deleting directory /home/continuum/data/working-directory/51/core/cocoon-xml/cocoon-xml-impl/target/test-classes
[INFO] Deleting directory /home/continuum/data/working-directory/51/core/cocoon-xml/cocoon-xml-impl/target/site
[INFO] [enforcer:enforce-once {execution: enforce-maven}]
[INFO] [resources:resources]
[INFO] Using default encoding to copy filtered resources.
[INFO] [compiler:compile]
[INFO] Compiling 4 source files to /home/continuum/data/working-directory/51/core/cocoon-xml/cocoon-xml-impl/target/classes
[INFO] [resources:testResources]
[INFO] Using default encoding to copy filtered resources.
[INFO] [compiler:testCompile]
[INFO] No sources to compile
[INFO] [surefire:test]
[INFO] No tests to run.
[INFO] [jar:jar]
[INFO] Building jar: /home/continuum/data/working-directory/51/core/cocoon-xml/cocoon-xml-impl/target/cocoon-xml-impl-1.0.0-RC3-SNAPSHOT.jar
[INFO] [install:install]
[INFO] Installing /home/continuum/data/working-directory/51/core/cocoon-xml/cocoon-xml-impl/target/cocoon-xml-impl-1.0.0-RC3-SNAPSHOT.jar to /home/continuum/.m2/repository/org/apache/cocoon/cocoon-xml-impl/1.0.0-RC3-SNAPSHOT/cocoon-xml-impl-1.0.0-RC3-SNAPSHOT.jar
[INFO] ----------------------------------------------------------------------------
[INFO] Building Cocoon Pipeline Components
[INFO]    task-segment: [clean, install]
[INFO] ----------------------------------------------------------------------------
[INFO] [clean:clean]
[INFO] Deleting directory /home/continuum/data/working-directory/51/core/cocoon-pipeline/cocoon-pipeline-components/target
[INFO] Deleting directory /home/continuum/data/working-directory/51/core/cocoon-pipeline/cocoon-pipeline-components/target/classes
[INFO] Deleting directory /home/continuum/data/working-directory/51/core/cocoon-pipeline/cocoon-pipeline-components/target/test-classes
[INFO] Deleting directory /home/continuum/data/working-directory/51/core/cocoon-pipeline/cocoon-pipeline-components/target/site
[INFO] [enforcer:enforce-once {execution: enforce-maven}]
[INFO] [resources:resources]
[INFO] Using default encoding to copy filtered resources.
[INFO] [compiler:compile]
[INFO] Compiling 69 source files to /home/continuum/data/working-directory/51/core/cocoon-pipeline/cocoon-pipeline-components/target/classes
[INFO] [resources:testResources]
[INFO] Using default encoding to copy filtered resources.
[INFO] [compiler:testCompile]
[INFO] Nothing to compile - all classes are up to date
[INFO] [surefire:test]
[INFO] Surefire report directory: /home/continuum/data/working-directory/51/core/cocoon-pipeline/cocoon-pipeline-components/target/surefire-reports

-------------------------------------------------------
 T E S T S
-------------------------------------------------------
There are no tests to run.

Results :

Tests run: 0, Failures: 0, Errors: 0, Skipped: 0

[INFO] [jar:jar]
[INFO] Building jar: /home/continuum/data/working-directory/51/core/cocoon-pipeline/cocoon-pipeline-components/target/cocoon-pipeline-components-1.0.0-RC3-SNAPSHOT.jar
[INFO] [install:install]
[INFO] Installing /home/continuum/data/working-directory/51/core/cocoon-pipeline/cocoon-pipeline-components/target/cocoon-pipeline-components-1.0.0-RC3-SNAPSHOT.jar to /home/continuum/.m2/repository/org/apache/cocoon/cocoon-pipeline-components/1.0.0-RC3-SNAPSHOT/cocoon-pipeline-components-1.0.0-RC3-SNAPSHOT.jar
[INFO] ----------------------------------------------------------------------------
[INFO] Building Cocoon Sitemap API
[INFO]    task-segment: [clean, install]
[INFO] ----------------------------------------------------------------------------
[INFO] [clean:clean]
[INFO] Deleting directory /home/continuum/data/working-directory/51/core/cocoon-sitemap/cocoon-sitemap-api/target
[INFO] Deleting directory /home/continuum/data/working-directory/51/core/cocoon-sitemap/cocoon-sitemap-api/target/classes
[INFO] Deleting directory /home/continuum/data/working-directory/51/core/cocoon-sitemap/cocoon-sitemap-api/target/test-classes
[INFO] Deleting directory /home/continuum/data/working-directory/51/core/cocoon-sitemap/cocoon-sitemap-api/target/site
[INFO] [enforcer:enforce-once {execution: enforce-maven}]
[INFO] [resources:resources]
[INFO] Using default encoding to copy filtered resources.
[INFO] [compiler:compile]
[INFO] Compiling 29 source files to /home/continuum/data/working-directory/51/core/cocoon-sitemap/cocoon-sitemap-api/target/classes
[INFO] [resources:testResources]
[INFO] Using default encoding to copy filtered resources.
[INFO] [compiler:testCompile]
[INFO] No sources to compile
[INFO] [surefire:test]
[INFO] No tests to run.
[INFO] [jar:jar]
[INFO] Building jar: /home/continuum/data/working-directory/51/core/cocoon-sitemap/cocoon-sitemap-api/target/cocoon-sitemap-api-1.0.0-RC3-SNAPSHOT.jar
[INFO] [install:install]
[INFO] Installing /home/continuum/data/working-directory/51/core/cocoon-sitemap/cocoon-sitemap-api/target/cocoon-sitemap-api-1.0.0-RC3-SNAPSHOT.jar to /home/continuum/.m2/repository/org/apache/cocoon/cocoon-sitemap-api/1.0.0-RC3-SNAPSHOT/cocoon-sitemap-api-1.0.0-RC3-SNAPSHOT.jar
[INFO] ----------------------------------------------------------------------------
[INFO] Building Cocoon XML Utilities
[INFO]    task-segment: [clean, install]
[INFO] ----------------------------------------------------------------------------
[INFO] [clean:clean]
[INFO] Deleting directory /home/continuum/data/working-directory/51/core/cocoon-xml/cocoon-xml-util/target
[INFO] Deleting directory /home/continuum/data/working-directory/51/core/cocoon-xml/cocoon-xml-util/target/classes
[INFO] Deleting directory /home/continuum/data/working-directory/51/core/cocoon-xml/cocoon-xml-util/target/test-classes
[INFO] Deleting directory /home/continuum/data/working-directory/51/core/cocoon-xml/cocoon-xml-util/target/site
[INFO] [enforcer:enforce-once {execution: enforce-maven}]
[INFO] [resources:resources]
[INFO] Using default encoding to copy filtered resources.
[INFO] [compiler:compile]
[INFO] Compiling 2 source files to /home/continuum/data/working-directory/51/core/cocoon-xml/cocoon-xml-util/target/classes
[INFO] [resources:testResources]
[INFO] Using default encoding to copy filtered resources.
[INFO] [compiler:testCompile]
[INFO] Compiling 1 source file to /home/continuum/data/working-directory/51/core/cocoon-xml/cocoon-xml-util/target/test-classes
[INFO] [surefire:test]
[INFO] Surefire report directory: /home/continuum/data/working-directory/51/core/cocoon-xml/cocoon-xml-util/target/surefire-reports

-------------------------------------------------------
 T E S T S
-------------------------------------------------------
Running org.apache.cocoon.xml.util.NamespacesTableTestCase
Tests run: 6, Failures: 0, Errors: 0, Skipped: 0, Time elapsed: 0.056 sec

Results :

Tests run: 6, Failures: 0, Errors: 0, Skipped: 0

[INFO] [jar:jar]
[INFO] Building jar: /home/continuum/data/working-directory/51/core/cocoon-xml/cocoon-xml-util/target/cocoon-xml-util-1.0.0-RC3-SNAPSHOT.jar
[INFO] [install:install]
[INFO] Installing /home/continuum/data/working-directory/51/core/cocoon-xml/cocoon-xml-util/target/cocoon-xml-util-1.0.0-RC3-SNAPSHOT.jar to /home/continuum/.m2/repository/org/apache/cocoon/cocoon-xml-util/1.0.0-RC3-SNAPSHOT/cocoon-xml-util-1.0.0-RC3-SNAPSHOT.jar
[INFO] ----------------------------------------------------------------------------
[INFO] Building Cocoon Expression Language Implementation.
[INFO]    task-segment: [clean, install]
[INFO] ----------------------------------------------------------------------------
[INFO] [clean:clean]
[INFO] Deleting directory /home/continuum/data/working-directory/51/core/cocoon-expression-language/cocoon-expression-language-impl/target
[INFO] Deleting directory /home/continuum/data/working-directory/51/core/cocoon-expression-language/cocoon-expression-language-impl/target/classes
[INFO] Deleting directory /home/continuum/data/working-directory/51/core/cocoon-expression-language/cocoon-expression-language-impl/target/test-classes
[INFO] Deleting directory /home/continuum/data/working-directory/51/core/cocoon-expression-language/cocoon-expression-language-impl/target/site
[INFO] [enforcer:enforce-once {execution: enforce-maven}]
[INFO] [resources:resources]
[INFO] Using default encoding to copy filtered resources.
[INFO] [compiler:compile]
[INFO] Compiling 21 source files to /home/continuum/data/working-directory/51/core/cocoon-expression-language/cocoon-expression-language-impl/target/classes
[INFO] [resources:testResources]
[INFO] Using default encoding to copy filtered resources.
[INFO] [compiler:testCompile]
[INFO] Compiling 5 source files to /home/continuum/data/working-directory/51/core/cocoon-expression-language/cocoon-expression-language-impl/target/test-classes
[INFO] [surefire:test]
[INFO] Surefire report directory: /home/continuum/data/working-directory/51/core/cocoon-expression-language/cocoon-expression-language-impl/target/surefire-reports

-------------------------------------------------------
 T E S T S
-------------------------------------------------------
Running org.apache.cocoon.el.impl.jxpath.JXPathTestCase
Tests run: 1, Failures: 0, Errors: 0, Skipped: 0, Time elapsed: 0.174 sec
Running org.apache.cocoon.el.impl.DefaultExpressionFactoryTestCase
log4j:WARN No appenders could be found for logger (org.apache.commons.jexl.ExpressionFactory).
log4j:WARN Please initialize the log4j system properly.
Tests run: 3, Failures: 0, Errors: 0, Skipped: 0, Time elapsed: 0.205 sec
Running org.apache.cocoon.el.impl.jexl.JexlTestCase
Tests run: 3, Failures: 0, Errors: 0, Skipped: 0, Time elapsed: 0.014 sec
Running org.apache.cocoon.el.impl.objectmodel.ObjectModelImplTestCase
Tests run: 11, Failures: 0, Errors: 0, Skipped: 0, Time elapsed: 0.04 sec
Running org.apache.cocoon.el.impl.javascript.JavaScriptTestCase
Tests run: 3, Failures: 0, Errors: 0, Skipped: 0, Time elapsed: 0.34 sec

Results :

Tests run: 21, Failures: 0, Errors: 0, Skipped: 0

[INFO] [jar:jar]
[INFO] Building jar: /home/continuum/data/working-directory/51/core/cocoon-expression-language/cocoon-expression-language-impl/target/cocoon-expression-language-impl-1.0.0-RC3-SNAPSHOT.jar
[INFO] [install:install]
[INFO] Installing /home/continuum/data/working-directory/51/core/cocoon-expression-language/cocoon-expression-language-impl/target/cocoon-expression-language-impl-1.0.0-RC3-SNAPSHOT.jar to /home/continuum/.m2/repository/org/apache/cocoon/cocoon-expression-language-impl/1.0.0-RC3-SNAPSHOT/cocoon-expression-language-impl-1.0.0-RC3-SNAPSHOT.jar
[INFO] ----------------------------------------------------------------------------
[INFO] Building Cocoon Thread API
[INFO]    task-segment: [clean, install]
[INFO] ----------------------------------------------------------------------------
[INFO] [clean:clean]
[INFO] Deleting directory /home/continuum/data/working-directory/51/core/cocoon-thread/cocoon-thread-api/target
[INFO] Deleting directory /home/continuum/data/working-directory/51/core/cocoon-thread/cocoon-thread-api/target/classes
[INFO] Deleting directory /home/continuum/data/working-directory/51/core/cocoon-thread/cocoon-thread-api/target/test-classes
[INFO] Deleting directory /home/continuum/data/working-directory/51/core/cocoon-thread/cocoon-thread-api/target/site
[INFO] [enforcer:enforce-once {execution: enforce-maven}]
[INFO] [resources:resources]
[INFO] Using default encoding to copy filtered resources.
[INFO] [compiler:compile]
[INFO] Compiling 3 source files to /home/continuum/data/working-directory/51/core/cocoon-thread/cocoon-thread-api/target/classes
[INFO] [resources:testResources]
[INFO] Using default encoding to copy filtered resources.
[INFO] [compiler:testCompile]
[INFO] No sources to compile
[INFO] [surefire:test]
[INFO] No tests to run.
[INFO] [jar:jar]
[INFO] Building jar: /home/continuum/data/working-directory/51/core/cocoon-thread/cocoon-thread-api/target/cocoon-thread-api-1.0.0-RC3-SNAPSHOT.jar
[INFO] [install:install]
[INFO] Installing /home/continuum/data/working-directory/51/core/cocoon-thread/cocoon-thread-api/target/cocoon-thread-api-1.0.0-RC3-SNAPSHOT.jar to /home/continuum/.m2/repository/org/apache/cocoon/cocoon-thread-api/1.0.0-RC3-SNAPSHOT/cocoon-thread-api-1.0.0-RC3-SNAPSHOT.jar
[INFO] ----------------------------------------------------------------------------
[INFO] Building Cocoon Sitemap Implementation
[INFO]    task-segment: [clean, install]
[INFO] ----------------------------------------------------------------------------
[INFO] [clean:clean]
[INFO] Deleting directory /home/continuum/data/working-directory/51/core/cocoon-sitemap/cocoon-sitemap-impl/target
[INFO] Deleting directory /home/continuum/data/working-directory/51/core/cocoon-sitemap/cocoon-sitemap-impl/target/classes
[INFO] Deleting directory /home/continuum/data/working-directory/51/core/cocoon-sitemap/cocoon-sitemap-impl/target/test-classes
[INFO] Deleting directory /home/continuum/data/working-directory/51/core/cocoon-sitemap/cocoon-sitemap-impl/target/site
[INFO] [enforcer:enforce-once {execution: enforce-maven}]
[INFO] [resources:resources]
[INFO] Using default encoding to copy filtered resources.
[INFO] [compiler:compile]
[INFO] Compiling 184 source files to /home/continuum/data/working-directory/51/core/cocoon-sitemap/cocoon-sitemap-impl/target/classes
[INFO] [resources:testResources]
[INFO] Using default encoding to copy filtered resources.
[INFO] [compiler:testCompile]
[INFO] Compiling 11 source files to /home/continuum/data/working-directory/51/core/cocoon-sitemap/cocoon-sitemap-impl/target/test-classes
[INFO] [surefire:test]
[INFO] Surefire report directory: /home/continuum/data/working-directory/51/core/cocoon-sitemap/cocoon-sitemap-impl/target/surefire-reports

-------------------------------------------------------
 T E S T S
-------------------------------------------------------
Running org.apache.cocoon.environment.FOMTestCase
log4j:WARN No appenders could be found for logger (org.springframework.util.ClassUtils).
log4j:WARN Please initialize the log4j system properly.
Tests run: 2, Failures: 0, Errors: 0, Skipped: 0, Time elapsed: 3.795 sec

Results :

Tests run: 2, Failures: 0, Errors: 0, Skipped: 0

[INFO] [jar:jar]
[INFO] Building jar: /home/continuum/data/working-directory/51/core/cocoon-sitemap/cocoon-sitemap-impl/target/cocoon-sitemap-impl-1.0.0-RC3-SNAPSHOT.jar
[INFO] [jar:test-jar {execution: default}]
[INFO] Building jar: /home/continuum/data/working-directory/51/core/cocoon-sitemap/cocoon-sitemap-impl/target/cocoon-sitemap-impl-1.0.0-RC3-SNAPSHOT-tests.jar
[INFO] [install:install]
[INFO] Installing /home/continuum/data/working-directory/51/core/cocoon-sitemap/cocoon-sitemap-impl/target/cocoon-sitemap-impl-1.0.0-RC3-SNAPSHOT.jar to /home/continuum/.m2/repository/org/apache/cocoon/cocoon-sitemap-impl/1.0.0-RC3-SNAPSHOT/cocoon-sitemap-impl-1.0.0-RC3-SNAPSHOT.jar
[INFO] Installing /home/continuum/data/working-directory/51/core/cocoon-sitemap/cocoon-sitemap-impl/target/cocoon-sitemap-impl-1.0.0-RC3-SNAPSHOT-tests.jar to /home/continuum/.m2/repository/org/apache/cocoon/cocoon-sitemap-impl/1.0.0-RC3-SNAPSHOT/cocoon-sitemap-impl-1.0.0-RC3-SNAPSHOT-tests.jar
[INFO] ----------------------------------------------------------------------------
[INFO] Building Cocoon Sitemap Components
[INFO]    task-segment: [clean, install]
[INFO] ----------------------------------------------------------------------------
[INFO] [clean:clean]
[INFO] Deleting directory /home/continuum/data/working-directory/51/core/cocoon-sitemap/cocoon-sitemap-components/target
[INFO] Deleting directory /home/continuum/data/working-directory/51/core/cocoon-sitemap/cocoon-sitemap-components/target/classes
[INFO] Deleting directory /home/continuum/data/working-directory/51/core/cocoon-sitemap/cocoon-sitemap-components/target/test-classes
[INFO] Deleting directory /home/continuum/data/working-directory/51/core/cocoon-sitemap/cocoon-sitemap-components/target/site
[INFO] [enforcer:enforce-once {execution: enforce-maven}]
[INFO] [resources:resources]
[INFO] Using default encoding to copy filtered resources.
[INFO] [compiler:compile]
[INFO] Compiling 107 source files to /home/continuum/data/working-directory/51/core/cocoon-sitemap/cocoon-sitemap-components/target/classes
[INFO] [resources:testResources]
[INFO] Using default encoding to copy filtered resources.
[INFO] [compiler:testCompile]
[INFO] Nothing to compile - all classes are up to date
[INFO] [surefire:test]
[INFO] Surefire report directory: /home/continuum/data/working-directory/51/core/cocoon-sitemap/cocoon-sitemap-components/target/surefire-reports

-------------------------------------------------------
 T E S T S
-------------------------------------------------------
There are no tests to run.

Results :

Tests run: 0, Failures: 0, Errors: 0, Skipped: 0

[INFO] [jar:jar]
[INFO] Building jar: /home/continuum/data/working-directory/51/core/cocoon-sitemap/cocoon-sitemap-components/target/cocoon-sitemap-components-1.0.0-RC3-SNAPSHOT.jar
[INFO] [install:install]
[INFO] Installing /home/continuum/data/working-directory/51/core/cocoon-sitemap/cocoon-sitemap-components/target/cocoon-sitemap-components-1.0.0-RC3-SNAPSHOT.jar to /home/continuum/.m2/repository/org/apache/cocoon/cocoon-sitemap-components/1.0.0-RC3-SNAPSHOT/cocoon-sitemap-components-1.0.0-RC3-SNAPSHOT.jar
[INFO] ----------------------------------------------------------------------------
[INFO] Building Cocoon XML Resolver
[INFO]    task-segment: [clean, install]
[INFO] ----------------------------------------------------------------------------
[INFO] [clean:clean]
[INFO] Deleting directory /home/continuum/data/working-directory/51/core/cocoon-xml/cocoon-xml-resolver/target
[INFO] Deleting directory /home/continuum/data/working-directory/51/core/cocoon-xml/cocoon-xml-resolver/target/classes
[INFO] Deleting directory /home/continuum/data/working-directory/51/core/cocoon-xml/cocoon-xml-resolver/target/test-classes
[INFO] Deleting directory /home/continuum/data/working-directory/51/core/cocoon-xml/cocoon-xml-resolver/target/site
[INFO] [enforcer:enforce-once {execution: enforce-maven}]
[INFO] [resources:resources]
[INFO] Using default encoding to copy filtered resources.
[INFO] [compiler:compile]
[INFO] Compiling 1 source file to /home/continuum/data/working-directory/51/core/cocoon-xml/cocoon-xml-resolver/target/classes
[INFO] [resources:testResources]
[INFO] Using default encoding to copy filtered resources.
[INFO] [compiler:testCompile]
[INFO] No sources to compile
[INFO] [surefire:test]
[INFO] No tests to run.
[INFO] [jar:jar]
[INFO] Building jar: /home/continuum/data/working-directory/51/core/cocoon-xml/cocoon-xml-resolver/target/cocoon-xml-resolver-1.0.0-RC3-SNAPSHOT.jar
[INFO] [install:install]
[INFO] Installing /home/continuum/data/working-directory/51/core/cocoon-xml/cocoon-xml-resolver/target/cocoon-xml-resolver-1.0.0-RC3-SNAPSHOT.jar to /home/continuum/.m2/repository/org/apache/cocoon/cocoon-xml-resolver/1.0.0-RC3-SNAPSHOT/cocoon-xml-resolver-1.0.0-RC3-SNAPSHOT.jar
[INFO] ----------------------------------------------------------------------------
[INFO] Building Cocoon Store Implementation
[INFO]    task-segment: [clean, install]
[INFO] ----------------------------------------------------------------------------
[INFO] [clean:clean]
[INFO] Deleting directory /home/continuum/data/working-directory/51/core/cocoon-store/cocoon-store-impl/target
[INFO] Deleting directory /home/continuum/data/working-directory/51/core/cocoon-store/cocoon-store-impl/target/classes
[INFO] Deleting directory /home/continuum/data/working-directory/51/core/cocoon-store/cocoon-store-impl/target/test-classes
[INFO] Deleting directory /home/continuum/data/working-directory/51/core/cocoon-store/cocoon-store-impl/target/site
[INFO] [enforcer:enforce-once {execution: enforce-maven}]
[INFO] [resources:resources]
[INFO] Using default encoding to copy filtered resources.
[INFO] [compiler:compile]
[INFO] Compiling 7 source files to /home/continuum/data/working-directory/51/core/cocoon-store/cocoon-store-impl/target/classes
[INFO] [resources:testResources]
[INFO] Using default encoding to copy filtered resources.
[INFO] [compiler:testCompile]
[INFO] No sources to compile
[INFO] [surefire:test]
[INFO] No tests to run.
[INFO] [jar:jar]
[INFO] Building jar: /home/continuum/data/working-directory/51/core/cocoon-store/cocoon-store-impl/target/cocoon-store-impl-1.0.0-RC3-SNAPSHOT.jar
[INFO] [install:install]
[INFO] Installing /home/continuum/data/working-directory/51/core/cocoon-store/cocoon-store-impl/target/cocoon-store-impl-1.0.0-RC3-SNAPSHOT.jar to /home/continuum/.m2/repository/org/apache/cocoon/cocoon-store-impl/1.0.0-RC3-SNAPSHOT/cocoon-store-impl-1.0.0-RC3-SNAPSHOT.jar
[INFO] ----------------------------------------------------------------------------
[INFO] Building Cocoon Thread Implementation
[INFO]    task-segment: [clean, install]
[INFO] ----------------------------------------------------------------------------
[INFO] [clean:clean]
[INFO] Deleting directory /home/continuum/data/working-directory/51/core/cocoon-thread/cocoon-thread-impl/target
[INFO] Deleting directory /home/continuum/data/working-directory/51/core/cocoon-thread/cocoon-thread-impl/target/classes
[INFO] Deleting directory /home/continuum/data/working-directory/51/core/cocoon-thread/cocoon-thread-impl/target/test-classes
[INFO] Deleting directory /home/continuum/data/working-directory/51/core/cocoon-thread/cocoon-thread-impl/target/site
[INFO] [enforcer:enforce-once {execution: enforce-maven}]
[INFO] [resources:resources]
[INFO] Using default encoding to copy filtered resources.
[INFO] [compiler:compile]
[INFO] Compiling 8 source files to /home/continuum/data/working-directory/51/core/cocoon-thread/cocoon-thread-impl/target/classes
[INFO] [resources:testResources]
[INFO] Using default encoding to copy filtered resources.
[INFO] [compiler:testCompile]
[INFO] Compiling 4 source files to /home/continuum/data/working-directory/51/core/cocoon-thread/cocoon-thread-impl/target/test-classes
[INFO] [surefire:test]
[INFO] Surefire report directory: /home/continuum/data/working-directory/51/core/cocoon-thread/cocoon-thread-impl/target/surefire-reports

-------------------------------------------------------
 T E S T S
-------------------------------------------------------
Running org.apache.cocoon.thread.impl.DefaultThreadPoolTestCase
log4j:WARN No appenders could be found for logger (org.apache.cocoon.thread.impl.DefaultThreadPool).
log4j:WARN Please initialize the log4j system properly.
Tests run: 3, Failures: 0, Errors: 0, Skipped: 0, Time elapsed: 0.874 sec
Running org.apache.cocoon.thread.impl.DefaultRunnableManagerTestCase
Tests run: 11, Failures: 0, Errors: 0, Skipped: 0, Time elapsed: 0.03 sec
Running org.apache.cocoon.thread.impl.DefaultThreadFactoryTestCase
Tests run: 5, Failures: 0, Errors: 0, Skipped: 0, Time elapsed: 0.012 sec

Results :

Tests run: 19, Failures: 0, Errors: 0, Skipped: 0

[INFO] [jar:jar]
[INFO] Building jar: /home/continuum/data/working-directory/51/core/cocoon-thread/cocoon-thread-impl/target/cocoon-thread-impl-1.0.0-RC3-SNAPSHOT.jar
[INFO] [install:install]
[INFO] Installing /home/continuum/data/working-directory/51/core/cocoon-thread/cocoon-thread-impl/target/cocoon-thread-impl-1.0.0-RC3-SNAPSHOT.jar to /home/continuum/.m2/repository/org/apache/cocoon/cocoon-thread-impl/1.0.0-RC3-SNAPSHOT/cocoon-thread-impl-1.0.0-RC3-SNAPSHOT.jar
[INFO] ----------------------------------------------------------------------------
[INFO] Building Cocoon Core
[INFO]    task-segment: [clean, install]
[INFO] ----------------------------------------------------------------------------
[INFO] [clean:clean]
[INFO] Deleting directory /home/continuum/data/working-directory/51/core/cocoon-core/target
[INFO] Deleting directory /home/continuum/data/working-directory/51/core/cocoon-core/target/classes
[INFO] Deleting directory /home/continuum/data/working-directory/51/core/cocoon-core/target/test-classes
[INFO] Deleting directory /home/continuum/data/working-directory/51/core/cocoon-core/target/site
[INFO] [enforcer:enforce-once {execution: enforce-maven}]
[INFO] [resources:resources]
[INFO] Using default encoding to copy filtered resources.
[INFO] [compiler:compile]
[INFO] Compiling 84 source files to /home/continuum/data/working-directory/51/core/cocoon-core/target/classes
[INFO] [resources:testResources]
[INFO] Using default encoding to copy filtered resources.
[INFO] [compiler:testCompile]
[INFO] Compiling 50 source files to /home/continuum/data/working-directory/51/core/cocoon-core/target/test-classes
[INFO] ------------------------------------------------------------------------
[ERROR] BUILD FAILURE
[INFO] ------------------------------------------------------------------------
[INFO] Compilation failure
/home/continuum/data/working-directory/51/core/cocoon-core/src/test/java/org/apache/cocoon/components/source/impl/CachingSourceTestCase.java:[204,15] cannot resolve symbol
symbol  : method enableLogging (org.apache.avalon.framework.logger.Logger)
location: class org.apache.cocoon.xml.LoggingContentHandler



/home/continuum/data/working-directory/51/core/cocoon-core/src/test/java/org/apache/cocoon/components/source/impl/CachingSourceTestCase.java:[204,15] cannot resolve symbol
symbol  : method enableLogging (org.apache.avalon.framework.logger.Logger)
location: class org.apache.cocoon.xml.LoggingContentHandler


[INFO] ------------------------------------------------------------------------
[INFO] For more information, run Maven with the -e switch
[INFO] ------------------------------------------------------------------------
[INFO] Total time: 3 minutes 2 seconds
[INFO] Finished at: Tue Oct 16 21:17:19 PDT 2007
[INFO] Final Memory: 99M/180M
[INFO] ------------------------------------------------------------------------

****************************************************************************



Mime
View raw message