cocoon-dev mailing list archives

Site index · List index
Message view « Date » · « Thread »
Top « Date » · « Thread »
From Continuum VMBuild Server <contin...@apache.org>
Subject [continuum] BUILD FAILURE: Apache Cocoon [build root]
Date Wed, 10 Oct 2007 16:02:48 GMT
Online report : http://vmbuild.apache.org/continuum/buildResult.action?buildId=11997&projectId=51

Build statistics:
  State: Failed
  Previous State: Failed
  Started at: Wed 10 Oct 2007 09:00:28 -0700
  Finished at: Wed 10 Oct 2007 09:02:09 -0700
  Total time: 1m 40s
  Build Trigger: Schedule
  Build Number: 44
  Exit code: 1
  Building machine hostname: vmbuild
  Operating system : Linux(unknown)
  Java Home version : 
          java version "1.4.2_15"
          Java(TM) 2 Runtime Environment, Standard Edition (build 1.4.2_15-b02)
          Java HotSpot(TM) Client VM (build 1.4.2_15-b02, mixed mode)
        
  Builder version :
          Maven version: 2.0.7
          Java version: 1.4.2_15
          OS name: "linux" version: "2.6.20-16-server" arch: "i386"
    
****************************************************************************
SCM Changes:
****************************************************************************
Changed: reinhard @ Wed 10 Oct 2007 08:23:28 -0700
Comment: configure javadocs plugin for the daily docs build on the cocoon.zone
Files changed:
  /cocoon/trunk/parent/pom.xml ( 583512 )

Changed: reinhard @ Wed 10 Oct 2007 08:24:10 -0700
Comment: fix relative path to parent
Files changed:
  /cocoon/trunk/blocks/pom.xml ( 583513 )

Changed: reinhard @ Wed 10 Oct 2007 08:41:38 -0700
Comment: revert deletion logic: only delete particular files that contain versioning information
Files changed:
  /cocoon/trunk/tools/cocoon-maven-docs-cleaner-plugin/src/main/java/org/apache/cocoon/maven/docscleaner/DocsCleanerMojo.java
( 583517 )

****************************************************************************
Dependencies Changes:
****************************************************************************
No dependencies changed


****************************************************************************
Build Defintion:
****************************************************************************
POM filename: pom.xml
Goals: clean install   
Arguments: --batch-mode -P allblocks
Build Fresh: false
Always Build: false
Default Build Definition: true
Schedule: DEFAULT_SCHEDULE
Profile Name: Java 1.4, Large Memory
Description: 


****************************************************************************
Test Summary:
****************************************************************************
Tests: 2307
Failures: 0
Total time: 47779

****************************************************************************
Output:
****************************************************************************
[INFO] Scanning for projects...
Downloading: http://repo1.maven.org/maven2/org/apache/cocoon/cocoon-tools-modules/5/cocoon-tools-modules-5.pom
[INFO] ------------------------------------------------------------------------
[ERROR] FATAL ERROR
[INFO] ------------------------------------------------------------------------
[INFO] Failed to resolve artifact.

GroupId: org.apache.cocoon
ArtifactId: cocoon-tools-modules
Version: 5

Reason: Unable to download the artifact from any repository

  org.apache.cocoon:cocoon-tools-modules:pom:5

from the specified remote repositories:
  central (http://repo1.maven.org/maven2)


[INFO] ------------------------------------------------------------------------
[INFO] Trace
org.apache.maven.reactor.MavenExecutionException: Cannot find parent: org.apache.cocoon:cocoon-tools-modules
for project: null:cocoon-maven-javadocs-script-report:maven-plugin:1.0.0-M2-SNAPSHOT for project
null:cocoon-maven-javadocs-script-report:maven-plugin:1.0.0-M2-SNAPSHOT
	at org.apache.maven.DefaultMaven.getProjects(DefaultMaven.java:378)
	at org.apache.maven.DefaultMaven.doExecute(DefaultMaven.java:290)
	at org.apache.maven.DefaultMaven.execute(DefaultMaven.java:125)
	at org.apache.maven.cli.MavenCli.main(MavenCli.java:280)
	at sun.reflect.NativeMethodAccessorImpl.invoke0(Native Method)
	at sun.reflect.NativeMethodAccessorImpl.invoke(NativeMethodAccessorImpl.java:39)
	at sun.reflect.DelegatingMethodAccessorImpl.invoke(DelegatingMethodAccessorImpl.java:25)
	at java.lang.reflect.Method.invoke(Method.java:324)
	at org.codehaus.classworlds.Launcher.launchEnhanced(Launcher.java:315)
	at org.codehaus.classworlds.Launcher.launch(Launcher.java:255)
	at org.codehaus.classworlds.Launcher.mainWithExitCode(Launcher.java:430)
	at org.codehaus.classworlds.Launcher.main(Launcher.java:375)
Caused by: org.apache.maven.project.ProjectBuildingException: Cannot find parent: org.apache.cocoon:cocoon-tools-modules
for project: null:cocoon-maven-javadocs-script-report:maven-plugin:1.0.0-M2-SNAPSHOT for project
null:cocoon-maven-javadocs-script-report:maven-plugin:1.0.0-M2-SNAPSHOT
	at org.apache.maven.project.DefaultMavenProjectBuilder.assembleLineage(DefaultMavenProjectBuilder.java:1261)
	at org.apache.maven.project.DefaultMavenProjectBuilder.buildInternal(DefaultMavenProjectBuilder.java:747)
	at org.apache.maven.project.DefaultMavenProjectBuilder.buildFromSourceFileInternal(DefaultMavenProjectBuilder.java:479)
	at org.apache.maven.project.DefaultMavenProjectBuilder.build(DefaultMavenProjectBuilder.java:200)
	at org.apache.maven.DefaultMaven.getProject(DefaultMaven.java:553)
	at org.apache.maven.DefaultMaven.collectProjects(DefaultMaven.java:467)
	at org.apache.maven.DefaultMaven.collectProjects(DefaultMaven.java:527)
	at org.apache.maven.DefaultMaven.collectProjects(DefaultMaven.java:527)
	at org.apache.maven.DefaultMaven.getProjects(DefaultMaven.java:364)
	... 11 more
Caused by: org.apache.maven.project.ProjectBuildingException: POM 'org.apache.cocoon:cocoon-tools-modules'
not found in repository: Unable to download the artifact from any repository

  org.apache.cocoon:cocoon-tools-modules:pom:5

from the specified remote repositories:
  central (http://repo1.maven.org/maven2)
 for project org.apache.cocoon:cocoon-tools-modules
	at org.apache.maven.project.DefaultMavenProjectBuilder.findModelFromRepository(DefaultMavenProjectBuilder.java:573)
	at org.apache.maven.project.DefaultMavenProjectBuilder.assembleLineage(DefaultMavenProjectBuilder.java:1257)
	... 19 more
Caused by: org.apache.maven.artifact.resolver.ArtifactNotFoundException: Unable to download
the artifact from any repository

  org.apache.cocoon:cocoon-tools-modules:pom:5

from the specified remote repositories:
  central (http://repo1.maven.org/maven2)

	at org.apache.maven.artifact.resolver.DefaultArtifactResolver.resolve(DefaultArtifactResolver.java:197)
	at org.apache.maven.artifact.resolver.DefaultArtifactResolver.resolve(DefaultArtifactResolver.java:73)
	at org.apache.maven.project.DefaultMavenProjectBuilder.findModelFromRepository(DefaultMavenProjectBuilder.java:526)
	... 20 more
Caused by: org.apache.maven.wagon.ResourceDoesNotExistException: Unable to download the artifact
from any repository
	at org.apache.maven.artifact.manager.DefaultWagonManager.getArtifact(DefaultWagonManager.java:324)
	at org.apache.maven.artifact.resolver.DefaultArtifactResolver.resolve(DefaultArtifactResolver.java:185)
	... 22 more
[INFO] ------------------------------------------------------------------------
[INFO] Total time: 1 minute 32 seconds
[INFO] Finished at: Wed Oct 10 09:02:08 PDT 2007
[INFO] Final Memory: 70M/126M
[INFO] ------------------------------------------------------------------------

****************************************************************************



Mime
View raw message