cocoon-dev mailing list archives

Site index · List index
Message view « Date » · « Thread »
Top « Date » · « Thread »
From Continuum VMBuild Server <contin...@apache.org>
Subject [continuum] BUILD FAILURE: Apache Cocoon [build root]
Date Wed, 17 Oct 2007 21:05:53 GMT
Online report : http://vmbuild.apache.org/continuum/buildResult.action?buildId=14378&projectId=51

Build statistics:
  State: Failed
  Previous State: Ok
  Started at: Wed 17 Oct 2007 14:00:44 -0700
  Finished at: Wed 17 Oct 2007 14:03:21 -0700
  Total time: 2m 36s
  Build Trigger: Schedule
  Build Number: 58
  Exit code: 1
  Building machine hostname: vmbuild.apache.org
  Operating system : Linux(unknown)
  Java Home version : 
          java version "1.4.2_15"
          Java(TM) 2 Runtime Environment, Standard Edition (build 1.4.2_15-b02)
          Java HotSpot(TM) Client VM (build 1.4.2_15-b02, mixed mode)
        
  Builder version :
          Maven version: 2.0.7
          Java version: 1.4.2_15
          OS name: "linux" version: "2.6.20-16-server" arch: "i386"
    
****************************************************************************
SCM Changes:
****************************************************************************
Changed: vgritsenko @ Wed 17 Oct 2007 13:11:29 -0700
Comment: switching to new AbstractLogEnabled.
fixing some obvious bugs.
Files changed:
  /cocoon/trunk/core/cocoon-pipeline/cocoon-pipeline-components/src/main/java/org/apache/cocoon/components/source/impl/ContextSourceFactory.java
( 585662 )
  /cocoon/trunk/core/cocoon-pipeline/cocoon-pipeline-components/src/main/java/org/apache/cocoon/components/source/impl/EmptySourceFactory.java
( 585662 )
  /cocoon/trunk/core/cocoon-pipeline/cocoon-pipeline-components/src/main/java/org/apache/cocoon/components/source/impl/ZipSource.java
( 585662 )
  /cocoon/trunk/core/cocoon-pipeline/cocoon-pipeline-components/src/main/java/org/apache/cocoon/components/source/impl/ZipSourceFactory.java
( 585662 )
  /cocoon/trunk/core/cocoon-pipeline/cocoon-pipeline-components/src/main/java/org/apache/cocoon/components/xslt/TraxErrorListener.java
( 585662 )
  /cocoon/trunk/core/cocoon-pipeline/cocoon-pipeline-components/src/main/java/org/apache/cocoon/components/xslt/TraxProcessor.java
( 585662 )
  /cocoon/trunk/core/cocoon-pipeline/cocoon-pipeline-impl/src/main/java/org/apache/cocoon/components/pipeline/impl/AbstractCachingProcessingPipeline.java
( 585662 )
  /cocoon/trunk/core/cocoon-pipeline/cocoon-pipeline-impl/src/main/java/org/apache/cocoon/components/pipeline/impl/BaseCachingProcessingPipeline.java
( 585662 )

Changed: vgritsenko @ Wed 17 Oct 2007 13:12:41 -0700
Comment: AbstractLogEnabled, etc.
Files changed:
  /cocoon/trunk/blocks/cocoon-profiler/cocoon-profiler-impl/src/main/java/org/apache/cocoon/components/profiler/ProfilerImpl.java
( 585663 )
  /cocoon/trunk/blocks/cocoon-profiler/cocoon-profiler-impl/src/main/java/org/apache/cocoon/profiler/debugging/Debugger.java
( 585663 )
  /cocoon/trunk/blocks/cocoon-profiler/cocoon-profiler-impl/src/main/java/org/apache/cocoon/profiler/debugging/RemoteDebuggingSitemapExecutor.java
( 585663 )
  /cocoon/trunk/blocks/cocoon-profiler/cocoon-profiler-impl/src/main/java/org/apache/cocoon/profiler/debugging/SimpleSitemapExecutor.java
( 585663 )
  /cocoon/trunk/blocks/cocoon-repository/cocoon-repository-impl/src/main/java/org/apache/cocoon/components/repository/RepositoryManager.java
( 585663 )
  /cocoon/trunk/blocks/cocoon-repository/cocoon-repository-impl/src/main/java/org/apache/cocoon/components/repository/SourceRepositoryImpl.java
( 585663 )
  /cocoon/trunk/blocks/cocoon-repository/cocoon-repository-impl/src/main/java/org/apache/cocoon/components/source/impl/AbstractConfigurableSourceInspector.java
( 585663 )
  /cocoon/trunk/blocks/cocoon-repository/cocoon-repository-impl/src/main/java/org/apache/cocoon/components/source/impl/AbstractImageSourceInspector.java
( 585663 )
  /cocoon/trunk/blocks/cocoon-repository/cocoon-repository-impl/src/main/java/org/apache/cocoon/components/source/impl/RepositorySource.java
( 585663 )
  /cocoon/trunk/blocks/cocoon-repository/cocoon-repository-impl/src/main/java/org/apache/cocoon/components/source/impl/RepositorySourceFactory.java
( 585663 )
  /cocoon/trunk/blocks/cocoon-repository/cocoon-repository-impl/src/main/java/org/apache/cocoon/components/source/impl/SourceDescriptorManager.java
( 585663 )
  /cocoon/trunk/blocks/cocoon-repository/cocoon-repository-impl/src/main/java/org/apache/cocoon/components/source/impl/XPathSourceInspector.java
( 585663 )

Changed: vgritsenko @ Wed 17 Oct 2007 13:13:18 -0700
Comment: indent/formatting
Files changed:
  /cocoon/trunk/core/cocoon-sitemap/cocoon-sitemap-api/src/main/java/org/apache/cocoon/components/flow/WebContinuation.java
( 585665 )
  /cocoon/trunk/core/cocoon-sitemap/cocoon-sitemap-impl/src/main/java/org/apache/cocoon/components/LifecycleHelper.java
( 585665 )
  /cocoon/trunk/core/cocoon-sitemap/cocoon-sitemap-impl/src/main/java/org/apache/cocoon/components/flow/ContinuationsManagerImpl.java
( 585665 )

****************************************************************************
Dependencies Changes:
****************************************************************************
No dependencies changed


****************************************************************************
Build Defintion:
****************************************************************************
POM filename: pom.xml
Goals: clean install   
Arguments: --batch-mode -P allblocks
Build Fresh: false
Always Build: false
Default Build Definition: true
Schedule: DEFAULT_SCHEDULE
Profile Name: Java 1.4, Large Memory
Description: 


****************************************************************************
Test Summary:
****************************************************************************
Tests: 280
Failures: 0
Total time: 55114

****************************************************************************
Output:
****************************************************************************
[INFO] Scanning for projects...
[INFO] Reactor build order: 
[INFO]   Apache Cocoon
[INFO]   Cocoon Configuration API
[INFO]   Cocoon Spring Configurator
[INFO]   Cocoon Core [modules]
[INFO]   Cocoon Pipeline API
[INFO]   Cocoon Util
[INFO]   Cocoon XML API
[INFO]   Cocoon Expression Language API
[INFO]   Cocoon Pipeline Implementation
[INFO]   Cocoon XML Implementation
[INFO]   Cocoon Pipeline Components
[INFO]   Cocoon Sitemap API
[INFO]   Cocoon XML Utilities
[INFO]   Cocoon Expression Language Implementation.
[INFO]   Cocoon Thread API
[INFO]   Cocoon Sitemap Implementation
[INFO]   Cocoon Sitemap Components
[INFO]   Cocoon XML Resolver
[INFO]   Cocoon Store Implementation
[INFO]   Cocoon Thread Implementation
[INFO]   Cocoon Core
[INFO]   Cocoon Servlet Service Implementation
[INFO]   Cocoon Blocks [modules]
[INFO]   Cocoon Linkrewriter Block Implementation
[INFO]   Cocoon Servlet Service Components
[INFO]   Cocoon Ajax Block Implementation
[INFO]   Cocoon Template Framework Block Implementation
[INFO]   Cocoon Samples Style Default Block
[INFO]   Cocoon Ajax Block Sample
[INFO]   Cocoon Apples Block Implementation
[INFO]   Session Framework Implementation
[INFO]   XSP Block Implementation
[INFO]   Cocoon Main Core Sample Block
[INFO]   Cocoon Flowscript Block Implementation
[INFO]   Cocoon Forms Block Implementation
[INFO]   Cocoon Apples Block Samples
[INFO]   Cocoon Additional Sample Block
[INFO]   Cocoon Batik Block Implementation
[INFO]   Cocoon Forms Block Samples
[INFO]   Cocoon Linkrewriter Block Samples
[INFO]   Cocoon Template Block Samples
[INFO]   Cocoon Batik Block Samples
[INFO]   Cocoon Tools [modules]
[INFO]   Cocoon Reloading ClassLoader - Spring reloader
[INFO]   Cocoon Reloading ClassLoader - Webapp Wrapper
[INFO]   Cocoon Maven 2 Plugin
[INFO]   Cocoon Welcome (Samples)
[INFO]   Asciiart Block Implementation
[INFO]   Asciiart Block Samples
[INFO]   cocoon-acegisecurity
[INFO]   Cocoon Authentication Block API
[INFO]   Cocoon Authentication Block Implementation
[INFO]   Cocoon Authentication Block Sample
[INFO]   Authentication Framework Implementation
[INFO]   Authentication Framework Sample Application
[INFO]   Axis Block Implementation
[INFO]   Axis Block Samples
[INFO]   Bsf Block Implementation
[INFO]   Bsf Block Samples
[INFO]   Cocoon Captcha Block Implementation
[INFO]   Cocoon Captcha Block Sample
[INFO]   Chaperon Block Implementation
[INFO]   Chaperon Block Samples
[INFO]   Cron block implementation
[INFO]   Cron Block Samples
[INFO]   Cocoon Database Block Mocks
[INFO]   Cocoon Database Block Implementation
[INFO]   Cocoon Hsqldb Server Block Implementation
[INFO]   Cocoon Hsqldb Client Implementation
[INFO]   Cocoon Databases Block Samples
[INFO]   Cocoon ODBC client Implementation
[INFO]   Cocoon Oracle client Implementation
[INFO]   Cocoon PostgreSQL client Implementation
[INFO]   Deli Block Implementation
[INFO]   Deli Block Samples
[INFO]   JMS Block Implementation
[INFO]   Eventcache Block Implementation
[INFO]   Eventcache Block Samples
[INFO]   Taglib Block Implementation
[INFO]   Portal Block [modules]
[INFO]   Portal Block API
[INFO]   Cocoon Serializers Charsets
[INFO]   Portal Block Implementation
[INFO]   Faces Block Implementation
[INFO]   Faces Block Samples
[INFO]   Cocoon FOP Block Implementation
[INFO]   Cocoon FOP Block Samples
[INFO]   Cocoon FOP 0.9x Block Implementation
[INFO]   Cocoon FOP 0.9x Block Samples
[INFO]   Cocoon HTML Block Implementation
[INFO]   Cocoon Html Block Sample
[INFO]   Image Operation Block Implementation
[INFO]   Image Operation Block Samples
[INFO]   Itext Block Implementation
[INFO]   Itext Block Samples
[INFO]   Javaflow Block
[INFO]   Javaflow Block Samples
[INFO]   Jfor Block Implementation
[INFO]   Jfor Block Samples
[INFO]   JMS Block Samples
[INFO]   Jsp Block Mocks
[INFO]   Jsp Block Implementation
[INFO]   Jsp Block Samples
[INFO]   Lucene Block Implementation
[INFO]   Lucene Block Samples
[INFO]   Cocoon Mail Block Implementation
[INFO]   Cocoon Mail Block Sample
[INFO]   Midi Block Implementation
[INFO]   Midi Block Samples
[INFO]   Naming Block Implementation
[INFO]   Naming Block Samples
[INFO]   Ojb Block Mocks
[INFO]   Ojb Block Implementation
[INFO]   Querybean Block Implementation
[INFO]   Ojb Block Samples
[INFO]   Petstore Block Implementation
[INFO]   Velocity Block [modules]
[INFO]   Velocity Block Implementation
[INFO]   Petstore Block Samples
[INFO]   Poi Block Implementation
[INFO]   Poi Block Samples
[INFO]   Portal Block CAuth Support
[INFO]   Portal Block Bridges Implementation
[INFO]   Cocoon Serializers Block Implementation
[INFO]   Portal Block Sitemap
[INFO]   Portal Block Portlet Implementation
[INFO]   Portal Block Portlet Implementation
[INFO]   Portal Block WSRP Implementation
[INFO]   Portal Tools Block Implementation
[INFO]   Portal Block Sample
[INFO]   Profiler Block
[INFO]   Profiler Block Samples
[INFO]   Proxy Block Implementation
[INFO]   Proxy Block Samples
[INFO]   Python Block Mocks
[INFO]   Python Block Implementation
[INFO]   Qdox Block Implementation
[INFO]   Qdox Block Samples
[INFO]   Querybean Block Samples
[INFO]   Repository Block Implementation
[INFO]   Scratchpad Block Implementation
[INFO]   Scratchpad Block Samples
[INFO]   Session Framework Sample Application
[INFO]   Slide Block Implementation
[INFO]   Slide Block Samples
[INFO]   Slop Block Implementation
[INFO]   Slop Block Samples
[INFO]   Stx Block Implementation
[INFO]   Stx Block Samples
[INFO]   Taglib Block Samples
[INFO]   Tour Block [modules]
[INFO]   Tour Block Implementation
[INFO]   Tour Block Samples
[INFO]   Validation Block [modules]
[INFO]   Validation Block Implementation
[INFO]   Validation Block Sample
[INFO]   Velocity Block Samples
[INFO]   Web3 Block [modules]
[INFO]   Web3 Block Mocks
[INFO]   Web3 Block Implementation
[INFO]   Web3 Block Samples
[INFO]   Webdav Block [modules]
[INFO]   Webdav Block Implementation
[INFO]   Webdav Block Samples
[INFO]   XMLDB Block's Implementation
[INFO]   XMLDB Block's Samples
[INFO]   XSP Block Samples
[INFO]   Cocoon Licenses
[INFO]   Cocoon Commons [modules]
[INFO]   Cocoon Servlet Service Sample Blocks
[INFO]   Cocoon Webapp
[INFO]   Cocoon 2.2 Archetype: Block
[INFO]   Cocoon 2.2 Archetype: Block (plain)
[INFO]   Cocoon 2.2 Archetype: Web Application
[INFO]   Cocoon Maven Reports
[INFO]   Cocoon Maven Javadocs Script Report
[INFO]   Cocoon Maven Javadocs Script Report
[INFO]   Cocoon Distributions [modules]
[INFO]   Apache Cocoon [build root]
[INFO] ----------------------------------------------------------------------------
[INFO] Building Apache Cocoon
[INFO]    task-segment: [clean, install]
[INFO] ----------------------------------------------------------------------------
[INFO] [clean:clean]
[INFO] Deleting directory /home/continuum/data/working-directory/51/parent/target
[INFO] Deleting directory /home/continuum/data/working-directory/51/parent/target/classes
[INFO] Deleting directory /home/continuum/data/working-directory/51/parent/target/test-classes
[INFO] Deleting directory /home/continuum/data/working-directory/51/parent/target/site
[INFO] [enforcer:enforce-once {execution: enforce-maven}]
[INFO] [site:attach-descriptor]
[INFO] [install:install]
[INFO] Installing /home/continuum/data/working-directory/51/parent/pom.xml to /home/continuum/.m2/repository/org/apache/cocoon/cocoon/6-SNAPSHOT/cocoon-6-SNAPSHOT.pom
[INFO] ----------------------------------------------------------------------------
[INFO] Building Cocoon Configuration API
[INFO]    task-segment: [clean, install]
[INFO] ----------------------------------------------------------------------------
[INFO] [clean:clean]
[INFO] Deleting directory /home/continuum/data/working-directory/51/core/cocoon-configuration/cocoon-configuration-api/target
[INFO] Deleting directory /home/continuum/data/working-directory/51/core/cocoon-configuration/cocoon-configuration-api/target/classes
[INFO] Deleting directory /home/continuum/data/working-directory/51/core/cocoon-configuration/cocoon-configuration-api/target/test-classes
[INFO] Deleting directory /home/continuum/data/working-directory/51/core/cocoon-configuration/cocoon-configuration-api/target/site
[INFO] [enforcer:enforce-once {execution: enforce-maven}]
[INFO] [resources:resources]
[INFO] Using default encoding to copy filtered resources.
[INFO] [compiler:compile]
[INFO] Compiling 5 source files to /home/continuum/data/working-directory/51/core/cocoon-configuration/cocoon-configuration-api/target/classes
[INFO] [resources:testResources]
[INFO] Using default encoding to copy filtered resources.
[INFO] [compiler:testCompile]
[INFO] No sources to compile
[INFO] [surefire:test]
[INFO] No tests to run.
[INFO] [jar:jar]
[INFO] Building jar: /home/continuum/data/working-directory/51/core/cocoon-configuration/cocoon-configuration-api/target/cocoon-configuration-api-1.0.2-SNAPSHOT.jar
[INFO] [install:install]
[INFO] Installing /home/continuum/data/working-directory/51/core/cocoon-configuration/cocoon-configuration-api/target/cocoon-configuration-api-1.0.2-SNAPSHOT.jar
to /home/continuum/.m2/repository/org/apache/cocoon/cocoon-configuration-api/1.0.2-SNAPSHOT/cocoon-configuration-api-1.0.2-SNAPSHOT.jar
[INFO] ----------------------------------------------------------------------------
[INFO] Building Cocoon Spring Configurator
[INFO]    task-segment: [clean, install]
[INFO] ----------------------------------------------------------------------------
[INFO] [clean:clean]
[INFO] Deleting directory /home/continuum/data/working-directory/51/core/cocoon-configuration/cocoon-spring-configurator/target
[INFO] Deleting directory /home/continuum/data/working-directory/51/core/cocoon-configuration/cocoon-spring-configurator/target/classes
[INFO] Deleting directory /home/continuum/data/working-directory/51/core/cocoon-configuration/cocoon-spring-configurator/target/test-classes
[INFO] Deleting directory /home/continuum/data/working-directory/51/core/cocoon-configuration/cocoon-spring-configurator/target/site
[INFO] [enforcer:enforce-once {execution: enforce-maven}]
[INFO] [resources:resources]
[INFO] Using default encoding to copy filtered resources.
[INFO] [compiler:compile]
[INFO] Compiling 22 source files to /home/continuum/data/working-directory/51/core/cocoon-configuration/cocoon-spring-configurator/target/classes
[INFO] [resources:testResources]
[INFO] Using default encoding to copy filtered resources.
[INFO] [compiler:testCompile]
[INFO] No sources to compile
[INFO] [surefire:test]
[INFO] No tests to run.
[INFO] [jar:jar]
[INFO] Building jar: /home/continuum/data/working-directory/51/core/cocoon-configuration/cocoon-spring-configurator/target/cocoon-spring-configurator-1.0.2-SNAPSHOT.jar
[INFO] [install:install]
[INFO] Installing /home/continuum/data/working-directory/51/core/cocoon-configuration/cocoon-spring-configurator/target/cocoon-spring-configurator-1.0.2-SNAPSHOT.jar
to /home/continuum/.m2/repository/org/apache/cocoon/cocoon-spring-configurator/1.0.2-SNAPSHOT/cocoon-spring-configurator-1.0.2-SNAPSHOT.jar
[INFO] ----------------------------------------------------------------------------
[INFO] Building Cocoon Core [modules]
[INFO]    task-segment: [clean, install]
[INFO] ----------------------------------------------------------------------------
[INFO] [clean:clean]
[INFO] Deleting directory /home/continuum/data/working-directory/51/core/target
[INFO] Deleting directory /home/continuum/data/working-directory/51/core/target/classes
[INFO] Deleting directory /home/continuum/data/working-directory/51/core/target/test-classes
[INFO] Deleting directory /home/continuum/data/working-directory/51/core/target/site
[INFO] [enforcer:enforce-once {execution: enforce-maven}]
[INFO] [site:attach-descriptor]
[INFO] [install:install]
[INFO] Installing /home/continuum/data/working-directory/51/core/pom.xml to /home/continuum/.m2/repository/org/apache/cocoon/cocoon-core-modules/6-SNAPSHOT/cocoon-core-modules-6-SNAPSHOT.pom
[INFO] ----------------------------------------------------------------------------
[INFO] Building Cocoon Pipeline API
[INFO]    task-segment: [clean, install]
[INFO] ----------------------------------------------------------------------------
[INFO] [clean:clean]
[INFO] Deleting directory /home/continuum/data/working-directory/51/core/cocoon-pipeline/cocoon-pipeline-api/target
[INFO] Deleting directory /home/continuum/data/working-directory/51/core/cocoon-pipeline/cocoon-pipeline-api/target/classes
[INFO] Deleting directory /home/continuum/data/working-directory/51/core/cocoon-pipeline/cocoon-pipeline-api/target/test-classes
[INFO] Deleting directory /home/continuum/data/working-directory/51/core/cocoon-pipeline/cocoon-pipeline-api/target/site
[INFO] [enforcer:enforce-once {execution: enforce-maven}]
[INFO] [resources:resources]
[INFO] Using default encoding to copy filtered resources.
[INFO] [compiler:compile]
[INFO] Compiling 45 source files to /home/continuum/data/working-directory/51/core/cocoon-pipeline/cocoon-pipeline-api/target/classes
[INFO] [resources:testResources]
[INFO] Using default encoding to copy filtered resources.
[INFO] [compiler:testCompile]
[INFO] Compiling 1 source file to /home/continuum/data/working-directory/51/core/cocoon-pipeline/cocoon-pipeline-api/target/test-classes
[INFO] [surefire:test]
[INFO] Surefire report directory: /home/continuum/data/working-directory/51/core/cocoon-pipeline/cocoon-pipeline-api/target/surefire-reports

-------------------------------------------------------
 T E S T S
-------------------------------------------------------
Running org.apache.cocoon.util.location.LocationTestCase
Tests run: 3, Failures: 0, Errors: 0, Skipped: 0, Time elapsed: 0.082 sec

Results :

Tests run: 3, Failures: 0, Errors: 0, Skipped: 0

[INFO] [jar:jar]
[INFO] Building jar: /home/continuum/data/working-directory/51/core/cocoon-pipeline/cocoon-pipeline-api/target/cocoon-pipeline-api-1.0.0-RC3-SNAPSHOT.jar
[INFO] [install:install]
[INFO] Installing /home/continuum/data/working-directory/51/core/cocoon-pipeline/cocoon-pipeline-api/target/cocoon-pipeline-api-1.0.0-RC3-SNAPSHOT.jar
to /home/continuum/.m2/repository/org/apache/cocoon/cocoon-pipeline-api/1.0.0-RC3-SNAPSHOT/cocoon-pipeline-api-1.0.0-RC3-SNAPSHOT.jar
[INFO] ----------------------------------------------------------------------------
[INFO] Building Cocoon Util
[INFO]    task-segment: [clean, install]
[INFO] ----------------------------------------------------------------------------
[INFO] [clean:clean]
[INFO] Deleting directory /home/continuum/data/working-directory/51/core/cocoon-util/target
[INFO] Deleting directory /home/continuum/data/working-directory/51/core/cocoon-util/target/classes
[INFO] Deleting directory /home/continuum/data/working-directory/51/core/cocoon-util/target/test-classes
[INFO] Deleting directory /home/continuum/data/working-directory/51/core/cocoon-util/target/site
[INFO] [enforcer:enforce-once {execution: enforce-maven}]
[INFO] [resources:resources]
[INFO] Using default encoding to copy filtered resources.
[INFO] [compiler:compile]
[INFO] Compiling 24 source files to /home/continuum/data/working-directory/51/core/cocoon-util/target/classes
[INFO] [resources:testResources]
[INFO] Using default encoding to copy filtered resources.
[INFO] [compiler:testCompile]
[INFO] Compiling 5 source files to /home/continuum/data/working-directory/51/core/cocoon-util/target/test-classes
[INFO] [surefire:test]
[INFO] Surefire report directory: /home/continuum/data/working-directory/51/core/cocoon-util/target/surefire-reports

-------------------------------------------------------
 T E S T S
-------------------------------------------------------
Running org.apache.cocoon.util.test.DeprecationTestCase
Tests run: 8, Failures: 0, Errors: 0, Skipped: 0, Time elapsed: 0.071 sec
Running org.apache.cocoon.util.test.IOUtilsTestCase
Tests run: 2, Failures: 0, Errors: 0, Skipped: 0, Time elapsed: 0.06 sec
Running org.apache.cocoon.util.test.NetUtilsTestCase
Tests run: 8, Failures: 0, Errors: 0, Skipped: 0, Time elapsed: 0.018 sec
Running org.apache.cocoon.util.test.MIMEUtilsTestCase
Tests run: 1, Failures: 0, Errors: 0, Skipped: 0, Time elapsed: 0.01 sec
Running org.apache.cocoon.util.WildcardMatcherHelperTestCase
Tests run: 40, Failures: 0, Errors: 0, Skipped: 0, Time elapsed: 0.073 sec

Results :

Tests run: 59, Failures: 0, Errors: 0, Skipped: 0

[INFO] [jar:jar]
[INFO] Building jar: /home/continuum/data/working-directory/51/core/cocoon-util/target/cocoon-util-1.0.0-RC3-SNAPSHOT.jar
[INFO] [install:install]
[INFO] Installing /home/continuum/data/working-directory/51/core/cocoon-util/target/cocoon-util-1.0.0-RC3-SNAPSHOT.jar
to /home/continuum/.m2/repository/org/apache/cocoon/cocoon-util/1.0.0-RC3-SNAPSHOT/cocoon-util-1.0.0-RC3-SNAPSHOT.jar
[INFO] ----------------------------------------------------------------------------
[INFO] Building Cocoon XML API
[INFO]    task-segment: [clean, install]
[INFO] ----------------------------------------------------------------------------
[INFO] [clean:clean]
[INFO] Deleting directory /home/continuum/data/working-directory/51/core/cocoon-xml/cocoon-xml-api/target
[INFO] Deleting directory /home/continuum/data/working-directory/51/core/cocoon-xml/cocoon-xml-api/target/classes
[INFO] Deleting directory /home/continuum/data/working-directory/51/core/cocoon-xml/cocoon-xml-api/target/test-classes
[INFO] Deleting directory /home/continuum/data/working-directory/51/core/cocoon-xml/cocoon-xml-api/target/site
[INFO] [enforcer:enforce-once {execution: enforce-maven}]
[INFO] [resources:resources]
[INFO] Using default encoding to copy filtered resources.
[INFO] [compiler:compile]
[INFO] Compiling 2 source files to /home/continuum/data/working-directory/51/core/cocoon-xml/cocoon-xml-api/target/classes
[INFO] [resources:testResources]
[INFO] Using default encoding to copy filtered resources.
[INFO] [compiler:testCompile]
[INFO] No sources to compile
[INFO] [surefire:test]
[INFO] No tests to run.
[INFO] [jar:jar]
[INFO] Building jar: /home/continuum/data/working-directory/51/core/cocoon-xml/cocoon-xml-api/target/cocoon-xml-api-1.0.0-RC3-SNAPSHOT.jar
[INFO] [install:install]
[INFO] Installing /home/continuum/data/working-directory/51/core/cocoon-xml/cocoon-xml-api/target/cocoon-xml-api-1.0.0-RC3-SNAPSHOT.jar
to /home/continuum/.m2/repository/org/apache/cocoon/cocoon-xml-api/1.0.0-RC3-SNAPSHOT/cocoon-xml-api-1.0.0-RC3-SNAPSHOT.jar
[INFO] ----------------------------------------------------------------------------
[INFO] Building Cocoon Expression Language API
[INFO]    task-segment: [clean, install]
[INFO] ----------------------------------------------------------------------------
[INFO] [clean:clean]
[INFO] Deleting directory /home/continuum/data/working-directory/51/core/cocoon-expression-language/cocoon-expression-language-api/target
[INFO] Deleting directory /home/continuum/data/working-directory/51/core/cocoon-expression-language/cocoon-expression-language-api/target/classes
[INFO] Deleting directory /home/continuum/data/working-directory/51/core/cocoon-expression-language/cocoon-expression-language-api/target/test-classes
[INFO] Deleting directory /home/continuum/data/working-directory/51/core/cocoon-expression-language/cocoon-expression-language-api/target/site
[INFO] [enforcer:enforce-once {execution: enforce-maven}]
[INFO] [resources:resources]
[INFO] Using default encoding to copy filtered resources.
[INFO] [compiler:compile]
[INFO] Compiling 8 source files to /home/continuum/data/working-directory/51/core/cocoon-expression-language/cocoon-expression-language-api/target/classes
[INFO] [resources:testResources]
[INFO] Using default encoding to copy filtered resources.
[INFO] [compiler:testCompile]
[INFO] No sources to compile
[INFO] [surefire:test]
[INFO] No tests to run.
[INFO] [jar:jar]
[INFO] Building jar: /home/continuum/data/working-directory/51/core/cocoon-expression-language/cocoon-expression-language-api/target/cocoon-expression-language-api-1.0.0-RC3-SNAPSHOT.jar
[INFO] [install:install]
[INFO] Installing /home/continuum/data/working-directory/51/core/cocoon-expression-language/cocoon-expression-language-api/target/cocoon-expression-language-api-1.0.0-RC3-SNAPSHOT.jar
to /home/continuum/.m2/repository/org/apache/cocoon/cocoon-expression-language-api/1.0.0-RC3-SNAPSHOT/cocoon-expression-language-api-1.0.0-RC3-SNAPSHOT.jar
[INFO] ----------------------------------------------------------------------------
[INFO] Building Cocoon Pipeline Implementation
[INFO]    task-segment: [clean, install]
[INFO] ----------------------------------------------------------------------------
[INFO] [clean:clean]
[INFO] Deleting directory /home/continuum/data/working-directory/51/core/cocoon-pipeline/cocoon-pipeline-impl/target
[INFO] Deleting directory /home/continuum/data/working-directory/51/core/cocoon-pipeline/cocoon-pipeline-impl/target/classes
[INFO] Deleting directory /home/continuum/data/working-directory/51/core/cocoon-pipeline/cocoon-pipeline-impl/target/test-classes
[INFO] Deleting directory /home/continuum/data/working-directory/51/core/cocoon-pipeline/cocoon-pipeline-impl/target/site
[INFO] [enforcer:enforce-once {execution: enforce-maven}]
[INFO] [resources:resources]
[INFO] Using default encoding to copy filtered resources.
[INFO] [compiler:compile]
[INFO] Compiling 89 source files to /home/continuum/data/working-directory/51/core/cocoon-pipeline/cocoon-pipeline-impl/target/classes
[INFO] [resources:testResources]
[INFO] Using default encoding to copy filtered resources.
[INFO] [compiler:testCompile]
[INFO] Compiling 8 source files to /home/continuum/data/working-directory/51/core/cocoon-pipeline/cocoon-pipeline-impl/target/test-classes
[INFO] [surefire:test]
[INFO] Surefire report directory: /home/continuum/data/working-directory/51/core/cocoon-pipeline/cocoon-pipeline-impl/target/surefire-reports

-------------------------------------------------------
 T E S T S
-------------------------------------------------------
Running org.apache.cocoon.xml.SaxBufferTestCase
consuming: 400000.0 documents per second
parsed:8312.0 documents per second
recalling: 769230.0 documents per second
Tests run: 3, Failures: 0, Errors: 0, Skipped: 0, Time elapsed: 1.369 sec
Running org.apache.cocoon.xml.dom.DOMBuilderTestCase
Tests run: 1, Failures: 0, Errors: 0, Skipped: 0, Time elapsed: 0.04 sec
Running org.apache.cocoon.components.sax.XMLByteStreamCompilerInterpreterTestCase
consuming: 217391.0 documents per second
parsed: 13140.0 documents per second
recalling: 217391.0 documents per second
Tests run: 4, Failures: 0, Errors: 0, Skipped: 0, Time elapsed: 0.965 sec
Running org.apache.cocoon.xml.dom.DOMBuilderStreamerTestCase
<?xml version="1.0" encoding="UTF-8"?>
<root/>
<?xml version="1.0" encoding="UTF-8"?>
<!--abcd--><root/>
Tests run: 7, Failures: 0, Errors: 0, Skipped: 0, Time elapsed: 0.049 sec

Results :

Tests run: 15, Failures: 0, Errors: 0, Skipped: 0

[INFO] [jar:jar]
[INFO] Building jar: /home/continuum/data/working-directory/51/core/cocoon-pipeline/cocoon-pipeline-impl/target/cocoon-pipeline-impl-1.0.0-RC3-SNAPSHOT.jar
[INFO] [jar:test-jar {execution: default}]
[INFO] Building jar: /home/continuum/data/working-directory/51/core/cocoon-pipeline/cocoon-pipeline-impl/target/cocoon-pipeline-impl-1.0.0-RC3-SNAPSHOT-tests.jar
[INFO] [install:install]
[INFO] Installing /home/continuum/data/working-directory/51/core/cocoon-pipeline/cocoon-pipeline-impl/target/cocoon-pipeline-impl-1.0.0-RC3-SNAPSHOT.jar
to /home/continuum/.m2/repository/org/apache/cocoon/cocoon-pipeline-impl/1.0.0-RC3-SNAPSHOT/cocoon-pipeline-impl-1.0.0-RC3-SNAPSHOT.jar
[INFO] Installing /home/continuum/data/working-directory/51/core/cocoon-pipeline/cocoon-pipeline-impl/target/cocoon-pipeline-impl-1.0.0-RC3-SNAPSHOT-tests.jar
to /home/continuum/.m2/repository/org/apache/cocoon/cocoon-pipeline-impl/1.0.0-RC3-SNAPSHOT/cocoon-pipeline-impl-1.0.0-RC3-SNAPSHOT-tests.jar
[INFO] ----------------------------------------------------------------------------
[INFO] Building Cocoon XML Implementation
[INFO]    task-segment: [clean, install]
[INFO] ----------------------------------------------------------------------------
[INFO] [clean:clean]
[INFO] Deleting directory /home/continuum/data/working-directory/51/core/cocoon-xml/cocoon-xml-impl/target
[INFO] Deleting directory /home/continuum/data/working-directory/51/core/cocoon-xml/cocoon-xml-impl/target/classes
[INFO] Deleting directory /home/continuum/data/working-directory/51/core/cocoon-xml/cocoon-xml-impl/target/test-classes
[INFO] Deleting directory /home/continuum/data/working-directory/51/core/cocoon-xml/cocoon-xml-impl/target/site
[INFO] [enforcer:enforce-once {execution: enforce-maven}]
[INFO] [resources:resources]
[INFO] Using default encoding to copy filtered resources.
[INFO] [compiler:compile]
[INFO] Compiling 4 source files to /home/continuum/data/working-directory/51/core/cocoon-xml/cocoon-xml-impl/target/classes
[INFO] [resources:testResources]
[INFO] Using default encoding to copy filtered resources.
[INFO] [compiler:testCompile]
[INFO] No sources to compile
[INFO] [surefire:test]
[INFO] No tests to run.
[INFO] [jar:jar]
[INFO] Building jar: /home/continuum/data/working-directory/51/core/cocoon-xml/cocoon-xml-impl/target/cocoon-xml-impl-1.0.0-RC3-SNAPSHOT.jar
[INFO] [install:install]
[INFO] Installing /home/continuum/data/working-directory/51/core/cocoon-xml/cocoon-xml-impl/target/cocoon-xml-impl-1.0.0-RC3-SNAPSHOT.jar
to /home/continuum/.m2/repository/org/apache/cocoon/cocoon-xml-impl/1.0.0-RC3-SNAPSHOT/cocoon-xml-impl-1.0.0-RC3-SNAPSHOT.jar
[INFO] ----------------------------------------------------------------------------
[INFO] Building Cocoon Pipeline Components
[INFO]    task-segment: [clean, install]
[INFO] ----------------------------------------------------------------------------
[INFO] [clean:clean]
[INFO] Deleting directory /home/continuum/data/working-directory/51/core/cocoon-pipeline/cocoon-pipeline-components/target
[INFO] Deleting directory /home/continuum/data/working-directory/51/core/cocoon-pipeline/cocoon-pipeline-components/target/classes
[INFO] Deleting directory /home/continuum/data/working-directory/51/core/cocoon-pipeline/cocoon-pipeline-components/target/test-classes
[INFO] Deleting directory /home/continuum/data/working-directory/51/core/cocoon-pipeline/cocoon-pipeline-components/target/site
[INFO] [enforcer:enforce-once {execution: enforce-maven}]
[INFO] [resources:resources]
[INFO] Using default encoding to copy filtered resources.
[INFO] [compiler:compile]
[INFO] Compiling 69 source files to /home/continuum/data/working-directory/51/core/cocoon-pipeline/cocoon-pipeline-components/target/classes
[INFO] ------------------------------------------------------------------------
[ERROR] BUILD FAILURE
[INFO] ------------------------------------------------------------------------
[INFO] Compilation failure

/home/continuum/data/working-directory/51/core/cocoon-pipeline/cocoon-pipeline-components/src/main/java/org/apache/cocoon/transformation/XSLTTransformer.java:[393,29]
cannot resolve symbol
symbol  : constructor TraxErrorListener (org.apache.avalon.framework.logger.Logger,java.lang.String)
location: class org.apache.cocoon.components.xslt.TraxErrorListener

/home/continuum/data/working-directory/51/core/cocoon-pipeline/cocoon-pipeline-components/src/main/java/org/apache/cocoon/transformation/TraxTransformer.java:[394,29]
cannot resolve symbol
symbol  : constructor TraxErrorListener (org.apache.avalon.framework.logger.Logger,java.lang.String)
location: class org.apache.cocoon.components.xslt.TraxErrorListener


[INFO] ------------------------------------------------------------------------
[INFO] For more information, run Maven with the -e switch
[INFO] ------------------------------------------------------------------------
[INFO] Total time: 1 minute 58 seconds
[INFO] Finished at: Wed Oct 17 14:03:20 PDT 2007
[INFO] Final Memory: 92M/165M
[INFO] ------------------------------------------------------------------------

****************************************************************************



Mime
View raw message